{"text_format":"1","workbook":"xlsx","n_sheets":21,"sheets":["MENU1","MENU2","CAD","COM","mod1 6b","mod1 1b","mod1 anexo","mod2 6b","mod2 1b","mod 3","mod 4","mod 5","mod 6","mod 7","mod 8","mod 9","mod10 3q","mod10 1q","Anexo1mod10","INCO","Protocolo"],"not_rendered":{"charts":0,"images":2,"macros":1,"external_links":0,"defined_names":28,"comments":0,"pivot_tables":0},"unopened":[],"bounds":{"document_bytes":16777216,"sheet_cells":100000,"rows_first":2000,"rows_last":500,"rows_between":2000,"halvings":0,"cell_chars":16384,"cell_head_chars":4096},"cells_cut":0,"cells_raw":0,"read":"whole","date_system":"1900"}

{"sheet":"MENU1","index":0,"n_rows":22,"n_cols":8,"rows_kept":22,"cut":false,"hidden":false,"merged":[[2,3,4,12],[10,1,10,5],[10,7,10,12],[6,1,8,12]]}
[]
[]
[null,null,null,"TRIBUNAL DE CONTAS DO ESTADO DE SÃO PAULO"]
[]
[]
[]
[null,"Planilha geradora dos Relatórios e Demonstrativos Bimestrais e Quadrimestrais exigidos pela Lei Complementar 101/00 - LRF - Versão 2008 -  atualizada em março de 2008 apenas para fins de publicação"]
[]
[]
[]
[null,"    1. Município/Poder",null,null,null,null,null,"   2. Período de Referência"]
[]
[null,null,null,null,null,null,null,"   Período de Referência:"]
[]
[null,null,null,null,null,null,null,"   Exercício de: "]
[]
[]
[null,"              - Relatórios LRF.",null,null,null,null,null,"              -  Imprimir Relatórios Bimestrais."]
[null,null,null,null,null,null,null,"              -  Imprimir Relatórios do Último Bimestre."]
[null,null,null,null,null,null,null,"              -  Imprimir Relatórios Quadrimestrais."]
[]
[null,"              - Antes de imprimir (botões 6, 7 ou 8) verifique se os Relatórios estão montados!"]

{"sheet":"MENU2","index":1,"n_rows":18,"n_cols":8,"rows_kept":18,"cut":false,"hidden":false,"merged":[[2,3,4,12],[19,1,19,12],[14,7,14,12],[10,1,10,5],[10,7,10,12],[6,1,8,12]]}
[]
[]
[null,null,null,"TRIBUNAL DE CONTAS DO ESTADO DE SÃO PAULO"]
[]
[]
[]
[null,"Clique nos botões para digitar os dados relativos a cada relatório, conforme a periodicidade exigida e, após, clique em voltar. "]
[]
[]
[]
[null," 3.1 Relatórios Bimestrais",null,null,null,null,null," 3.2 Relatórios do Último Bimestre"]
[null,"                  - RREO (06 Bimestres)",null,null,null,null,null,"                   - Operações de Crédito x Desp. de Capital"]
[null,"                  - Anexo ao RREO",null,null,null,null,null,"                   - Projeções atuariais do Reg. Própr. Previd."]
[null,"                  - Função/Subfunção (06 Bimestres)",null,null,null,null,null,"                   - Var. Patrimoniais, Alienações x Aplicações"]
[null,"                  - Receita Corrente Líquida",null,null,null,null,null," 3.3 Relatórios Quadrimestrais"]
[null,"                  - Receitas e Desp. Previdenciárias",null,null,null,null,null,"                   - Relatório de Gestão Fiscal (03 Quadrim.)"]
[null,"                  - Resultados Nominal e Primário",null,null,null,null,null,"                   - Anexo 1 - Despesas com Pessoal"]
[null,"                  - Restos a Pagar"]

{"sheet":"CAD","index":2,"n_rows":658,"n_cols":4,"rows_kept":658,"cut":false,"hidden":false,"merged":[[4,2,5,9]]}
[]
[]
[]
[null,null,"CADASTRO DE MUNICÍPIOS:"]
[null,null,"Caso não esteja relacionado o nome do seu Município, inclua-o na linha \"1\" e clique em Classificar."]
[]
[]
[]
[null,null,1,"TAUBATÉ  -  FUNDAÇÃO UNIVERSITÁRIA DE TAUBATÉ"]
[null,null,{"$f":"C9+1","v":2},"ADAMANTINA"]
[null,null,{"$f":"C10+1","v":3},"ADOLFO"]
[null,null,4,"AGUAI"]
[null,null,5,"AGUAS DA PRATA"]
[null,null,6,"AGUAS DE LINDOIA"]
[null,null,7,"AGUAS DE SANTA BARBARA"]
[null,null,8,"AGUAS DE SAO PEDRO"]
[null,null,9,"AGUDOS"]
[null,null,10,"ALAMBARI"]
[null,null,11,"ALFREDO MARCONDES"]
[null,null,12,"ALTAIR"]
[null,null,13,"ALTINOPOLIS"]
[null,null,14,"ALTO ALEGRE"]
[null,null,15,"ALUMINIO"]
[null,null,16,"ALVARES FLORENCE"]
[null,null,17,"ALVARES MACHADO"]
[null,null,18,"ALVARO DE CARVALHO"]
[null,null,19,"ALVINLANDIA"]
[null,null,20,"AMERICANA"]
[null,null,21,"AMERICO BRASILIENSE"]
[null,null,22,"AMERICO DE CAMPOS"]
[null,null,23,"AMPARO"]
[null,null,24,"ANALANDIA"]
[null,null,25,"ANDRADINA"]
[null,null,26,"ANGATUBA"]
[null,null,27,"ANHEMBI"]
[null,null,28,"ANHUMAS"]
[null,null,29,"APARECIDA"]
[null,null,30,"APARECIDA D´OESTE"]
[null,null,31,"APIAI"]
[null,null,32,"ARACARIGUAMA"]
[null,null,33,"ARACATUBA"]
[null,null,34,"ARACOIABA DA SERRA"]
[null,null,35,"ARAMINA"]
[null,null,36,"ARANDU"]
[null,null,37,"ARAPEI"]
[null,null,38,"ARARAQUARA"]
[null,null,39,"ARARAS"]
[null,null,40,"ARCO IRIS"]
[null,null,41,"AREALVA"]
[null,null,42,"AREIAS"]
[null,null,43,"AREIOPOLIS"]
[null,null,44,"ARIRANHA"]
[null,null,45,"ARTUR NOGUEIRA"]
[null,null,46,"ARUJA"]
[null,null,47,"ASPASIA"]
[null,null,48,"ASSIS"]
[null,null,49,"ATIBAIA"]
[null,null,50,"AURIFLAMA"]
[null,null,51,"AVAI"]
[null,null,52,"AVANHANDAVA"]
[null,null,53,"AVARE"]
[null,null,54,"BADY BASSITT"]
[null,null,55,"BALBINOS"]
[null,null,56,"BALSAMO"]
[null,null,57,"BANANAL"]
[null,null,58,"BARAO DE ANTONINA"]
[null,null,59,"BARBOSA"]
[null,null,60,"BARIRI"]
[null,null,61,"BARRA BONITA"]
[null,null,62,"BARRA DO CHAPEU"]
[null,null,63,"BARRA DO TURVO"]
[null,null,64,"BARRETOS"]
[null,null,65,"BARRINHA"]
[null,null,66,"BARUERI"]
[null,null,{"$f":"C74+1","v":67},"BASTOS"]
[null,null,68,"BATATAIS"]
[null,null,69,"BAURU"]
[null,null,70,"BEBEDOURO"]
[null,null,71,"BENTO DE ABREU"]
[null,null,72,"BERNARDINO DE CAMPOS"]
[null,null,73,"BERTIOGA"]
[null,null,74,"BILAC"]
[null,null,75,"BIRIGUI"]
[null,null,76,"BIRITIBA MIRIM"]
[null,null,77,"BOA ESPERANCA DO SUL"]
[null,null,78,"BOCAINA"]
[null,null,79,"BOFETE"]
[null,null,80,"BOITUVA"]
[null,null,81,"BOM JESUS DOS PERDOES"]
[null,null,82,"BOM SUCESSO DE ITARARE"]
[null,null,83,"BORA"]
[null,null,84,"BORACEIA"]
[null,null,85,"BORBOREMA"]
[null,null,86,"BOREBI"]
[null,null,87,"BOTUCATU"]
[null,null,88,"BRAGANCA PAULISTA"]
[null,null,89,"BRAUNA"]
[null,null,90,"BREJO ALEGRE"]
[null,null,91,"BRODOWSKI"]
[null,null,92,"BROTAS"]
[null,null,93,"BURI"]
[null,null,94,"BURITAMA"]
[null,null,95,"BURITIZAL"]
[null,null,96,"CABRALIA PAULISTA"]
[null,null,97,"CABREUVA"]
[null,null,98,"CACAPAVA"]
[null,null,99,"CACHOEIRA PAULISTA"]
[null,null,100,"CACONDE"]
[null,null,101,"CAFELANDIA"]
[null,null,102,"CAIABU"]
[null,null,103,"CAIEIRAS"]
[null,null,104,"CAIUA"]
[null,null,105,"CAJAMAR"]
[null,null,106,"CAJATI"]
[null,null,107,"CAJOBI"]
[null,null,108,"CAJURU"]
[null,null,109,"CAMPINA DO MONTE ALEGRE"]
[null,null,110,"CAMPINAS"]
[null,null,111,"CAMPO LIMPO PAULISTA"]
[null,null,112,"CAMPOS DO JORDAO"]
[null,null,113,"CAMPOS NOVOS PAULISTA"]
[null,null,114,"CANANEIA"]
[null,null,115,"CANAS"]
[null,null,116,"CANDIDO MOTA"]
[null,null,117,"CANDIDO RODRIGUES"]
[null,null,118,"CANITAR"]
[null,null,119,"CAPAO BONITO"]
[null,null,120,"CAPELA DO ALTO"]
[null,null,121,"CAPIVARI"]
[null,null,122,"CARAGUATATUBA"]
[null,null,123,"CARAPICUIBA"]
[null,null,124,"CARDOSO"]
[null,null,125,"CASA BRANCA"]
[null,null,126,"CASSIA DOS COQUEIROS"]
[null,null,127,"CASTILHO"]
[null,null,128,"CATANDUVA"]
[null,null,129,"CATIGUA"]
[null,null,130,"CEDRAL"]
[null,null,{"$f":"C138+1","v":131},"CERQUEIRA CESAR"]
[null,null,132,"CERQUILHO"]
[null,null,133,"CESARIO LANGE"]
[null,null,134,"CHARQUEADA"]
[null,null,135,"CHAVANTES"]
[null,null,136,"CLEMENTINA"]
[null,null,137,"COLINA"]
[null,null,138,"COLOMBIA"]
[null,null,139,"CONCHAL"]
[null,null,140,"CONCHAS"]
[null,null,141,"CORDEIROPOLIS"]
[null,null,142,"COROADOS"]
[null,null,143,"CORONEL MACEDO"]
[null,null,144,"CORUMBATAI"]
[null,null,145,"COSMOPOLIS"]
[null,null,146,"COSMORAMA"]
[null,null,147,"COTIA"]
[null,null,148,"CRAVINHOS"]
[null,null,149,"CRISTAIS PAULISTA"]
[null,null,150,"CRUZALIA"]
[null,null,151,"CRUZEIRO"]
[null,null,152,"CUBATAO"]
[null,null,153,"CUNHA"]
[null,null,154,"DESCALVADO"]
[null,null,155,"DIADEMA"]
[null,null,156,"DIRCE REIS"]
[null,null,157,"DIVINOLANDIA"]
[null,null,158,"DOBRADA"]
[null,null,159,"DOIS CORREGOS"]
[null,null,160,"DOLCINOPOLIS"]
[null,null,161,"DOURADO"]
[null,null,162,"DRACENA"]
[null,null,163,"DUARTINA"]
[null,null,164,"DUMONT"]
[null,null,165,"ECHAPORA"]
[null,null,166,"ELDORADO"]
[null,null,167,"ELIAS FAUSTO"]
[null,null,168,"ELISIARIO"]
[null,null,169,"EMBAUBA"]
[null,null,170,"EMBU"]
[null,null,171,"EMBU-GUACU"]
[null,null,172,"EMILIANOPOLIS"]
[null,null,173,"ENGENHEIRO COELHO"]
[null,null,174,"ESPIRITO SANTO DO PINHAL"]
[null,null,175,"ESPIRITO SANTO DO TURVO"]
[null,null,176,"ESTIVA GERBI"]
[null,null,177,"ESTRELA D´OESTE"]
[null,null,178,"ESTRELA DO NORTE"]
[null,null,179,"EUCLIDES DA CUNHA PAULISTA"]
[null,null,180,"FARTURA"]
[null,null,181,"FERNANDO PRESTES"]
[null,null,182,"FERNANDOPOLIS"]
[null,null,183,"FERNAO"]
[null,null,184,"FERRAZ DE VASCONCELOS"]
[null,null,185,"FLORA RICA"]
[null,null,186,"FLOREAL"]
[null,null,187,"FLORIDA PAULISTA"]
[null,null,188,"FLORINEA"]
[null,null,189,"FRANCA"]
[null,null,190,"FRANCISCO MORATO"]
[null,null,191,"FRANCO DA ROCHA"]
[null,null,192,"GABRIEL MONTEIRO"]
[null,null,193,"GALIA"]
[null,null,194,"GARCA"]
[null,null,{"$f":"C202+1","v":195},"GASTAO VIDIGAL"]
[null,null,196,"GAVIAO PEIXOTO"]
[null,null,197,"GENERAL SALGADO"]
[null,null,198,"GETULINA"]
[null,null,199,"GLICERIO"]
[null,null,200,"GUAICARA"]
[null,null,201,"GUAIMBE"]
[null,null,202,"GUAIRA"]
[null,null,203,"GUAPIACU"]
[null,null,204,"GUAPIARA"]
[null,null,205,"GUARA"]
[null,null,206,"GUARACAI"]
[null,null,207,"GUARACI"]
[null,null,208,"GUARANI D´OESTE"]
[null,null,209,"GUARANTA"]
[null,null,210,"GUARARAPES"]
[null,null,211,"GUARAREMA"]
[null,null,212,"GUARATINGUETA"]
[null,null,213,"GUAREI"]
[null,null,214,"GUARIBA"]
[null,null,215,"GUARUJA"]
[null,null,216,"GUARULHOS"]
[null,null,217,"GUATAPARA"]
[null,null,218,"GUZOLANDIA"]
[null,null,219,"HERCULANDIA"]
[null,null,220,"HOLAMBRA"]
[null,null,221,"HORTOLANDIA"]
[null,null,222,"IACANGA"]
[null,null,223,"IACRI"]
[null,null,224,"IARAS"]
[null,null,225,"IBATE"]
[null,null,226,"IBIRA"]
[null,null,227,"IBIRAREMA"]
[null,null,228,"IBITINGA"]
[null,null,229,"IBIUNA"]
[null,null,230,"ICEM"]
[null,null,231,"IEPE"]
[null,null,232,"IGARACU DO TIETE"]
[null,null,233,"IGARAPAVA"]
[null,null,234,"IGARATA"]
[null,null,235,"IGUAPE"]
[null,null,236,"ILHA COMPRIDA"]
[null,null,237,"ILHA SOLTEIRA"]
[null,null,238,"ILHABELA"]
[null,null,239,"INDAIATUBA"]
[null,null,240,"INDIANA"]
[null,null,241,"INDIAPORA"]
[null,null,242,"INUBIA PAULISTA"]
[null,null,243,"IPAUSSU"]
[null,null,244,"IPERO"]
[null,null,245,"IPEUNA"]
[null,null,246,"IPIGUA"]
[null,null,247,"IPORANGA"]
[null,null,248,"IPUA"]
[null,null,249,"IRACEMAPOLIS"]
[null,null,250,"IRAPUA"]
[null,null,251,"IRAPURU"]
[null,null,252,"ITABERA"]
[null,null,253,"ITAI"]
[null,null,254,"ITAJOBI"]
[null,null,255,"ITAJU"]
[null,null,256,"ITANHAEM"]
[null,null,257,"ITAOCA"]
[null,null,258,"ITAPECERICA DA SERRA"]
[null,null,{"$f":"C266+1","v":259},"ITAPETININGA"]
[null,null,260,"ITAPEVA"]
[null,null,261,"ITAPEVI"]
[null,null,262,"ITAPIRA"]
[null,null,263,"ITAPIRAPUA PAULISTA"]
[null,null,264,"ITAPOLIS"]
[null,null,265,"ITAPORANGA"]
[null,null,266,"ITAPUI"]
[null,null,267,"ITAPURA"]
[null,null,268,"ITAQUAQUECETUBA"]
[null,null,269,"ITARARE"]
[null,null,270,"ITARIRI"]
[null,null,271,"ITATIBA"]
[null,null,272,"ITATINGA"]
[null,null,273,"ITIRAPINA"]
[null,null,274,"ITIRAPUA"]
[null,null,275,"ITOBI"]
[null,null,276,"ITU"]
[null,null,277,"ITUPEVA"]
[null,null,278,"ITUVERAVA"]
[null,null,279,"JABORANDI"]
[null,null,280,"JABOTICABAL"]
[null,null,281,"JACAREI"]
[null,null,282,"JACI"]
[null,null,283,"JACUPIRANGA"]
[null,null,284,"JAGUARIUNA"]
[null,null,285,"JALES"]
[null,null,286,"JAMBEIRO"]
[null,null,287,"JANDIRA"]
[null,null,288,"JARDINOPOLIS"]
[null,null,289,"JARINU"]
[null,null,290,"JAU"]
[null,null,291,"JERIQUARA"]
[null,null,292,"JOANOPOLIS"]
[null,null,293,"JOAO RAMALHO"]
[null,null,294,"JOSE BONIFACIO"]
[null,null,295,"JULIO MESQUITA"]
[null,null,296,"JUMIRIM"]
[null,null,297,"JUNDIAI"]
[null,null,298,"JUNQUEIROPOLIS"]
[null,null,299,"JUQUIA"]
[null,null,300,"JUQUITIBA"]
[null,null,301,"LAGOINHA"]
[null,null,302,"LARANJAL PAULISTA"]
[null,null,303,"LAVINIA"]
[null,null,304,"LAVRINHAS"]
[null,null,305,"LEME"]
[null,null,306,"LENCOIS PAULISTA"]
[null,null,307,"LIMEIRA"]
[null,null,308,"LINDOIA"]
[null,null,309,"LINS"]
[null,null,310,"LORENA"]
[null,null,311,"LOURDES"]
[null,null,312,"LOUVEIRA"]
[null,null,313,"LUCELIA"]
[null,null,314,"LUCIANOPOLIS"]
[null,null,315,"LUIZ ANTONIO"]
[null,null,316,"LUIZIANIA"]
[null,null,317,"LUPERCIO"]
[null,null,318,"LUTECIA"]
[null,null,319,"MACATUBA"]
[null,null,320,"MACAUBAL"]
[null,null,321,"MACEDONIA"]
[null,null,322,"MAGDA"]
[null,null,{"$f":"C330+1","v":323},"MAIRINQUE"]
[null,null,324,"MAIRIPORA"]
[null,null,325,"MANDURI"]
[null,null,326,"MARABA PAULISTA"]
[null,null,327,"MARACAI"]
[null,null,328,"MARAPOAMA"]
[null,null,329,"MARIAPOLIS"]
[null,null,330,"MARILIA"]
[null,null,331,"MARINOPOLIS"]
[null,null,332,"MARTINOPOLIS"]
[null,null,333,"MATAO"]
[null,null,334,"MAUA"]
[null,null,335,"MENDONCA"]
[null,null,336,"MERIDIANO"]
[null,null,337,"MESOPOLIS"]
[null,null,338,"MIGUELOPOLIS"]
[null,null,339,"MINEIROS DO TIETE"]
[null,null,340,"MIRA ESTRELA"]
[null,null,341,"MIRACATU"]
[null,null,342,"MIRANDOPOLIS"]
[null,null,343,"MIRANTE DO PARANAPANEMA"]
[null,null,344,"MIRASSOL"]
[null,null,345,"MIRASSOLANDIA"]
[null,null,346,"MOCOCA"]
[null,null,347,"MOGI DAS CRUZES"]
[null,null,348,"MOGI GUACU"]
[null,null,349,"MOGI MIRIM"]
[null,null,350,"MOMBUCA"]
[null,null,351,"MONCOES"]
[null,null,352,"MONGAGUA"]
[null,null,353,"MONTE ALEGRE DO SUL"]
[null,null,354,"MONTE ALTO"]
[null,null,355,"MONTE APRAZIVEL"]
[null,null,356,"MONTE AZUL PAULISTA"]
[null,null,357,"MONTE CASTELO"]
[null,null,358,"MONTE MOR"]
[null,null,359,"MONTEIRO LOBATO"]
[null,null,360,"MORRO AGUDO"]
[null,null,361,"MORUNGABA"]
[null,null,362,"MOTUCA"]
[null,null,363,"MURUTINGA DO SUL"]
[null,null,364,"NANTES"]
[null,null,365,"NARANDIBA"]
[null,null,366,"NATIVIDADE DA SERRA"]
[null,null,367,"NAZARE PAULISTA"]
[null,null,368,"NEVES PAULISTA"]
[null,null,369,"NHANDEARA"]
[null,null,370,"NIPOA"]
[null,null,371,"NOVA ALIANCA"]
[null,null,372,"NOVA CAMPINA"]
[null,null,373,"NOVA CANAA PAULISTA"]
[null,null,374,"NOVA CASTILHO"]
[null,null,375,"NOVA EUROPA"]
[null,null,376,"NOVA GRANADA"]
[null,null,377,"NOVA GUATAPORANGA"]
[null,null,378,"NOVA INDEPENDENCIA"]
[null,null,379,"NOVA LUZITANIA"]
[null,null,380,"NOVA ODESSA"]
[null,null,381,"NOVAIS"]
[null,null,382,"NOVO HORIZONTE"]
[null,null,383,"NUPORANGA"]
[null,null,384,"OCAUCU"]
[null,null,385,"OLEO"]
[null,null,386,"OLIMPIA"]
[null,null,{"$f":"C394+1","v":387},"ONDA VERDE"]
[null,null,388,"ORIENTE"]
[null,null,389,"ORINDIUVA"]
[null,null,390,"ORLANDIA"]
[null,null,391,"OSASCO"]
[null,null,392,"OSCAR BRESSANE"]
[null,null,393,"OSVALDO CRUZ"]
[null,null,394,"OURINHOS"]
[null,null,395,"OURO VERDE"]
[null,null,396,"OUROESTE"]
[null,null,397,"PACAEMBU"]
[null,null,398,"PALESTINA"]
[null,null,399,"PALMARES PAULISTA"]
[null,null,400,"PALMEIRA D´OESTE"]
[null,null,401,"PALMITAL"]
[null,null,402,"PANORAMA"]
[null,null,403,"PARAGUACU PAULISTA"]
[null,null,404,"PARAIBUNA"]
[null,null,405,"PARAISO"]
[null,null,406,"PARANAPANEMA"]
[null,null,407,"PARANAPUA"]
[null,null,408,"PARAPUA"]
[null,null,409,"PARDINHO"]
[null,null,410,"PARIQUERA-ACU"]
[null,null,411,"PARISI"]
[null,null,412,"PATROCINIO PAULISTA"]
[null,null,413,"PAULICEIA"]
[null,null,414,"PAULINIA"]
[null,null,415,"PAULISTANIA"]
[null,null,416,"PAULO DE FARIA"]
[null,null,417,"PEDERNEIRAS"]
[null,null,418,"PEDRA BELA"]
[null,null,419,"PEDRANOPOLIS"]
[null,null,420,"PEDREGULHO"]
[null,null,421,"PEDREIRA"]
[null,null,422,"PEDRINHAS PAULISTA"]
[null,null,423,"PEDRO DE TOLEDO"]
[null,null,424,"PENAPOLIS"]
[null,null,425,"PEREIRA BARRETO"]
[null,null,426,"PEREIRAS"]
[null,null,427,"PERUIBE"]
[null,null,428,"PIACATU"]
[null,null,429,"PIEDADE"]
[null,null,430,"PILAR DO SUL"]
[null,null,431,"PINDAMONHANGABA"]
[null,null,432,"PINDORAMA"]
[null,null,433,"PINHALZINHO"]
[null,null,434,"PIQUEROBI"]
[null,null,435,"PIQUETE"]
[null,null,436,"PIRACAIA"]
[null,null,437,"PIRACICABA"]
[null,null,438,"PIRAJU"]
[null,null,439,"PIRAJUI"]
[null,null,440,"PIRANGI"]
[null,null,441,"PIRAPORA DO BOM JESUS"]
[null,null,442,"PIRAPOZINHO"]
[null,null,443,"PIRASSUNUNGA"]
[null,null,444,"PIRATININGA"]
[null,null,445,"PITANGUEIRAS"]
[null,null,446,"PLANALTO"]
[null,null,447,"PLATINA"]
[null,null,448,"POA"]
[null,null,449,"POLONI"]
[null,null,450,"POMPEIA"]
[null,null,{"$f":"C458+1","v":451},"PONGAI"]
[null,null,452,"PONTAL"]
[null,null,453,"PONTALINDA"]
[null,null,454,"PONTES GESTAL"]
[null,null,455,"POPULINA"]
[null,null,456,"PORANGABA"]
[null,null,457,"PORTO FELIZ"]
[null,null,458,"PORTO FERREIRA"]
[null,null,459,"POTIM"]
[null,null,460,"POTIRENDABA"]
[null,null,461,"PRACINHA"]
[null,null,462,"PRADOPOLIS"]
[null,null,463,"PRAIA GRANDE"]
[null,null,464,"PRATANIA"]
[null,null,465,"PRESIDENTE ALVES"]
[null,null,466,"PRESIDENTE BERNARDES"]
[null,null,467,"PRESIDENTE EPITACIO"]
[null,null,468,"PRESIDENTE PRUDENTE"]
[null,null,469,"PRESIDENTE VENCESLAU"]
[null,null,470,"PROMISSAO"]
[null,null,471,"QUADRA"]
[null,null,472,"QUATA"]
[null,null,473,"QUEIROZ"]
[null,null,474,"QUELUZ"]
[null,null,475,"QUINTANA"]
[null,null,476,"RAFARD"]
[null,null,477,"RANCHARIA"]
[null,null,478,"REDENCAO DA SERRA"]
[null,null,479,"REGENTE FEIJO"]
[null,null,480,"REGINOPOLIS"]
[null,null,481,"REGISTRO"]
[null,null,482,"RESTINGA"]
[null,null,483,"RIBEIRA"]
[null,null,484,"RIBEIRAO BONITO"]
[null,null,485,"RIBEIRAO BRANCO"]
[null,null,486,"RIBEIRAO CORRENTE"]
[null,null,487,"RIBEIRAO DO SUL"]
[null,null,488,"RIBEIRAO DOS INDIOS"]
[null,null,489,"RIBEIRAO GRANDE"]
[null,null,490,"RIBEIRAO PIRES"]
[null,null,491,"RIBEIRAO PRETO"]
[null,null,492,"RIFAINA"]
[null,null,493,"RINCAO"]
[null,null,494,"RINOPOLIS"]
[null,null,495,"RIO CLARO"]
[null,null,496,"RIO DAS PEDRAS"]
[null,null,497,"RIO GRANDE DA SERRA"]
[null,null,498,"RIOLANDIA"]
[null,null,499,"RIVERSUL"]
[null,null,500,"ROSANA"]
[null,null,{"$f":"C508+1","v":501},"ROSEIRA"]
[null,null,502,"RUBIACEA"]
[null,null,503,"RUBINEIA"]
[null,null,504,"SABINO"]
[null,null,505,"SAGRES"]
[null,null,506,"SALES"]
[null,null,507,"SALES OLIVEIRA"]
[null,null,508,"SALESOPOLIS"]
[null,null,509,"SALMOURAO"]
[null,null,510,"SALTINHO"]
[null,null,511,"SALTO"]
[null,null,512,"SALTO DE PIRAPORA"]
[null,null,513,"SALTO GRANDE"]
[null,null,514,"SANDOVALINA"]
[null,null,{"$f":"C522+1","v":515},"SANTA ADELIA"]
[null,null,516,"SANTA ALBERTINA"]
[null,null,517,"SANTA BARBARA D´OESTE"]
[null,null,518,"SANTA BRANCA"]
[null,null,519,"SANTA CLARA D´OESTE"]
[null,null,520,"SANTA CRUZ DA CONCEICAO"]
[null,null,521,"SANTA CRUZ DA ESPERANCA"]
[null,null,522,"SANTA CRUZ DAS PALMEIRAS"]
[null,null,523,"SANTA CRUZ DO RIO PARDO"]
[null,null,524,"SANTA ERNESTINA"]
[null,null,525,"SANTA FE DO SUL"]
[null,null,526,"SANTA GERTRUDES"]
[null,null,527,"SANTA ISABEL"]
[null,null,528,"SANTA LUCIA"]
[null,null,529,"SANTA MARIA DA SERRA"]
[null,null,530,"SANTA MERCEDES"]
[null,null,531,"SANTA RITA D´OESTE"]
[null,null,532,"SANTA RITA DO PASSA QUATRO"]
[null,null,533,"SANTA ROSA DE VITERBO"]
[null,null,534,"SANTA SALETE"]
[null,null,535,"SANTANA DA PONTE PENSA"]
[null,null,536,"SANTANA DE PARNAIBA"]
[null,null,537,"SANTO ANASTACIO"]
[null,null,538,"SANTO ANDRE"]
[null,null,539,"SANTO ANTONIO DA ALEGRIA"]
[null,null,540,"SANTO ANTONIO DE POSSE"]
[null,null,541,"SANTO ANTONIO DO ARACANGUA"]
[null,null,542,"SANTO ANTONIO DO JARDIM"]
[null,null,543,"SANTO ANTONIO DO PINHAL"]
[null,null,544,"SANTO EXPEDITO"]
[null,null,545,"SANTOPOLIS DO AGUAPEI"]
[null,null,546,"SANTOS"]
[null,null,547,"SAO BENTO DO SAPUCAI"]
[null,null,548,"SAO BERNARDO DO CAMPO"]
[null,null,549,"SAO CAETANO DO SUL"]
[null,null,550,"SAO CARLOS"]
[null,null,551,"SAO FRANCISCO"]
[null,null,552,"SAO JOAO DA BOA VISTA"]
[null,null,553,"SAO JOAO DAS DUAS PONTES"]
[null,null,554,"SAO JOAO DO IRACEMA"]
[null,null,555,"SAO JOAO DO PAU D´ALHO"]
[null,null,556,"SAO JOAQUIM DA BARRA"]
[null,null,557,"SAO JOSE DA BELA VISTA"]
[null,null,558,"SAO JOSE DO BARREIRO"]
[null,null,559,"SAO JOSE DO RIO PARDO"]
[null,null,560,"SAO JOSE DO RIO PRETO"]
[null,null,561,"SAO JOSE DOS CAMPOS"]
[null,null,562,"SAO LOURENCO DA SERRA"]
[null,null,563,"SAO LUIZ DO PARAITINGA"]
[null,null,564,"SAO MANUEL"]
[null,null,565,"SAO MIGUEL ARCANJO"]
[null,null,566,"SAO PEDRO"]
[null,null,567,"SAO PEDRO DO TURVO"]
[null,null,568,"SAO ROQUE"]
[null,null,569,"SAO SEBASTIAO"]
[null,null,570,"SAO SEBASTIAO DA GRAMA"]
[null,null,571,"SAO SIMAO"]
[null,null,572,"SAO VICENTE"]
[null,null,573,"SARAPUI"]
[null,null,574,"SARUTAIA"]
[null,null,575,"SEBASTIANOPOLIS DO SUL"]
[null,null,576,"SERRA AZUL"]
[null,null,577,"SERRA NEGRA"]
[null,null,578,"SERRANA"]
[null,null,{"$f":"C586+1","v":579},"SERTAOZINHO"]
[null,null,580,"SETE BARRAS"]
[null,null,581,"SEVERINIA"]
[null,null,582,"SILVEIRAS"]
[null,null,583,"SOCORRO"]
[null,null,584,"SOROCABA"]
[null,null,585,"SUD MENUCCI"]
[null,null,586,"SUMARE"]
[null,null,587,"SUZANAPOLIS"]
[null,null,588,"SUZANO"]
[null,null,589,"TABAPUA"]
[null,null,590,"TABATINGA"]
[null,null,591,"TABOAO DA SERRA"]
[null,null,592,"TACIBA"]
[null,null,593,"TAGUAI"]
[null,null,594,"TAIACU"]
[null,null,595,"TAIUVA"]
[null,null,596,"TAMBAU"]
[null,null,597,"TANABI"]
[null,null,598,"TAPIRAI"]
[null,null,599,"TAPIRATIBA"]
[null,null,600,"TAQUARAL"]
[null,null,601,"TAQUARITINGA"]
[null,null,602,"TAQUARITUBA"]
[null,null,603,"TAQUARIVAI"]
[null,null,604,"TARABAI"]
[null,null,605,"TARUMA"]
[null,null,606,"TATUI"]
[null,null,607,"TAUBATE"]
[null,null,608,"TEJUPA"]
[null,null,609,"TEODORO SAMPAIO"]
[null,null,610,"TERRA ROXA"]
[null,null,611,"TIETE"]
[null,null,612,"TIMBURI"]
[null,null,613,"TORRE DE PEDRA"]
[null,null,614,"TORRINHA"]
[null,null,615,"TRABIJU"]
[null,null,616,"TREMEMBE"]
[null,null,617,"TRES FRONTEIRAS"]
[null,null,618,"TUIUTI"]
[null,null,619,"TUPA"]
[null,null,620,"TUPI PAULISTA"]
[null,null,621,"TURIUBA"]
[null,null,622,"TURMALINA"]
[null,null,623,"UBARANA"]
[null,null,624,"UBATUBA"]
[null,null,625,"UBIRAJARA"]
[null,null,626,"UCHOA"]
[null,null,627,"UNIAO PAULISTA"]
[null,null,628,"URANIA"]
[null,null,629,"URU"]
[null,null,630,"URUPES"]
[null,null,631,"VALENTIM GENTIL"]
[null,null,632,"VALINHOS"]
[null,null,633,"VALPARAISO"]
[null,null,634,"VARGEM"]
[null,null,635,"VARGEM GRANDE DO SUL"]
[null,null,636,"VARGEM GRANDE PAULISTA"]
[null,null,637,"VARZEA PAULISTA"]
[null,null,638,"VERA CRUZ"]
[null,null,639,"VINHEDO"]
[null,null,640,"VIRADOURO"]
[null,null,641,"VISTA ALEGRE DO ALTO"]
[null,null,642,"VITORIA BRASIL"]
[null,null,{"$f":"C650+1","v":643},"VOTORANTIM"]
[null,null,644,"VOTUPORANGA"]
[null,null,645,"ZACARIAS"]
[null,null,646]
[null,null,647]
[null,null,648]
[null,null,649]
[null,null,650]

{"sheet":"COM","index":3,"n_rows":21,"n_cols":44,"rows_kept":21,"cut":false,"hidden":true,"merged":[]}
[]
[]
[]
[]
[null,null,null,null,null,null,null,null,null,null,null,null,null,null,null,null,null,null,null,null,null,null,null,null,null,null,null,null,"MUNICÍPIO:",null,null,null,"PERÍODO (RREO..)",null,null,"MÊS REF.","ANTERIORES",null,null,null,"ORDEM",null,"EXERCÍCIO"]
[null,null,null,null,null,null,null,null,null,null,null,null,null,null,null,null,null,null,null,null,null,null,null,null,null,null,null,null,1,{"$f":"LOOKUP(AC6,CAD!C9:C658,CAD!D9:D658)","v":"TAUBATÉ  -  FUNDAÇÃO UNIVERSITÁRIA DE TAUBATÉ"},null,null,"Resultado:",3,null,{"$f":"AH6*2","v":6},null,null,null,null,null,null,"Resultado:",12]
[null,null,null,null,null,null,null,null,null,null,null,null,null,null,null,null,null,null,null,null,null,null,null,null,null,null,null,null,null,null,null,1,"1º BIMESTRE",null,2,"FEVEREIRO","2000-01-15",{"$f":"LOOKUP($AJ$6,MONTH($AK$7:$AK$18),MONTH($AK$7:$AK$18-330))","v":7},1,"JANEIRO",{"$f":"LOOKUP(AL7,$AM$7:$AM$18,$AN$7:$AN$18)","v":"JULHO"},1,2001]
[null,null,null,null,null,null,null,null,null,null,null,null,null,null,null,null,null,null,null,null,null,null,null,null,null,null,null,null,null,null,null,2,"2º BIMESTRE ",null,4,"ABRIL","2000-02-15",{"$f":"LOOKUP($AJ$6,MONTH($AK$7:$AK$18),MONTH($AK$7:$AK$18-300))","v":8},2,"FEVEREIRO",{"$f":"LOOKUP(AL8,$AM$7:$AM$18,$AN$7:$AN$18)","v":"AGOSTO"},2,2002,8]
[null,null,null,null,null,null,null,null,null,null,null,null,null,null,null,null,null,null,null,null,null,null,null,null,null,null,null,null,null,null,null,3,"3º BIMESTRE",null,6,"JUNHO","2000-03-15",{"$f":"LOOKUP($AJ$6,MONTH($AK$7:$AK$18),MONTH($AK$7:$AK$18-270))","v":9},3,"MARÇO","SETEMBRO",3,2003]
[null,null,null,null,null,null,null,null,null,null,null,null,null,null,null,null,null,null,null,null,null,null,null,null,null,null,null,null,null,null,null,4,"4º BIMESTRE ",null,8,"AGOSTO","2000-04-15",{"$f":"LOOKUP($AJ$6,MONTH($AK$7:$AK$18),MONTH($AK$7:$AK$18-240))","v":10},4,"ABRIL","OUTUBRO",4,2004]
[null,null,null,null,null,null,null,null,null,null,null,null,null,null,null,null,null,null,null,null,null,null,null,null,null,null,null,null,"PODERES:",null,null,5,"5º BIMESTRE",null,10,"OUTUBRO","2000-05-15",{"$f":"LOOKUP($AJ$6,MONTH($AK$7:$AK$18),MONTH($AK$7:$AK$18-210))","v":11},5,"MAIO","NOVEMBRO",5,2005]
[null,null,null,null,null,null,null,null,null,null,null,null,null,null,null,null,null,null,null,null,null,null,null,null,null,null,null,null,"Resultado:",1,null,6,"6º BIMESTRE",null,12,"DEZEMBRO","2000-06-15",{"$f":"LOOKUP($AJ$6,MONTH($AK$7:$AK$18),MONTH($AK$7:$AK$18-180))","v":12},6,"JUNHO","DEZEMBRO",6,2006]
[null,null,null,null,null,null,null,null,null,null,null,null,null,null,null,null,null,null,null,null,null,null,null,null,null,null,null,1,"EXECUTIVO MUNICIPAL",null,null,null,{"$f":"LOOKUP(AH6,AF7:AF12,AG7:AG12)","v":"3º BIMESTRE"},null,null,null,"2000-07-15",{"$f":"LOOKUP($AJ$6,MONTH($AK$7:$AK$18),MONTH($AK$7:$AK$18-150))","v":1},7,"JULHO","JANEIRO",7,2007]
[null,null,null,null,null,null,null,null,null,null,null,null,null,null,null,null,null,null,null,null,null,null,null,null,null,null,null,2,null,null,null,null,"PERÍODO (RGF..)",null,null,null,"2000-08-15",{"$f":"LOOKUP($AJ$6,MONTH($AK$7:$AK$18),MONTH($AK$7:$AK$18-120))","v":2},8,"AGOSTO","FEVEREIRO",8,2008]
[null,null,null,null,null,null,null,null,null,null,null,null,null,null,null,null,null,null,null,null,null,null,null,null,null,null,null,null,{"$f":"LOOKUP(AD12,AB13:AB14,AC13:AC14)","v":"EXECUTIVO MUNICIPAL"},null,null,1,"\"PARA PRÓXIMO BIMESTRE\"",null,null,null,"2000-09-15",{"$f":"LOOKUP($AJ$6,MONTH($AK$7:$AK$18),MONTH($AK$7:$AK$18-90))","v":3},9,"SETEMBRO","MARÇO",9,2009]
[null,null,null,null,null,null,null,null,null,null,null,null,null,null,null,null,null,null,null,null,null,null,null,null,null,null,null,null,null,null,null,2,"1º QUADRIMESTRE",null,null,null,"2000-10-15",{"$f":"LOOKUP($AJ$6,MONTH($AK$7:$AK$18),MONTH($AK$7:$AK$18-60))","v":4},10,"OUTUBRO","ABRIL",10,2010]
[null,null,null,null,null,null,null,null,null,null,null,null,null,null,null,null,null,null,null,null,null,null,null,null,null,null,null,null,null,null,null,3,"\"PARA PRÓXIMO BIMESTRE\"",null,null,null,"2000-11-15",{"$f":"LOOKUP($AJ$6,MONTH($AK$7:$AK$18),MONTH($AK$7:$AK$18-30))","v":5},11,"NOVEMBRO","MAIO",11,2011]
[null,null,null,null,null,null,null,null,null,null,null,null,null,null,null,null,null,null,null,null,null,null,null,null,null,null,null,null,null,null,null,4,"2º QUADRIMESTRE",null,null,null,"2000-12-15",{"$f":"AJ6","v":6},12,"DEZEMBRO","JUNHO",12,2012]
[null,null,null,null,null,null,null,null,null,null,null,null,null,null,null,null,null,null,null,null,null,null,null,null,null,null,null,null,null,null,null,5,"\"PARA PRÓXIMO BIMESTRE\"",null,null,null,null,null,null,null,null,null,{"$f":"LOOKUP(AR6,AP7:AP18,AQ7:AQ18)","v":2012}]
[null,null,null,null,null,null,null,null,null,null,null,null,null,null,null,null,null,null,null,null,null,null,null,null,null,null,null,null,null,null,null,6,"3º QUADRIMESTRE"]
[null,null,null,null,null,null,null,null,null,null,null,null,null,null,null,null,null,null,null,null,null,null,null,null,null,null,null,null,null,null,null,null,{"$f":"LOOKUP(AH6,AF15:AF20,AG15:AG20)","v":"\"PARA PRÓXIMO BIMESTRE\""}]

{"sheet":"mod1 6b","index":4,"n_rows":59,"n_cols":18,"rows_kept":59,"cut":false,"hidden":false,"merged":[[36,1,36,2],[36,3,36,4],[36,5,36,6],[36,7,36,8],[57,6,57,8],[57,15,57,17],[36,9,36,10],[36,11,36,12],[36,13,36,14],[36,15,36,17],[0,0,0,17],[1,0,1,17],[2,0,2,17],[6,0,6,17],[7,1,7,2],[7,3,7,4],[7,5,7,6],[7,7,7,8],[7,11,7,12],[7,9,7,10],[7,13,7,14],[7,15,7,17]]}
["RELATÓRIO RESUMIDO DA EXECUÇÃO ORÇAMENTÁRIA "]
[" (Artigo  52, Incisos I e II, alíneas “a” e “b”, da LC. 101/00)"]
["- ADMINISTRAÇÃO DIRETA / INDIRETA / FUNDACIONAL -"]
[]
[{"$f":"\"MUNICÍPIO DE \"&COM!AD6","v":"MUNICÍPIO DE TAUBATÉ  -  FUNDAÇÃO UNIVERSITÁRIA DE TAUBATÉ"}]
["3ºBIMESTRE 2014"]
["Valores expressos em R$"]
["RECEITAS ","Previsão anual",null,"1º Bimestre",null,"2º Bimestre",null,"3º Bimestre",null,"4º Bimestre",null,"5º Bimestre",null,"6º Bimestre",null,"Acumulado"]
["Categoria Econômica/Fontes","Inicial","Atualizada","Previsto","Realizado ","Previsto","Realizado ","Previsto","Realizado ","Previsto","Realizado ","Previsto","Realizado ","Previsto","Realizado ","Previsto","Realizado","a realizar"]
[null,null,null,1,2,3,4,5,6,7,8,9,10,11,12]
["Receitas Correntes (A)",{"$f":"B12+SUM(B20:B25)-B26+B27","v":18723396},{"$f":"C12+SUM(C20:C25)-C26+C27","v":18723396},3120566,2839159.83,3120566,1691045.1400000001,3120566,1368482.56,0,0,0,0,0,0,{"$f":"D11+F11+H11+J11+L11+N11","v":9361698},{"$f":"E11+G11+I11+K11+M11+O11","v":5898687.5300000012},{"$f":"C11-Q11","v":12824708.469999999}]
["Tributárias",{"$f":"B13+B18+B19","v":0},{"$f":"C13+C18+C19","v":0},0,0,0,0,0,0,0,0,0,0,0,0,{"$f":"D12+F12+H12+J12+L12+N12","v":0},{"$f":"E12+G12+I12+K12+M12+O12","v":0},{"$f":"C12-Q12","v":0}]
["  Impostos",{"$f":"SUM(B14:B17)","v":0},{"$f":"SUM(C14:C17)","v":0},0,0,0,0,0,0,0,0,0,0,0,0,0,0,0]
["    IPTU",null,null,null,null,null,null,null,null,null,null,null,null,null,null,0,0,0]
["    ISSQN",null,null,null,null,null,null,null,null,null,null,null,null,null,null,0,0,0]
["    ITBI  ",null,null,null,null,null,null,null,null,null,null,null,null,null,null,0,0,0]
["    IRRF",null,null,null,null,null,null,null,null,null,null,null,null,null,null,{"$f":"D17+F17+H17+J17+L17+N17","v":0},{"$f":"E17+G17+I17+K17+M17+O17","v":0},{"$f":"C17-Q17","v":0}]
["  Taxas",null,null,null,null,null,null,null,null,null,null,null,null,null,null,0,0,0]
["  Contribuição de Melhoria",null,null,null,null,null,null,null,null,null,null,null,null,null,null,0,0,0]
["Contribuições",null,null,null,null,null,null,null,null,null,null,null,null,null,null,0,0,0]
["Patrimoniais",46896,46896,7816,7996.12,7816,3998.06,7816,0,0,0,0,0,0,0,23448,11994.18,34901.82]
["Industriais",null,null,null,null,null,null,null,null,null,null,null,null,null,null,0,0,0]
["Agropecuárias",null,null,null,null,null,null,null,null,null,null,null,null,null,null,0,0,0]
["Serviços",18631500,18631500,3105250,2831163.71,3105250,1655286.12,3105250,1295608.81,0,0,0,0,0,0,9315750,5782058.6400000006,12849441.359999999]
["Transferências Correntes",null,null,null,null,null,null,null,null,null,null,null,null,null,null,0,0,0]
["(-) Contas Redutoras (ICMS,FPM,IPI Exp)",null,null,null,null,null,null,null,null,null,null,null,null,null,null,{"$f":"D26+F26+H26+J26+L26+N26","v":0},{"$f":"E26+G26+I26+K26+M26+O26","v":0},{"$f":"C26-Q26","v":0}]
["Outras Receitas Correntes",45000,45000,7500,0,7500,31760.959999999999,7500,72873.75,0,0,0,0,0,0,22500,104634.70999999999,-59634.709999999992]
["Receitas de Capital (B)",{"$f":"B29+SUM(B32:B35)","v":0},{"$f":"C29+SUM(C32:C35)","v":0},0,0,0,0,0,0,0,0,0,0,0,0,0,0,0]
["Operações de Crédito",{"$f":"B30+B31","v":0},{"$f":"C30+C31","v":0},0,0,0,0,0,0,0,0,0,0,0,0,0,0,0]
["      Refinanciamento da Dívida ",null,null,null,null,null,null,null,null,null,null,null,null,null,null,0,0,0]
["    Outras Operações de Crédito",null,null,null,null,null,null,null,null,null,null,null,null,null,null,0,0,0]
["Alienação de Bens",null,null,null,null,null,null,null,null,null,null,null,null,null,null,0,0,0]
["Amortização de Empréstimos",null,null,null,null,null,null,null,null,null,null,null,null,null,null,0,0,0]
["Transferências de Capital",null,null,null,null,null,null,null,null,null,null,null,null,null,null,0,0,0]
["Outras Receitas de Capital",null,null,null,null,null,null,null,null,null,null,null,null,null,null,0,0,0]
["RECEITA TOTAL  (A+B)",{"$f":"B11+B28","v":18723396},{"$f":"C11+C28","v":18723396},3120566,2839159.83,3120566,1691045.1400000001,3120566,1368482.56,0,0,0,0,0,0,9361698,5898687.5300000012,12824708.469999999]
["DESPESAS","Dotação Anual",null,"1º Bimestre",null,"2º Bimestre",null,"3º Bimestre",null,"4º Bimestre",null,"5º Bimestre",null,"6º Bimestre",null,"Acumulado"]
["Categoria Econômica/Natureza","Inicial","Atualizada","Empenhado","Liquidado","Empenhado","Liquidado","Empenhado","Liquidado","Empenhado","Liquidado","Empenhado","Liquidado","Empenhado","Liquidado","Empenhado","Liquidado","A empenhar"]
["Despesas Correntes (C)",{"$f":"SUM(B40:B43)","v":20083396},{"$f":"SUM(C40:C43)","v":20083396},{"$f":"SUM(D40:D43)","v":3123555.3},{"$f":"SUM(E40:E43)","v":3123555.3},1311474.69,1311474.69,3164776.51,3164776.51,0,0,0,0,0,0,{"$f":"D39+F39+H39+J39+L39+N39","v":7599806.5},{"$f":"E39+G39+I39+K39+M39+O39","v":7599806.5},{"$f":"C39-P39","v":12483589.5}]
["Pessoal/Encargos Sociais",11661496,11661496,1546822.16,1546822.16,320297.45,320297.45,1376690.85,1376690.85,null,null,null,null,null,null,3243810.46,{"$f":"E40+G40+I40+K40+M40+O40","v":3243810.46},{"$f":"C40-P40","v":8417685.5399999991}]
["Juros/Encargos da Dívida Interna",null,null,null,null,null,null,null,null,null,null,null,null,null,null,0,0,0]
["Juros/Encargos Dívida Externa",null,null,null,null,null,null,null,null,null,null,null,null,null,null,0,0,0]
["Outras Despesas Correntes",8421900,8421900,1576733.14,1576733.14,991177.24,991177.24,1788085.66,1788085.66,null,null,null,null,null,null,4355996.04,4355996.04,4065903.96]
["Despesas de Capital (D)",{"$f":"B45+B46+B47+B50","v":40000},{"$f":"C45+C46+C47+C50","v":40000},4490,4490,0,0,2078,2078,0,0,0,0,0,0,6568,6568,33432]
["Investimentos",40000,40000,4490,4490,0,0,2078,2078,null,null,null,null,null,null,6568,6568,33432]
["Inversões Financeiras",null,null,null,null,null,null,null,null,null,null,null,null,null,null,0,0,0]
["Amortização da Dívida",{"$f":"SUM(B48:B49)","v":0},{"$f":"SUM(C48:C49)","v":0},0,0,0,0,0,0,0,0,0,0,0,0,0,0,0]
["  Amortização do Refin. Dív. Mobil.",null,null,0,null,null,null,null,null,null,null,null,null,null,null,0,0,0]
["  Outras Amortizações",null,null,null,null,0,0,0,0,0,0,0,0,0,0,0,0,0]
["Outras Despesas de Capital",null,null,null,null,null,null,null,null,null,null,null,null,null,null,0,0,0]
["Reserva de Contingência (E)",0,0]
["DESPESA TOTAL (C+D)",{"$f":"B39+B44","v":20123396},{"$f":"C39+C44","v":20123396},3128045.3,3128045.3,1311474.69,1311474.69,3166854.51,3166854.51,0,0,0,0,0,0,{"$f":"D52+F52+H52+J52+L52+N52","v":7606374.5},{"$f":"E52+G52+I52+K52+M52+O52","v":7606374.5},{"$f":"C52-P52","v":12517021.5}]
["SUPERÁVIT/DÉFICIT(A+B–C-D)",{"$f":"B36-B52","v":-1400000},{"$f":"C36-C52","v":-1400000},{"$f":"D36-D52","v":-7479.2999999998137},-288885.46999999974,{"$f":"F36-F52","v":1809091.31},379570.45000000019,{"$f":"H36-H52","v":-46288.509999999776},-1798371.9499999997,{"$f":"J36-J52","v":0},0,{"$f":"L36-L52","v":0},0,{"$f":"O36-N52","v":0},0,{"$f":"P36-P39-P44","v":1755323.5},{"$f":"Q36-Q39-Q44","v":-1707686.9699999988}]
[]
[]
[]
[]
["PROF.DR.ISNARD DE A.CÂMARA NETO",null,null,null,null,null,"Jessé César Pinto",null,null,null,null,null,null,null,null,"JOSIMERE DOS SANTOS COSTA"]
["DIRETOR PRESIDENTE",null,null,null,null,null," ","       CRC:1SP 297323/O-5",null,null,null,null,null,null,null,null,"Controlador Interno"]

{"sheet":"mod1 1b","index":5,"n_rows":59,"n_cols":8,"rows_kept":59,"cut":false,"hidden":false,"merged":[[57,5,57,7],[57,2,57,3],[36,5,36,7],[36,1,36,2],[36,3,36,4],[7,5,7,7],[7,1,7,2],[7,3,7,4],[0,0,0,7],[1,0,1,7],[2,0,2,7],[6,0,6,7]]}
["RELATÓRIO RESUMIDO DA EXECUÇÃO ORÇAMENTÁRIA "]
[" (Artigo  52, Incisos I e II, alíneas “a” e “b”, da LC. 101/00)"]
["- ADMINISTRAÇÃO DIRETA / INDIRETA / FUNDACIONAL -"]
[]
[{"$f":"'mod1 6b'!A5","v":"MUNICÍPIO DE TAUBATÉ  -  FUNDAÇÃO UNIVERSITÁRIA DE TAUBATÉ"}]
["3º BIMESTRE 2014"]
["Valores expressos em R$"]
["RECEITAS ","Previsão anual",null,"3ºBIMESTRE",null,"Acumulado"]
["Categoria Econômica/Fontes","Inicial","Atualizada","Previsto","Realizado ","Previsto","Realizado","a realizar"]
[null,null,null,{"$f":"E10-1","v":5},{"$f":"COM!AH6*2","v":6}]
["Receitas Correntes (A)",{"$f":"'mod1 6b'!B11","v":18723396},{"$f":"'mod1 6b'!C11","v":18723396},{"$f":"LOOKUP($D$10,'mod1 6b'!$D$10:$O$10,'mod1 6b'!D11:O11)","v":3120566},{"$f":"SUM(E12:E35)","v":1368482.56},{"$f":"'mod1 6b'!P11","v":9361698},{"$f":"'mod1 6b'!Q11","v":5898687.5300000012},{"$f":"'mod1 6b'!R11","v":12824708.469999999}]
["Tributárias",{"$f":"'mod1 6b'!B12","v":0},{"$f":"'mod1 6b'!C12","v":0},{"$f":"LOOKUP($D$10,'mod1 6b'!$D$10:$O$10,'mod1 6b'!D12:O12)","v":0},{"$f":"LOOKUP($E$10,'mod1 6b'!$D$10:$O$10,'mod1 6b'!D12:O12)","v":0},{"$f":"'mod1 6b'!P12","v":0},{"$f":"'mod1 6b'!Q12","v":0},{"$f":"'mod1 6b'!R12","v":0}]
["  Impostos",{"$f":"'mod1 6b'!B13","v":0},{"$f":"'mod1 6b'!C13","v":0},{"$f":"LOOKUP($D$10,'mod1 6b'!$D$10:$O$10,'mod1 6b'!D13:O13)","v":0},{"$f":"LOOKUP($E$10,'mod1 6b'!$D$10:$O$10,'mod1 6b'!D13:O13)","v":0},{"$f":"'mod1 6b'!P13","v":0},{"$f":"'mod1 6b'!Q13","v":0},{"$f":"'mod1 6b'!R13","v":0}]
["      IPTU",{"$f":"'mod1 6b'!B14","v":0},{"$f":"'mod1 6b'!C14","v":0},{"$f":"LOOKUP($D$10,'mod1 6b'!$D$10:$O$10,'mod1 6b'!D14:O14)","v":0},{"$f":"LOOKUP($E$10,'mod1 6b'!$D$10:$O$10,'mod1 6b'!D14:O14)","v":0},{"$f":"'mod1 6b'!P14","v":0},{"$f":"'mod1 6b'!Q14","v":0},{"$f":"'mod1 6b'!R14","v":0}]
["      ISSQN",{"$f":"'mod1 6b'!B15","v":0},{"$f":"'mod1 6b'!C15","v":0},{"$f":"LOOKUP($D$10,'mod1 6b'!$D$10:$O$10,'mod1 6b'!D15:O15)","v":0},{"$f":"LOOKUP($E$10,'mod1 6b'!$D$10:$O$10,'mod1 6b'!D15:O15)","v":0},{"$f":"'mod1 6b'!P15","v":0},{"$f":"'mod1 6b'!Q15","v":0},{"$f":"'mod1 6b'!R15","v":0}]
["      ITBI  ",{"$f":"'mod1 6b'!B16","v":0},{"$f":"'mod1 6b'!C16","v":0},{"$f":"LOOKUP($D$10,'mod1 6b'!$D$10:$O$10,'mod1 6b'!D16:O16)","v":0},{"$f":"LOOKUP($E$10,'mod1 6b'!$D$10:$O$10,'mod1 6b'!D16:O16)","v":0},{"$f":"'mod1 6b'!P16","v":0},{"$f":"'mod1 6b'!Q16","v":0},{"$f":"'mod1 6b'!R16","v":0}]
["      IRRF",{"$f":"'mod1 6b'!B17","v":0},{"$f":"'mod1 6b'!C17","v":0},{"$f":"LOOKUP($D$10,'mod1 6b'!$D$10:$O$10,'mod1 6b'!D17:O17)","v":0},{"$f":"LOOKUP($E$10,'mod1 6b'!$D$10:$O$10,'mod1 6b'!D17:O17)","v":0},{"$f":"'mod1 6b'!P17","v":0},{"$f":"'mod1 6b'!Q17","v":0},{"$f":"'mod1 6b'!R17","v":0}]
["  Taxas",{"$f":"'mod1 6b'!B18","v":0},{"$f":"'mod1 6b'!C18","v":0},{"$f":"LOOKUP($D$10,'mod1 6b'!$D$10:$O$10,'mod1 6b'!D18:O18)","v":0},{"$f":"LOOKUP($E$10,'mod1 6b'!$D$10:$O$10,'mod1 6b'!D18:O18)","v":0},{"$f":"'mod1 6b'!P18","v":0},{"$f":"'mod1 6b'!Q18","v":0},{"$f":"'mod1 6b'!R18","v":0}]
["  Contribuição de Melhoria",{"$f":"'mod1 6b'!B19","v":0},{"$f":"'mod1 6b'!C19","v":0},{"$f":"LOOKUP($D$10,'mod1 6b'!$D$10:$O$10,'mod1 6b'!D19:O19)","v":0},{"$f":"LOOKUP($E$10,'mod1 6b'!$D$10:$O$10,'mod1 6b'!D19:O19)","v":0},{"$f":"'mod1 6b'!P19","v":0},{"$f":"'mod1 6b'!Q19","v":0},{"$f":"'mod1 6b'!R19","v":0}]
["Contribuições",{"$f":"'mod1 6b'!B20","v":0},{"$f":"'mod1 6b'!C20","v":0},{"$f":"LOOKUP($D$10,'mod1 6b'!$D$10:$O$10,'mod1 6b'!D20:O20)","v":0},{"$f":"LOOKUP($E$10,'mod1 6b'!$D$10:$O$10,'mod1 6b'!D20:O20)","v":0},{"$f":"'mod1 6b'!P20","v":0},{"$f":"'mod1 6b'!Q20","v":0},{"$f":"'mod1 6b'!R20","v":0}]
["Patrimoniais",{"$f":"'mod1 6b'!B21","v":46896},{"$f":"'mod1 6b'!C21","v":46896},{"$f":"LOOKUP($D$10,'mod1 6b'!$D$10:$O$10,'mod1 6b'!D21:O21)","v":7816},0,{"$f":"'mod1 6b'!P21","v":23448},{"$f":"'mod1 6b'!Q21","v":11994.18},{"$f":"'mod1 6b'!R21","v":34901.82}]
["Industriais",{"$f":"'mod1 6b'!B22","v":0},{"$f":"'mod1 6b'!C22","v":0},{"$f":"LOOKUP($D$10,'mod1 6b'!$D$10:$O$10,'mod1 6b'!D22:O22)","v":0},{"$f":"LOOKUP($E$10,'mod1 6b'!$D$10:$O$10,'mod1 6b'!D22:O22)","v":0},{"$f":"'mod1 6b'!P22","v":0},{"$f":"'mod1 6b'!Q22","v":0},{"$f":"'mod1 6b'!R22","v":0}]
["Agropecuárias",{"$f":"'mod1 6b'!B23","v":0},{"$f":"'mod1 6b'!C23","v":0},{"$f":"LOOKUP($D$10,'mod1 6b'!$D$10:$O$10,'mod1 6b'!D23:O23)","v":0},{"$f":"LOOKUP($E$10,'mod1 6b'!$D$10:$O$10,'mod1 6b'!D23:O23)","v":0},{"$f":"'mod1 6b'!P23","v":0},{"$f":"'mod1 6b'!Q23","v":0},{"$f":"'mod1 6b'!R23","v":0}]
["Serviços",{"$f":"'mod1 6b'!B24","v":18631500},{"$f":"'mod1 6b'!C24","v":18631500},{"$f":"LOOKUP($D$10,'mod1 6b'!$D$10:$O$10,'mod1 6b'!D24:O24)","v":3105250},1295608.81,{"$f":"'mod1 6b'!P24","v":9315750},{"$f":"'mod1 6b'!Q24","v":5782058.6400000006},{"$f":"'mod1 6b'!R24","v":12849441.359999999}]
["Transferências Correntes",{"$f":"'mod1 6b'!B25","v":0},{"$f":"'mod1 6b'!C25","v":0},{"$f":"LOOKUP($D$10,'mod1 6b'!$D$10:$O$10,'mod1 6b'!D25:O25)","v":0},{"$f":"LOOKUP($E$10,'mod1 6b'!$D$10:$O$10,'mod1 6b'!D25:O25)","v":0},{"$f":"'mod1 6b'!P25","v":0},{"$f":"'mod1 6b'!Q25","v":0},{"$f":"'mod1 6b'!R25","v":0}]
["(-) Contas Redutoras (ICMS,FPM,IPI Exp)",{"$f":"'mod1 6b'!B26","v":0},{"$f":"'mod1 6b'!C26","v":0},{"$f":"LOOKUP($D$10,'mod1 6b'!$D$10:$O$10,'mod1 6b'!D26:O26)","v":0},{"$f":"LOOKUP($E$10,'mod1 6b'!$D$10:$O$10,'mod1 6b'!D26:O26)","v":0},{"$f":"'mod1 6b'!P26","v":0},{"$f":"'mod1 6b'!Q26","v":0},{"$f":"'mod1 6b'!R26","v":0}]
["Outras Receitas Correntes",{"$f":"'mod1 6b'!B27","v":45000},{"$f":"'mod1 6b'!C27","v":45000},{"$f":"LOOKUP($D$10,'mod1 6b'!$D$10:$O$10,'mod1 6b'!D27:O27)","v":7500},72873.75,{"$f":"'mod1 6b'!P27","v":22500},{"$f":"'mod1 6b'!Q27","v":104634.70999999999},{"$f":"'mod1 6b'!R27","v":-59634.709999999992}]
["Receitas de Capital (B)",{"$f":"'mod1 6b'!B28","v":0},{"$f":"'mod1 6b'!C28","v":0},{"$f":"LOOKUP($D$10,'mod1 6b'!$D$10:$O$10,'mod1 6b'!D28:O28)","v":0},{"$f":"LOOKUP($E$10,'mod1 6b'!$D$10:$O$10,'mod1 6b'!D28:O28)","v":0},{"$f":"'mod1 6b'!P28","v":0},{"$f":"'mod1 6b'!Q28","v":0},{"$f":"'mod1 6b'!R28","v":0}]
["Operações de Crédito",{"$f":"'mod1 6b'!B29","v":0},{"$f":"'mod1 6b'!C29","v":0},{"$f":"LOOKUP($D$10,'mod1 6b'!$D$10:$O$10,'mod1 6b'!D29:O29)","v":0},{"$f":"LOOKUP($E$10,'mod1 6b'!$D$10:$O$10,'mod1 6b'!D29:O29)","v":0},{"$f":"'mod1 6b'!P29","v":0},{"$f":"'mod1 6b'!Q29","v":0},{"$f":"'mod1 6b'!R29","v":0}]
["    Refinanciamento da Dívida ",{"$f":"'mod1 6b'!B30","v":0},{"$f":"'mod1 6b'!C30","v":0},{"$f":"LOOKUP($D$10,'mod1 6b'!$D$10:$O$10,'mod1 6b'!D30:O30)","v":0},{"$f":"LOOKUP($E$10,'mod1 6b'!$D$10:$O$10,'mod1 6b'!D30:O30)","v":0},{"$f":"'mod1 6b'!P30","v":0},{"$f":"'mod1 6b'!Q30","v":0},{"$f":"'mod1 6b'!R30","v":0}]
["    Outras Operações de Crédito",{"$f":"'mod1 6b'!B31","v":0},{"$f":"'mod1 6b'!C31","v":0},{"$f":"LOOKUP($D$10,'mod1 6b'!$D$10:$O$10,'mod1 6b'!D31:O31)","v":0},{"$f":"LOOKUP($E$10,'mod1 6b'!$D$10:$O$10,'mod1 6b'!D31:O31)","v":0},{"$f":"'mod1 6b'!P31","v":0},{"$f":"'mod1 6b'!Q31","v":0},{"$f":"'mod1 6b'!R31","v":0}]
["Alienação de Bens",{"$f":"'mod1 6b'!B32","v":0},{"$f":"'mod1 6b'!C32","v":0},{"$f":"LOOKUP($D$10,'mod1 6b'!$D$10:$O$10,'mod1 6b'!D32:O32)","v":0},{"$f":"LOOKUP($E$10,'mod1 6b'!$D$10:$O$10,'mod1 6b'!D32:O32)","v":0},{"$f":"'mod1 6b'!P32","v":0},{"$f":"'mod1 6b'!Q32","v":0},{"$f":"'mod1 6b'!R32","v":0}]
["Amortização de Empréstimos",{"$f":"'mod1 6b'!B33","v":0},{"$f":"'mod1 6b'!C33","v":0},{"$f":"LOOKUP($D$10,'mod1 6b'!$D$10:$O$10,'mod1 6b'!D33:O33)","v":0},{"$f":"LOOKUP($E$10,'mod1 6b'!$D$10:$O$10,'mod1 6b'!D33:O33)","v":0},{"$f":"'mod1 6b'!P33","v":0},{"$f":"'mod1 6b'!Q33","v":0},{"$f":"'mod1 6b'!R33","v":0}]
["Transferências de Capital",{"$f":"'mod1 6b'!B34","v":0},{"$f":"'mod1 6b'!C34","v":0},{"$f":"LOOKUP($D$10,'mod1 6b'!$D$10:$O$10,'mod1 6b'!D34:O34)","v":0},{"$f":"LOOKUP($E$10,'mod1 6b'!$D$10:$O$10,'mod1 6b'!D34:O34)","v":0},{"$f":"'mod1 6b'!P34","v":0},{"$f":"'mod1 6b'!Q34","v":0},{"$f":"'mod1 6b'!R34","v":0}]
["Outras Receitas de Capital",{"$f":"'mod1 6b'!B35","v":0},{"$f":"'mod1 6b'!C35","v":0},{"$f":"LOOKUP($D$10,'mod1 6b'!$D$10:$O$10,'mod1 6b'!D35:O35)","v":0},{"$f":"LOOKUP($E$10,'mod1 6b'!$D$10:$O$10,'mod1 6b'!D35:O35)","v":0},{"$f":"'mod1 6b'!P35","v":0},{"$f":"'mod1 6b'!Q35","v":0},{"$f":"'mod1 6b'!R35","v":0}]
["RECEITA TOTAL  (A+B)",{"$f":"'mod1 6b'!B36","v":18723396},{"$f":"'mod1 6b'!C36","v":18723396},{"$f":"LOOKUP($D$10,'mod1 6b'!$D$10:$O$10,'mod1 6b'!D36:O36)","v":3120566},1368482.56,{"$f":"'mod1 6b'!P36","v":9361698},{"$f":"'mod1 6b'!Q36","v":5898687.5300000012},{"$f":"'mod1 6b'!R36","v":12824708.469999999}]
["DESPESAS","Dotação Anual",null,"3ºBIMESTRE",null,"Acumulado"]
["Categoria Econômica/Natureza","Inicial","Atualizada","Empenhado","Liquidado","Empenhado","Liquidado","A empenhar"]
["Despesas Correntes (C)",{"$f":"'mod1 6b'!B39","v":20083396},{"$f":"'mod1 6b'!C39","v":20083396},{"$f":"SUM(D40:D43)","v":3164776.51},{"$f":"SUM(E40:E43)","v":3164776.51},{"$f":"'mod1 6b'!P39","v":7599806.5},{"$f":"'mod1 6b'!Q39","v":7599806.5},{"$f":"'mod1 6b'!R39","v":12483589.5}]
["Pessoal/Encargos Sociais",{"$f":"'mod1 6b'!B40","v":11661496},{"$f":"'mod1 6b'!C40","v":11661496},1376690.85,1376690.85,{"$f":"'mod1 6b'!P40","v":3243810.46},{"$f":"'mod1 6b'!Q40","v":3243810.46},{"$f":"'mod1 6b'!R40","v":8417685.5399999991}]
["Juros/Encargos da Dívida Interna",{"$f":"'mod1 6b'!B41","v":0},{"$f":"'mod1 6b'!C41","v":0},{"$f":"LOOKUP($D$10,'mod1 6b'!$D$10:$O$10,'mod1 6b'!D41:O41)","v":0},{"$f":"LOOKUP($E$10,'mod1 6b'!$D$10:$O$10,'mod1 6b'!D41:O41)","v":0},{"$f":"'mod1 6b'!P41","v":0},{"$f":"'mod1 6b'!Q41","v":0},{"$f":"'mod1 6b'!R41","v":0}]
["Juros/Encargos Dívida Externa",{"$f":"'mod1 6b'!B42","v":0},{"$f":"'mod1 6b'!C42","v":0},{"$f":"LOOKUP($D$10,'mod1 6b'!$D$10:$O$10,'mod1 6b'!D42:O42)","v":0},{"$f":"LOOKUP($E$10,'mod1 6b'!$D$10:$O$10,'mod1 6b'!D42:O42)","v":0},{"$f":"'mod1 6b'!P42","v":0},{"$f":"'mod1 6b'!Q42","v":0},{"$f":"'mod1 6b'!R42","v":0}]
["Outras Despesas Correntes",{"$f":"'mod1 6b'!B43","v":8421900},{"$f":"'mod1 6b'!C43","v":8421900},1788085.66,1788085.66,{"$f":"'mod1 6b'!P43","v":4355996.04},{"$f":"'mod1 6b'!Q43","v":4355996.04},{"$f":"'mod1 6b'!R43","v":4065903.96}]
["Despesas de Capital (D)",{"$f":"'mod1 6b'!B44","v":40000},{"$f":"'mod1 6b'!C44","v":40000},2078,2078,{"$f":"'mod1 6b'!P44","v":6568},{"$f":"'mod1 6b'!Q44","v":6568},{"$f":"'mod1 6b'!R44","v":33432}]
["Investimentos",{"$f":"'mod1 6b'!B45","v":40000},{"$f":"'mod1 6b'!C45","v":40000},2078,2078,{"$f":"'mod1 6b'!P45","v":6568},{"$f":"'mod1 6b'!Q45","v":6568},{"$f":"'mod1 6b'!R45","v":33432}]
["Inversões Financeiras",{"$f":"'mod1 6b'!B46","v":0},{"$f":"'mod1 6b'!C46","v":0},{"$f":"LOOKUP($D$10,'mod1 6b'!$D$10:$O$10,'mod1 6b'!D46:O46)","v":0},{"$f":"LOOKUP($E$10,'mod1 6b'!$D$10:$O$10,'mod1 6b'!D46:O46)","v":0},{"$f":"'mod1 6b'!P46","v":0},{"$f":"'mod1 6b'!Q46","v":0},{"$f":"'mod1 6b'!R46","v":0}]
["Amortização da Dívida",{"$f":"'mod1 6b'!B47","v":0},{"$f":"'mod1 6b'!C47","v":0},{"$f":"LOOKUP($D$10,'mod1 6b'!$D$10:$O$10,'mod1 6b'!D47:O47)","v":0},{"$f":"LOOKUP($E$10,'mod1 6b'!$D$10:$O$10,'mod1 6b'!D47:O47)","v":0},{"$f":"'mod1 6b'!P47","v":0},{"$f":"'mod1 6b'!Q47","v":0},{"$f":"'mod1 6b'!R47","v":0}]
["  Amortização do Refin. Dív. Mobil.",{"$f":"'mod1 6b'!B48","v":0},{"$f":"'mod1 6b'!C48","v":0},{"$f":"LOOKUP($D$10,'mod1 6b'!$D$10:$O$10,'mod1 6b'!D48:O48)","v":0},{"$f":"LOOKUP($E$10,'mod1 6b'!$D$10:$O$10,'mod1 6b'!D48:O48)","v":0},{"$f":"'mod1 6b'!P48","v":0},{"$f":"'mod1 6b'!Q48","v":0},{"$f":"'mod1 6b'!R48","v":0}]
["  Outras Amortizações",{"$f":"'mod1 6b'!B49","v":0},{"$f":"'mod1 6b'!C49","v":0},{"$f":"LOOKUP($D$10,'mod1 6b'!$D$10:$O$10,'mod1 6b'!D49:O49)","v":0},{"$f":"LOOKUP($E$10,'mod1 6b'!$D$10:$O$10,'mod1 6b'!D49:O49)","v":0},{"$f":"'mod1 6b'!P49","v":0},{"$f":"'mod1 6b'!Q49","v":0},{"$f":"'mod1 6b'!R49","v":0}]
["Outras Despesas de Capital",{"$f":"'mod1 6b'!B50","v":0},{"$f":"'mod1 6b'!C50","v":0},{"$f":"LOOKUP($D$10,'mod1 6b'!$D$10:$O$10,'mod1 6b'!D50:O50)","v":0},{"$f":"LOOKUP($E$10,'mod1 6b'!$D$10:$O$10,'mod1 6b'!D50:O50)","v":0},{"$f":"'mod1 6b'!P50","v":0},{"$f":"'mod1 6b'!Q50","v":0},{"$f":"'mod1 6b'!R50","v":0}]
["Reserva de Contingência (E)",{"$f":"'mod1 6b'!B51","v":0},{"$f":"'mod1 6b'!C51","v":0}]
["DESPESA TOTAL (C+D)",{"$f":"'mod1 6b'!B52","v":20123396},{"$f":"'mod1 6b'!C52","v":20123396},3166854.51,3166854.51,{"$f":"'mod1 6b'!P52","v":7606374.5},{"$f":"'mod1 6b'!Q52","v":7606374.5},{"$f":"'mod1 6b'!R52","v":12517021.5}]
["SUPERÁVIT/DÉFICIT (A+B–C-D)",{"$f":"'mod1 6b'!B53","v":-1400000},{"$f":"'mod1 6b'!C53","v":-1400000},-46288.51,-1798371.95,{"$f":"F36-F39-F44","v":1755323.5},{"$f":"'mod1 6b'!Q53","v":-1707686.9699999988}]
[]
[]
[]
[]
["Prof.Dr.Isnard de A.Câmara Neto",null,"Jessé César Pinto",null,null,"Josimere dos Santos Costa"]
["Diretor Presidente",null,"                            CRC: 1SP 297373/O-5 ",null,null,null,"Controlador Interno"]

{"sheet":"mod1 anexo","index":6,"n_rows":57,"n_cols":9,"rows_kept":57,"cut":false,"hidden":false,"merged":[[0,0,0,8],[1,0,1,8],[2,0,2,8],[7,0,7,8],[8,0,10,0],[50,6,50,8],[50,2,50,4],[8,7,8,8],[8,3,8,6],[8,1,8,2],[9,3,9,4],[9,5,9,6],[9,7,10,7],[9,8,10,8],[9,1,10,1],[9,2,10,2]]}
["                                                                                                              "]
[" (Artigo  52, Incisos I e II, alíneas “a” e “b”, da LC. 101/00)"]
["RESULTADO DA EXECUÇÃO ORÇAMENTÁRIA PODERES/ÓRGÃOS"]
[]
[]
[{"$f":"'mod1 6b'!A5","v":"MUNICÍPIO DE TAUBATÉ  -  FUNDAÇÃO UNIVERSITÁRIA DE TAUBATÉ"}]
["3º BIMESTRE DE  2014"]
["Valores expressos em R$"]
["PODERES/ÓRGÃOS","Receitas ",null,"Despesas",null,null,null,"Resultados"]
[null,"Bimestre","Acumulado (1)","Empenhada",null,"Liquidada",null,"Acumulado (3)=(1-2)","% = (3) / Total  (1)"]
[null,null,null,"Bimestre","Acumulado (2)","Bimestre","Acumulado"]
["órgão"]
["ADMINISTRAÇÃO DIRETA*",{"$f":"B16","v":1368482.56},5898687.5300000003,3168932.51,7599806.5,3168932.51,7599806.5,{"$f":"C13-E13","v":-1701118.9699999997},{"$f":"IF($C$45>0,H13/$C$45,\"\")","v":-0.28838940210823466}]
["ADMINISTRAÇÃO INDIRETA",null,null,null,null,null,null,null,0]
["Autarquia “X”",null,null,null,null,null,null,{"$f":"C15-E15","v":0},0]
["Fundação Universitaria",1368482.56,5898687.5300000003,3168932.51,7599806.5,{"$f":"D16","v":3168932.51},{"$f":"E16","v":7599806.5},{"$f":"H13","v":-1701118.9699999997},1.78E-2]
["Empresa Pública Dependente “Z”",null,null,null,null,null,null,0,0]
[null,null,null,null,null,null,null,0,0]
[null,null,null,null,null,null,null,0,0]
[null,null,null,null,null,null,null,0,0]
[null,null,null,null,null,null,null,0,0]
[null,null,null,null,null,null,null,0,0]
[" ",null,null,null,null,null,null,0,0]
[" ",null,null,null,null,null,null,0,0]
[" ",null,null,null,null,null,null,{"$f":"C25-E25","v":0},0]
[null,null,null,null,null,null,null,0,0]
[null,null,null,null,null,null,null,0,0]
[null,null,null,null,null,null,null,0,0]
[null,null,null,null,null,null,null,0,0]
[null,null,null,null,null,null,null,0,0]
[null,null,null,null,null,null,null,0,0]
[null,null,null,null,null,null,null,0,0]
[null,null,null,null,null,null,null,0,0]
[null,null,null,null,null,null,null,0,0]
[null,null,null,null,null,null,null,0,0]
[null,null,null,null,null,null,null,0,0]
[null,null,null,null,null,null,null,0,0]
[null,null,null,null,null,null,null,0,0]
[null,null,null,null,null,null,null,0,{"$f":"IF($C$45>0,H39/$C$45,\"\")","v":0}]
[null,null,null,null,null,null,null,0,0]
[null,null,null,null,null,null,null,0,0]
[null,null,null,null,null,null,null,0,0]
[null,null,null,null,null,null,null,0,0]
[null,null,null,null,null,null,null,0,0]
["TOTAIS:",{"$f":"B13+B14","v":1368482.56},5898687.5300000003,3168932.51,7599806.5,3168932.51,7599806.5,-1701118.9699999997,-0.28838940210823466]
[" *Prefeitura e Câmara"]
[]
[]
[]
[]
["         Prof.Dr.Isnard de A.Câmara Neto",null,"Jessé César Pinto",null,null,null,"Josimere dos Santos costa"]
["Diretor Presidente",null,null,"CRC :1SP 297373/O-5",null,null,null,"Controlador Interno"]
[]
[]
[]
[]
[" "]

{"sheet":"mod2 6b","index":7,"n_rows":326,"n_cols":20,"rows_kept":326,"cut":false,"hidden":false,"merged":[[0,0,0,19],[1,0,1,19],[3,0,3,19],[6,0,6,19],[7,1,8,1],[7,0,8,0],[7,3,7,4],[7,11,7,12],[324,2,324,3],[7,13,7,14],[324,17,324,19],[324,8,324,10],[7,15,7,16],[7,17,7,19],[7,5,7,6],[7,7,7,8],[7,9,7,10]]}
["RELATÓRIO RESUMIDO DA EXECUÇÃO ORÇAMENTÁRIA "]
[" (Artigo  52, Inciso II, alínea “c” da LC. 101/00)"]
[]
["- ADMINISTRAÇÃO DIRETA / INDIRETA / FUNDACIONAL -"]
[{"$f":"'mod1 6b'!A5","v":"MUNICÍPIO DE TAUBATÉ  -  FUNDAÇÃO UNIVERSITÁRIA DE TAUBATÉ"}]
["3º BIMESTRE DE 2014"]
["Valores expressos em R$"]
["Cód. Função","Cód. Subf.","DESPESAS","Dotação Anual",null,"1º Bimestre",null,"2º Bimestre",null,"3º Bimestre",null,"4º Bimestre",null,"5º Bimestre",null,"6º Bimestre",null,"Acumulado"]
[null,null,"Funções/Subfunções","Inicial","Atualizada","Empenhado","Liquidado","Empenhado","Liquidado","Empenhado","Liquidado","Empenhado","Liquidado","Empenhado","Liquidado","Empenhado","Liquidado","Empenhado","Liquidado","A empenhar"]
[null,null,null,null,null,1,2,3,4,5,6,7,8,9,10,11,12]
[null,null,"item",null,null,null,null,null,null,null,null,null,null,null,null,null,null,{"$f":"F11+H11+J11+L11+N11+P11","v":0},0,{"$f":"E11-R11","v":0}]
[1,null,"LEGISLATIVO",{"$f":"SUM(D13:D22)","v":0},{"$f":"SUM(E13:E22)","v":0},0,0,0,0,0,0,0,0,0,0,0,0,0,0,{"$f":"E12-R12","v":0}]
[1,31,"Ação Legislativa",null,null,null,null,null,null,null,null,null,null,null,null,null,null,0,0,{"$f":"E13-R13","v":0}]
[1,32,"Controle Externo",null,null,null,null,null,null,null,null,null,null,null,null,null,null,0,0,{"$f":"E14-R14","v":0}]
[1,null,null,null,null,null,null,null,null,null,null,null,null,null,null,null,null,0,0,{"$f":"E15-R15","v":0}]
[1,null,null,null,null,null,null,null,null,null,null,null,null,null,null,null,null,{"$f":"F16+H16+J16+L16+N16+P16","v":0},{"$f":"G16+I16+K16+M16+O16+Q16","v":0},{"$f":"E16-R16","v":0}]
[1,null,null,null,null,null,null,null,null,null,null,null,null,null,null,null,null,0,0,0]
[1,null,null,null,null,null,null,null,null,null,null,null,null,null,null,null,null,0,0,0]
[1,null,null,null,null,null,null,null,null,null,null,null,null,null,null,null,null,0,0,0]
[1,null,null,null,null,null,null,null,null,null,null,null,null,null,null,null,null,0,0,0]
[1,null,null,null,null,null,null,null,null,null,null,null,null,null,null,null,null,0,0,0]
[1,null,null,null,null,null,null,null,null,null,null,null,null,null,null,null,null,0,0,0]
[2,null,"JUDI CIÁRIA",{"$f":"SUM(D24:D30)","v":0},{"$f":"SUM(E24:E30)","v":0},0,0,0,0,0,0,0,0,0,0,0,0,0,0,0]
[2,61,"Ação Judicária",null,null,null,null,null,null,null,null,null,null,null,null,null,null,0,0,0]
[2,62,"Defesa Int.Públ.no Proc.Judiciário",null,null,null,null,null,null,null,null,null,null,null,null,null,null,0,0,0]
[2,null,null,null,null,null,null,null,null,null,null,null,null,null,null,null,null,0,0,0]
[2,null,null,null,null,null,null,null,null,null,null,null,null,null,null,null,null,0,0,0]
[2,null,null,null,null,null,null,null,null,null,null,null,null,null,null,null,null,0,0,0]
[2,null,null,null,null,null,null,null,null,null,null,null,null,null,null,null,null,0,0,0]
[2,null,null,null,null,null,null,null,null,null,null,null,null,null,null,null,null,0,0,0]
[3,null,"ESSENCIAL À JUSTIÇA",{"$f":"SUM(D32:D38)","v":0},{"$f":"SUM(E32:E38)","v":0},0,0,0,0,0,0,0,0,0,0,0,0,0,0,0]
[3,91,"Defesa da Ordem Judiciária",null,null,null,null,null,null,null,null,null,null,null,null,null,null,0,0,0]
[3,92,"Representação Judicial e Extrajudicial",null,null,null,null,null,null,null,null,null,null,null,null,null,null,0,0,0]
[3,null,null,null,null,null,null,null,null,null,null,null,null,null,null,null,null,0,0,0]
[3,null,null,null,null,null,null,null,null,null,null,null,null,null,null,null,null,0,0,0]
[3,null,null,null,null,null,null,null,null,null,null,null,null,null,null,null,null,0,0,0]
[3,null,null,null,null,null,null,null,null,null,null,null,null,null,null,null,null,0,0,0]
[3,null,null,null,null,null,null,null,null,null,null,null,null,null,null,null,null,0,0,0]
[4,null,"ADMINISTRAÇÃO",{"$f":"SUM(D40:D60)","v":0},{"$f":"SUM(E40:E60)","v":0},0,0,0,0,0,0,0,0,0,0,0,0,0,0,0]
[4,121,"Planejamento e Orçamento",null,null,null,null,null,null,null,null,null,null,null,null,null,null,0,0,0]
[4,122,"Administração Geral",null,null,null,null,null,null,null,null,null,null,null,null,null,null,0,0,0]
[4,123,"Administração Financeira",null,null,null,null,null,null,null,null,null,null,null,null,null,null,0,0,0]
[4,124,"Controle Interno",null,null,null,null,null,null,null,null,null,null,null,null,null,null,0,0,0]
[4,125,"Normatização e Fiscalização",null,null,null,null,null,null,null,null,null,null,null,null,null,null,0,0,0]
[4,126,"Tecnologia da Informação",null,null,null,null,null,null,null,null,null,null,null,null,null,null,0,0,0]
[4,127,"Ordenamento Territorial",null,null,null,null,null,null,null,null,null,null,null,null,null,null,0,0,0]
[4,128,"Formação de Recursos Humanos",null,null,null,null,null,null,null,null,null,null,null,null,null,null,0,0,0]
[4,129,"Administração de Receitas",null,null,null,null,null,null,null,null,null,null,null,null,null,null,0,0,0]
[4,130,"Administração de Concessões",null,null,null,null,null,null,null,null,null,null,null,null,null,null,0,0,0]
[4,131,"Comunicação Social",null,null,null,null,null,null,null,null,null,null,null,null,null,null,0,0,0]
[4,null,null,null,null,null,null,null,null,null,null,null,null,null,null,null,null,0,0,0]
[4,null,null,null,null,null,null,null,null,null,null,null,null,null,null,null,null,0,0,0]
[4,null,null,null,null,null,null,null,null,null,null,null,null,null,null,null,null,0,0,0]
[4,null,null,null,null,null,null,null,null,null,null,null,null,null,null,null,null,0,0,0]
[4,null,null,null,null,null,null,null,null,null,null,null,null,null,null,null,null,0,0,0]
[4,null,null,null,null,null,null,null,null,null,null,null,null,null,null,null,null,0,0,0]
[4,null,null,null,null,null,null,null,null,null,null,null,null,null,null,null,null,0,0,0]
[4,null,null,null,null,null,null,null,null,null,null,null,null,null,null,null,null,0,0,0]
[4,null,null,null,null,null,null,null,null,null,null,null,null,null,null,null,null,0,0,0]
[4,null,null,null,null,null,null,null,null,null,null,null,null,null,null,null,null,0,0,0]
[5,null,"DEFESA NACIONAL",{"$f":"SUM(D62:D69)","v":0},{"$f":"SUM(E62:E69)","v":0},0,0,0,0,0,0,0,0,0,0,0,0,0,0,0]
[5,151,"Defesa Aérea",null,null,null,null,null,null,null,null,null,null,null,null,null,null,0,0,0]
[5,152,"Defesa Naval",null,null,null,null,null,null,null,null,null,null,null,null,null,null,0,0,0]
[5,153,"Defesa Terrestre",null,null,null,null,null,null,null,null,null,null,null,null,null,null,0,0,0]
[5,null,null,null,null,null,null,null,null,null,null,null,null,null,null,null,null,0,0,0]
[5,null,null,null,null,null,null,null,null,null,null,null,null,null,null,null,null,0,0,0]
[5,null,null,null,null,null,null,null,null,null,null,null,null,null,null,null,null,0,0,0]
[5,null,null,null,null,null,null,null,null,null,null,null,null,null,null,null,null,0,0,0]
[5,null,null,null,null,null,null,null,null,null,null,null,null,null,null,null,null,0,0,0]
[6,null,"SEGURANÇA PÚBLICA",{"$f":"SUM(D71:D78)","v":0},{"$f":"SUM(E71:E78)","v":0},0,0,0,0,0,0,0,0,0,0,0,0,0,0,0]
[6,181,"Policiamento",null,null,null,null,null,null,null,null,null,null,null,null,null,null,0,0,0]
[6,182,"Defesa Civil",null,null,null,null,null,null,null,null,null,null,null,null,null,null,0,0,0]
[6,183,"Informação e Inteligência",null,null,null,null,null,null,null,null,null,null,null,null,null,null,0,0,0]
[6,null,null,null,null,null,null,null,null,null,null,null,null,null,null,null,null,0,0,0]
[6,null,null,null,null,null,null,null,null,null,null,null,null,null,null,null,null,0,0,0]
[6,null,null,null,null,null,null,null,null,null,null,null,null,null,null,null,null,0,0,0]
[6,null,null,null,null,null,null,null,null,null,null,null,null,null,null,null,null,{"$f":"F77+H77+J77+L77+N77+P77","v":0},{"$f":"G77+I77+K77+M77+O77+Q77","v":0},{"$f":"E77-R77","v":0}]
[6,null,null,null,null,null,null,null,null,null,null,null,null,null,null,null,null,0,0,0]
[7,null,"RELAÇÕES EXTERIORES",{"$f":"SUM(D80:D86)","v":0},{"$f":"SUM(E80:E86)","v":0},0,0,0,0,0,0,0,0,0,0,0,0,0,0,0]
[7,211,"Relações Diplomáticas",null,null,null,null,null,null,null,null,null,null,null,null,null,null,0,0,0]
[7,212,"Cooperação Internacional",null,null,null,null,null,null,null,null,null,null,null,null,null,null,0,0,0]
[7,null,null,null,null,null,null,null,null,null,null,null,null,null,null,null,null,0,0,0]
[7,null,null,null,null,null,null,null,null,null,null,null,null,null,null,null,null,0,0,0]
[7,null,null,null,null,null,null,null,null,null,null,null,null,null,null,null,null,0,0,0]
[7,null,null,null,null,null,null,null,null,null,null,null,null,null,null,null,null,0,0,0]
[7,null,null,null,null,null,null,null,null,null,null,null,null,null,null,null,null,0,0,0]
[8,null,"ASSISTÊNCIA SOCIAL",{"$f":"SUM(D88:D96)","v":0},{"$f":"SUM(E88:E96)","v":0},0,0,0,0,0,0,0,0,0,0,0,0,0,0,0]
[8,241,"Assistência ao Idoso",null,null,null,null,null,null,null,null,null,null,null,null,null,null,0,0,0]
[8,242,"Assist. ao Portador de Deficiência",null,null,null,null,null,null,null,null,null,null,null,null,null,null,0,0,0]
[8,243,"Assist. à Criança e ao Adolescente",null,null,null,null,null,null,null,null,null,null,null,null,null,null,0,0,0]
[8,244,"Assistência Comunitária",null,null,null,null,null,null,null,null,null,null,null,null,null,null,0,0,0]
[8,null,null,null,null,null,null,null,null,null,null,null,null,null,null,null,null,0,0,0]
[8,null,null,null,null,null,null,null,null,null,null,null,null,null,null,null,null,0,0,0]
[8,null,null,null,null,null,null,null,null,null,null,null,null,null,null,null,null,0,0,0]
[8,null,null,null,null,null,null,null,null,null,null,null,null,null,null,null,null,0,0,0]
[8,null,null,null,null,null,null,null,null,null,null,null,null,null,null,null,null,0,0,0]
[9,null,"PREVIDÊNCIA SOCIAL",{"$f":"SUM(D98:D106)","v":0},{"$f":"SUM(E98:E106)","v":0},0,0,0,0,0,0,0,0,0,0,0,0,0,0,0]
[9,271,"Previdência Básica",null,null,null,null,null,null,null,null,null,null,null,null,null,null,0,0,0]
[9,272,"Previdência do Regime Estatutário",null,null,null,null,null,null,null,null,null,null,null,null,null,null,0,0,0]
[9,273,"Previdência Complementar",null,null,null,null,null,null,null,null,null,null,null,null,null,null,0,0,0]
[9,274,"Previdência Especial",null,null,null,null,null,null,null,null,null,null,null,null,null,null,0,0,0]
[9,null,null,null,null,null,null,null,null,null,null,null,null,null,null,null,null,0,0,0]
[9,null,null,null,null,null,null,null,null,null,null,null,null,null,null,null,null,0,0,0]
[9,null,null,null,null,null,null,null,null,null,null,null,null,null,null,null,null,0,0,0]
[9,null,null,null,null,null,null,null,null,null,null,null,null,null,null,null,null,0,0,0]
[9,null,null,null,null,null,null,null,null,null,null,null,null,null,null,null,null,0,0,0]
[4,null,"ADMINISTRAÇÃO",20123396,20123396,3128045.3,3128045.3,1311474.69,1311474.69,3166854.51,3166854.51,0,0,0,0,0,0,{"$f":"F107+H107+J107+L107+N107+P107","v":7606374.5},7606374.5,12517021.5]
[10,301,"Atenção Básica",null,null,null,null,null,null,null,null,null,null,null,null,null,null,0,0,0]
[10,302,"Assistência Hospitalar e Ambulatorial",null,null,null,null,null,null,null,null,null,null,null,null,null,null,0,0,0]
[10,303,"Suporte Profilático e Terapêutico",null,null,null,null,null,null,null,null,null,null,null,null,null,null,0,0,0]
[10,304,"Vigilância Sanitária",null,null,null,null,null,null,null,null,null,null,null,null,null,null,0,0,0]
[10,305,"Vigilância Epidemiológica",null,null,null,null,null,null,null,null,null,null,null,null,null,null,0,0,0]
[10,306,"Alimentação e Nutrição",null,null,null,null,null,null,null,null,null,null,null,null,null,null,0,0,0]
[10,null,null,null,null,null,null,null,null,null,null,null,null,null,null,null,null,0,0,0]
[10,null,null,null,null,null,null,null,null,null,null,null,null,null,null,null,null,0,0,0]
[10,null,null,null,null,null,null,null,null,null,null,null,null,null,null,null,null,0,0,0]
[10,null,null,null,null,null,null,null,null,null,null,null,null,null,null,null,null,0,0,0]
[10,null,null,null,null,null,null,null,null,null,null,null,null,null,null,null,null,0,0,0]
[10,null,null,null,null,null,null,null,null,null,null,null,null,null,null,null,null,0,0,0]
[10,null,null,null,null,null,null,null,null,null,null,null,null,null,null,null,null,0,0,0]
[10,null,null,null,null,null,null,null,null,null,null,null,null,null,null,null,null,0,0,0]
[10,null,null,null,null,null,null,null,null,null,null,null,null,null,null,null,null,0,0,0]
[10,null,null,null,null,null,null,null,null,null,null,null,null,null,null,null,null,0,0,0]
[11,null,"TRABALHO",{"$f":"SUM(D125:D133)","v":0},{"$f":"SUM(E125:E133)","v":0},0,0,0,0,0,0,0,0,0,0,0,0,0,0,0]
[11,331,"Proteção e Benefícios ao Trabalhador",null,null,null,null,null,null,null,null,null,null,null,null,null,null,0,0,0]
[11,332,"Relações de Trabalho",null,null,null,null,null,null,null,null,null,null,null,null,null,null,0,0,0]
[11,333,"Empregabilidade",null,null,null,null,null,null,null,null,null,null,null,null,null,null,0,0,0]
[11,334,"Fomento ao Trabalho",null,null,null,null,null,null,null,null,null,null,null,null,null,null,0,0,0]
[11,null,null,null,null,null,null,null,null,null,null,null,null,null,null,null,null,0,0,0]
[11,null,null,null,null,null,null,null,null,null,null,null,null,null,null,null,null,0,0,0]
[11,null,null,null,null,null,null,null,null,null,null,null,null,null,null,null,null,0,0,0]
[11,null,null,null,null,null,null,null,null,null,null,null,null,null,null,null,null,0,0,0]
[11,null,null,null,null,null,null,null,null,null,null,null,null,null,null,null,null,0,0,0]
[12,null,"EDUCAÇÃO",{"$f":"SUM(D135:D152)","v":0},{"$f":"SUM(E135:E152)","v":0},0,0,0,0,0,0,0,0,0,0,0,0,0,0,0]
[12,361,"Ensino Fundamental",null,null,null,null,null,null,null,null,null,null,null,null,null,null,0,0,0]
[12,362,"Ensino Médio",null,null,null,null,null,null,null,null,null,null,null,null,null,null,0,0,0]
[12,363,"Ensino Profissional",null,null,null,null,null,null,null,null,null,null,null,null,null,null,0,0,0]
[12,364,"Ensino Superior",null,null,null,null,null,null,null,null,null,null,null,null,null,null,0,0,0]
[12,365,"Educação Infantil",null,null,null,null,null,null,null,null,null,null,null,null,null,null,0,0,0]
[12,366,"Educação de Jovens e Adultos",null,null,null,null,null,null,null,null,null,null,null,null,null,null,0,0,0]
[12,367,"Educação Especial",null,null,null,null,null,null,null,null,null,null,null,null,null,null,{"$f":"F141+H141+J141+L141+N141+P141","v":0},{"$f":"G141+I141+K141+M141+O141+Q141","v":0},{"$f":"E141-R141","v":0}]
[12,null,null,null,null,null,null,null,null,null,null,null,null,null,null,null,null,0,0,0]
[12,null,null,null,null,null,null,null,null,null,null,null,null,null,null,null,null,0,0,0]
[12,null,null,null,null,null,null,null,null,null,null,null,null,null,null,null,null,0,0,0]
[12,null,null,null,null,null,null,null,null,null,null,null,null,null,null,null,null,0,0,0]
[12,null,null,null,null,null,null,null,null,null,null,null,null,null,null,null,null,0,0,0]
[12,null,null,null,null,null,null,null,null,null,null,null,null,null,null,null,null,0,0,0]
[12,null,null,null,null,null,null,null,null,null,null,null,null,null,null,null,null,0,0,0]
[12,null,null,null,null,null,null,null,null,null,null,null,null,null,null,null,null,0,0,0]
[12,null,null,null,null,null,null,null,null,null,null,null,null,null,null,null,null,0,0,0]
[12,null,null,null,null,null,null,null,null,null,null,null,null,null,null,null,null,0,0,0]
[12,null,null,null,null,null,null,null,null,null,null,null,null,null,null,null,null,0,0,0]
[13,null,"CULTURA",{"$f":"SUM(D154:D166)","v":0},{"$f":"SUM(E154:E166)","v":0},0,0,0,0,0,0,0,0,0,0,0,0,0,0,0]
[13,391,"Patr. Histórico, Artístico e Arqueológico",null,null,null,null,null,null,null,null,null,null,null,null,null,null,0,0,0]
[13,392,"Difusão Cultural",null,null,null,null,null,null,null,null,null,null,null,null,null,null,0,0,0]
[13,null,null,null,null,null,null,null,null,null,null,null,null,null,null,null,null,0,0,0]
[13,null,null,null,null,null,null,null,null,null,null,null,null,null,null,null,null,0,0,0]
[13,null,null,null,null,null,null,null,null,null,null,null,null,null,null,null,null,0,0,0]
[13,null,null,null,null,null,null,null,null,null,null,null,null,null,null,null,null,0,0,0]
[13,null,null,null,null,null,null,null,null,null,null,null,null,null,null,null,null,0,0,0]
[13,null,null,null,null,null,null,null,null,null,null,null,null,null,null,null,null,0,0,0]
[13,null,null,null,null,null,null,null,null,null,null,null,null,null,null,null,null,0,0,0]
[13,null,null,null,null,null,null,null,null,null,null,null,null,null,null,null,null,0,0,0]
[13,null,null,null,null,null,null,null,null,null,null,null,null,null,null,null,null,0,0,0]
[13,null,null,null,null,null,null,null,null,null,null,null,null,null,null,null,null,0,0,0]
[13,null,null,null,null,null,null,null,null,null,null,null,null,null,null,null,null,0,0,0]
[14,null,"DIRETORIA DA CIDADANIA",{"$f":"SUM(D168:D175)","v":0},{"$f":"SUM(E168:E175)","v":0},0,0,0,0,0,0,0,0,0,0,0,0,0,0,0]
[14,421,"Custódia e Reintegração Social",null,null,null,null,null,null,null,null,null,null,null,null,null,null,0,0,0]
[14,422,"Direitos Individuais, Coletivos e Difusos",null,null,null,null,null,null,null,null,null,null,null,null,null,null,0,0,0]
[14,423,"Assistência aos Povos Indígenas",null,null,null,null,null,null,null,null,null,null,null,null,null,null,0,0,0]
[14,null,null,null,null,null,null,null,null,null,null,null,null,null,null,null,null,0,0,0]
[14,null,null,null,null,null,null,null,null,null,null,null,null,null,null,null,null,0,0,0]
[14,null,null,null,null,null,null,null,null,null,null,null,null,null,null,null,null,0,0,0]
[14,null,null,null,null,null,null,null,null,null,null,null,null,null,null,null,null,0,0,0]
[14,null,null,null,null,null,null,null,null,null,null,null,null,null,null,null,null,0,0,0]
[15,null,"URBANISMO",{"$f":"SUM(D177:D185)","v":0},{"$f":"SUM(E177:E185)","v":0},0,0,0,0,0,0,0,0,0,0,0,0,0,0,0]
[15,451,"Infra-Estrutura Urbana",null,null,null,null,null,null,null,null,null,null,null,null,null,null,0,0,0]
[15,452,"Serviços Urbanos",null,null,null,null,null,null,null,null,null,null,null,null,null,null,0,0,0]
[15,453,"Transportes Coletivos Urbanos",null,null,null,null,null,null,null,null,null,null,null,null,null,null,0,0,0]
[15,null,null,null,null,null,null,null,null,null,null,null,null,null,null,null,null,0,0,0]
[15,null,null,null,null,null,null,null,null,null,null,null,null,null,null,null,null,0,0,0]
[15,null,null,null,null,null,null,null,null,null,null,null,null,null,null,null,null,0,0,0]
[15,null,null,null,null,null,null,null,null,null,null,null,null,null,null,null,null,0,0,0]
[15,null,null,null,null,null,null,null,null,null,null,null,null,null,null,null,null,0,0,0]
[15,null,null,null,null,null,null,null,null,null,null,null,null,null,null,null,null,0,0,0]
[16,null,"HABITAÇÃO",{"$f":"SUM(D187:D193)","v":0},{"$f":"SUM(E187:E193)","v":0},0,0,0,0,0,0,0,0,0,0,0,0,0,0,0]
[16,481,"Habitação Rural",null,null,null,null,null,null,null,null,null,null,null,null,null,null,0,0,0]
[16,482,"Habitação Urbana",null,null,null,null,null,null,null,null,null,null,null,null,null,null,0,0,0]
[16,null,null,null,null,null,null,null,null,null,null,null,null,null,null,null,null,0,0,0]
[16,null,null,null,null,null,null,null,null,null,null,null,null,null,null,null,null,0,0,0]
[16,null,null,null,null,null,null,null,null,null,null,null,null,null,null,null,null,0,0,0]
[16,null,null,null,null,null,null,null,null,null,null,null,null,null,null,null,null,0,0,0]
[16,null,null,null,null,null,null,null,null,null,null,null,null,null,null,null,null,0,0,0]
[17,null,"SANEAMENTO",{"$f":"SUM(D195:D201)","v":0},{"$f":"SUM(E195:E201)","v":0},0,0,0,0,0,0,0,0,0,0,0,0,0,0,0]
[17,511,"Saneamento Básico Rural",null,null,null,null,null,null,null,null,null,null,null,null,null,null,0,0,0]
[17,512,"Saneamento Básico Urbano",null,null,null,null,null,null,null,null,null,null,null,null,null,null,0,0,0]
[17,null,null,null,null,null,null,null,null,null,null,null,null,null,null,null,null,0,0,0]
[17,null,null,null,null,null,null,null,null,null,null,null,null,null,null,null,null,0,0,0]
[17,null,null,null,null,null,null,null,null,null,null,null,null,null,null,null,null,0,0,0]
[17,null,null,null,null,null,null,null,null,null,null,null,null,null,null,null,null,0,0,0]
[17,null,null,null,null,null,null,null,null,null,null,null,null,null,null,null,null,0,0,0]
[18,null,"GESTÃO AMBIENTAL",{"$f":"SUM(D203:D212)","v":0},{"$f":"SUM(E203:E212)","v":0},0,0,0,0,0,0,0,0,0,0,0,0,0,0,0]
[18,541,"Preservação e Conservação Ambiental",null,null,null,null,null,null,null,null,null,null,null,null,null,null,0,0,0]
[18,542,"Controle Ambiental",null,null,null,null,null,null,null,null,null,null,null,null,null,null,0,0,0]
[18,543,"Recuperação de Áreas Degradadas",null,null,null,null,null,null,null,null,null,null,null,null,null,null,{"$f":"F205+H205+J205+L205+N205+P205","v":0},{"$f":"G205+I205+K205+M205+O205+Q205","v":0},{"$f":"E205-R205","v":0}]
[18,544,"Recursos Hídricos",null,null,null,null,null,null,null,null,null,null,null,null,null,null,0,0,0]
[18,545,"Meteorologia",null,null,null,null,null,null,null,null,null,null,null,null,null,null,0,0,0]
[18,null,null,null,null,null,null,null,null,null,null,null,null,null,null,null,null,0,0,0]
[18,null,null,null,null,null,null,null,null,null,null,null,null,null,null,null,null,0,0,0]
[18,null,null,null,null,null,null,null,null,null,null,null,null,null,null,null,null,0,0,0]
[18,null,null,null,null,null,null,null,null,null,null,null,null,null,null,null,null,0,0,0]
[18,null,null,null,null,null,null,null,null,null,null,null,null,null,null,null,null,0,0,0]
[19,null,"CIÊNCIA E TECNOLOGIA",{"$f":"SUM(D214:D221)","v":0},{"$f":"SUM(E214:E221)","v":0},0,0,0,0,0,0,0,0,0,0,0,0,0,0,0]
[19,571,"Desenvolvimento Científico",null,null,null,null,null,null,null,null,null,null,null,null,null,null,0,0,0]
[19,572,"Desenvolvimento Tecnol. e Engenharia",null,null,null,null,null,null,null,null,null,null,null,null,null,null,0,0,0]
[19,573,"Difusão do Conhec. Cient. e Tecnológico",null,null,null,null,null,null,null,null,null,null,null,null,null,null,0,0,0]
[19,null,null,null,null,null,null,null,null,null,null,null,null,null,null,null,null,0,0,0]
[19,null,null,null,null,null,null,null,null,null,null,null,null,null,null,null,null,0,0,0]
[19,null,null,null,null,null,null,null,null,null,null,null,null,null,null,null,null,0,0,0]
[19,null,null,null,null,null,null,null,null,null,null,null,null,null,null,null,null,0,0,0]
[19,null,null,null,null,null,null,null,null,null,null,null,null,null,null,null,null,0,0,0]
[20,null,"AGRICULTURA",{"$f":"SUM(D223:D239)","v":0},{"$f":"SUM(E223:E239)","v":0},0,0,0,0,0,0,0,0,0,0,0,0,0,0,0]
[20,601,"Promoção da Produção Vegetal",null,null,null,null,null,null,null,null,null,null,null,null,null,null,0,0,0]
[20,602,"Promoção da Produção Animal",null,null,null,null,null,null,null,null,null,null,null,null,null,null,0,0,0]
[20,603,"Defesa Sanitária Vegetal",null,null,null,null,null,null,null,null,null,null,null,null,null,null,0,0,0]
[20,604,"Defesa Sanitária Animal",null,null,null,null,null,null,null,null,null,null,null,null,null,null,0,0,0]
[20,605,"Abastecimento",null,null,null,null,null,null,null,null,null,null,null,null,null,null,0,0,0]
[20,606,"Extensão Rural",null,null,null,null,null,null,null,null,null,null,null,null,null,null,0,0,0]
[20,607,"Irrigação",null,null,null,null,null,null,null,null,null,null,null,null,null,null,0,0,0]
[20,null,null,null,null,null,null,null,null,null,null,null,null,null,null,null,null,0,0,0]
[20,null,null,null,null,null,null,null,null,null,null,null,null,null,null,null,null,0,0,0]
[20,null,null,null,null,null,null,null,null,null,null,null,null,null,null,null,null,0,0,0]
[20,null,null,null,null,null,null,null,null,null,null,null,null,null,null,null,null,0,0,0]
[20,null,null,null,null,null,null,null,null,null,null,null,null,null,null,null,null,0,0,0]
[20,null,null,null,null,null,null,null,null,null,null,null,null,null,null,null,null,0,0,0]
[20,null,null,null,null,null,null,null,null,null,null,null,null,null,null,null,null,0,0,0]
[20,null,null,null,null,null,null,null,null,null,null,null,null,null,null,null,null,0,0,0]
[20,null,null,null,null,null,null,null,null,null,null,null,null,null,null,null,null,0,0,0]
[20,null,null,null,null,null,null,null,null,null,null,null,null,null,null,null,null,0,0,0]
[21,null,"ORGANIZAÇÃO AGRÁRIA",{"$f":"SUM(D241:D247)","v":0},{"$f":"SUM(E241:E247)","v":0},0,0,0,0,0,0,0,0,0,0,0,0,0,0,0]
[21,631,"Reforma Agrária",null,null,null,null,null,null,null,null,null,null,null,null,null,null,0,0,0]
[21,632,"Colonização",null,null,null,null,null,null,null,null,null,null,null,null,null,null,0,0,0]
[21,null,null,null,null,null,null,null,null,null,null,null,null,null,null,null,null,0,0,0]
[21,null,null,null,null,null,null,null,null,null,null,null,null,null,null,null,null,0,0,0]
[21,null,null,null,null,null,null,null,null,null,null,null,null,null,null,null,null,0,0,0]
[21,null,null,null,null,null,null,null,null,null,null,null,null,null,null,null,null,0,0,0]
[21,null,null,null,null,null,null,null,null,null,null,null,null,null,null,null,null,0,0,0]
[22,null,"INDÚSTRIA",{"$f":"SUM(D249:D258)","v":0},{"$f":"SUM(E249:E258)","v":0},0,0,0,0,0,0,0,0,0,0,0,0,0,0,0]
[22,661,"Promoção Industrial",null,null,null,null,null,null,null,null,null,null,null,null,null,null,0,0,0]
[22,662,"Produção Industrial",null,null,null,null,null,null,null,null,null,null,null,null,null,null,0,0,0]
[22,663,"Mineração",null,null,null,null,null,null,null,null,null,null,null,null,null,null,0,0,0]
[22,664,"Propriedade Industrial",null,null,null,null,null,null,null,null,null,null,null,null,null,null,0,0,0]
[22,665,"Normalização e Qualidade",null,null,null,null,null,null,null,null,null,null,null,null,null,null,0,0,0]
[22,null,null,null,null,null,null,null,null,null,null,null,null,null,null,null,null,0,0,0]
[22,null,null,null,null,null,null,null,null,null,null,null,null,null,null,null,null,0,0,0]
[22,null,null,null,null,null,null,null,null,null,null,null,null,null,null,null,null,0,0,0]
[22,null,null,null,null,null,null,null,null,null,null,null,null,null,null,null,null,0,0,0]
[22,null,null,null,null,null,null,null,null,null,null,null,null,null,null,null,null,0,0,0]
[23,null,"COMÉRCIO E SERVIÇOS",{"$f":"SUM(D260:D269)","v":0},{"$f":"SUM(E260:E269)","v":0},0,0,0,0,0,0,0,0,0,0,0,0,0,0,0]
[23,691,"Promoção Comercial",null,null,null,null,null,null,null,null,null,null,null,null,null,null,0,0,0]
[23,692,"Comercialização",null,null,null,null,null,null,null,null,null,null,null,null,null,null,0,0,0]
[23,693,"Comércio Exterior",null,null,null,null,null,null,null,null,null,null,null,null,null,null,0,0,0]
[23,694,"Serviços Financeiros",null,null,null,null,null,null,null,null,null,null,null,null,null,null,0,0,0]
[23,695,"Turismo",null,null,null,null,null,null,null,null,null,null,null,null,null,null,0,0,0]
[23,null,null,null,null,null,null,null,null,null,null,null,null,null,null,null,null,0,0,0]
[23,null,null,null,null,null,null,null,null,null,null,null,null,null,null,null,null,0,0,0]
[23,null,null,null,null,null,null,null,null,null,null,null,null,null,null,null,null,0,0,0]
[23,null,null,null,null,null,null,null,null,null,null,null,null,null,null,null,null,0,0,0]
[23,null,null,null,null,null,null,null,null,null,null,null,null,null,null,null,null,{"$f":"F269+H269+J269+L269+N269+P269","v":0},{"$f":"G269+I269+K269+M269+O269+Q269","v":0},{"$f":"E269-R269","v":0}]
[24,null,"COMUNICAÇÕES",{"$f":"SUM(D271:D277)","v":0},{"$f":"SUM(E271:E277)","v":0},0,0,0,0,0,0,0,0,0,0,0,0,0,0,0]
[24,721,"Comunicações Postais",null,null,null,null,null,null,null,null,null,null,null,null,null,null,0,0,0]
[24,722,"Telecomunicações",null,null,null,null,null,null,null,null,null,null,null,null,null,null,0,0,0]
[24,null,null,null,null,null,null,null,null,null,null,null,null,null,null,null,null,0,0,0]
[24,null,null,null,null,null,null,null,null,null,null,null,null,null,null,null,null,0,0,0]
[24,null,null,null,null,null,null,null,null,null,null,null,null,null,null,null,null,0,0,0]
[24,null,null,null,null,null,null,null,null,null,null,null,null,null,null,null,null,0,0,0]
[24,null,null,null,null,null,null,null,null,null,null,null,null,null,null,null,null,0,0,0]
[25,null,"ENERGIA",{"$f":"SUM(D279:D287)","v":0},{"$f":"SUM(E279:E287)","v":0},0,0,0,0,0,0,0,0,0,0,0,0,0,0,0]
[25,751,"Conservação de Energia",null,null,null,null,null,null,null,null,null,null,null,null,null,null,0,0,0]
[25,753,"Energia Elétrica",null,null,null,null,null,null,null,null,null,null,null,null,null,null,0,0,0]
[25,753,"Petróleo",null,null,null,null,null,null,null,null,null,null,null,null,null,null,0,0,0]
[25,754,"Álcool",null,null,null,null,null,null,null,null,null,null,null,null,null,null,0,0,0]
[25,null,null,null,null,null,null,null,null,null,null,null,null,null,null,null,null,0,0,0]
[25,null,null,null,null,null,null,null,null,null,null,null,null,null,null,null,null,0,0,0]
[25,null,null,null,null,null,null,null,null,null,null,null,null,null,null,null,null,0,0,0]
[25,null,null,null,null,null,null,null,null,null,null,null,null,null,null,null,null,0,0,0]
[25,null,null,null,null,null,null,null,null,null,null,null,null,null,null,null,null,0,0,0]
[26,null,"TRANSPORTE",{"$f":"SUM(D289:D298)","v":0},{"$f":"SUM(E289:E298)","v":0},0,0,0,0,0,0,0,0,0,0,0,0,0,0,0]
[26,781,"Transporte Aéreo",null,null,null,null,null,null,null,null,null,null,null,null,null,null,0,0,0]
[26,782,"Transporte Rodoviário",null,null,null,null,null,null,null,null,null,null,null,null,null,null,0,0,0]
[26,783,"Transporte Ferroviário",null,null,null,null,null,null,null,null,null,null,null,null,null,null,0,0,0]
[26,784,"Transporte Hidroviário",null,null,null,null,null,null,null,null,null,null,null,null,null,null,0,0,0]
[26,785,"Transporte Especiais",null,null,null,null,null,null,null,null,null,null,null,null,null,null,0,0,0]
[26,null,null,null,null,null,null,null,null,null,null,null,null,null,null,null,null,0,0,0]
[26,null,null,null,null,null,null,null,null,null,null,null,null,null,null,null,null,0,0,0]
[26,null,null,null,null,null,null,null,null,null,null,null,null,null,null,null,null,0,0,0]
[26,null,null,null,null,null,null,null,null,null,null,null,null,null,null,null,null,0,0,0]
[26,null,null,null,null,null,null,null,null,null,null,null,null,null,null,null,null,0,0,0]
[27,null,"DESPORTO E LAZER",{"$f":"SUM(D300:D307)","v":0},{"$f":"SUM(E300:E307)","v":0},0,0,0,0,0,0,0,0,0,0,0,0,0,0,0]
[27,811,"Desporto de Rendimento",null,null,null,null,null,null,null,null,null,null,null,null,null,null,0,0,0]
[27,812,"Desporto Comunitário",null,null,null,null,null,null,null,null,null,null,null,null,null,null,0,0,0]
[27,813,"Lazer",null,null,null,null,null,null,null,null,null,null,null,null,null,null,0,0,0]
[null,null,null,null,null,null,null,null,null,null,null,null,null,null,null,null,null,0,0,0]
[null,null,null,null,null,null,null,null,null,null,null,null,null,null,null,null,null,0,0,0]
[null,null,null,null,null,null,null,null,null,null,null,null,null,null,null,null,null,0,0,0]
[null,null,null,null,null,null,null,null,null,null,null,null,null,null,null,null,null,0,0,0]
[null,null,null,null,null,null,null,null,null,null,null,null,null,null,null,null,null,0,0,0]
[28,null,"ENCARGOS ESPECIAIS",{"$f":"SUM(D309:D319)","v":0},{"$f":"SUM(E309:E319)","v":0},0,0,0,0,0,0,0,0,0,0,0,0,0,0,0]
[28,841,"Refinanciamento da Dívida Interna",null,null,null,null,null,null,null,null,null,null,null,null,null,null,0,0,0]
[28,842,"Refinanciamento da Dívida Externa",null,null,null,null,null,null,null,null,null,null,null,null,null,null,0,0,0]
[28,843,"Serviço da Dívida Interna",null,null,null,null,null,null,null,null,null,null,null,null,null,null,0,0,0]
[28,844,"Serviço da Dívida Externa",null,null,null,null,null,null,null,null,null,null,null,null,null,null,0,0,0]
[28,845,"Transferências",null,null,null,null,null,null,null,null,null,null,null,null,null,null,0,0,0]
[28,846,"Outros Encargos Especiais",null,null,null,null,null,null,null,null,null,null,null,null,null,null,0,0,0]
[null,null,null,null,null,null,null,null,null,null,null,null,null,null,null,null,null,0,0,0]
[null,null,null,null,null,null,null,null,null,null,null,null,null,null,null,null,null,0,0,0]
[null,null,null,null,null,null,null,null,null,null,null,null,null,null,null,null,null,0,0,0]
[null,null,null,null,null,null,null,null,null,null,null,null,null,null,null,null,null,0,0,0]
[null,null,null,null,null,null,null,null,null,null,null,null,null,null,null,null,null,0,0,0]
[1,null,"TOTAL",{"$f":"D12+D23+D31+D39+D61+D70+D79+D87+D97+D107+D124+D134+D153+D167+D176+D186+D194+D202+D213+D222+D240+D248+D259+D270+D278+D288+D299+D308","v":20123396},{"$f":"E12+E23+E31+E39+E61+E70+E79+E87+E97+E107+E124+E134+E153+E167+E176+E186+E194+E202+E213+E222+E240+E248+E259+E270+E278+E288+E299+E308","v":20123396},3128045.3,3128045.3,1311474.69,1311474.69,3166854.51,3166854.51,0,0,0,0,0,0,{"$f":"F320+H320+J320+L320+N320+P320","v":7606374.5},{"$f":"G320+I320+K320+M320+O320+Q320","v":7606374.5},{"$f":"E320-R320","v":12517021.5}]
[]
[]
[]
[]
[null,null,"Prof.Dr.Isnard de Albuquerque Câmara Neto",null,null,null,null,null,"Jessé César Pinto",null,null,null,null,null,null,null,null,"Josimere dos Santos Costa"]
[null,null,"  Diretor Presidente",null,null,null,null,null,null,"CRC:1SP 297323/O-5",null,null,null,null,null,null,null,null,"Controlador Interno"]

{"sheet":"mod2 1b","index":8,"n_rows":326,"n_cols":10,"rows_kept":326,"cut":false,"hidden":false,"merged":[[324,7,324,9],[6,0,6,9],[7,3,7,4],[7,5,7,6],[324,4,324,5],[0,0,0,9],[1,0,1,9],[2,0,2,9],[7,7,7,9],[7,0,8,0],[7,1,8,1]]}
["RELATÓRIO RESUMIDO DA EXECUÇÃO ORÇAMENTÁRIA "]
[" (Artigo  52, Inciso II, alínea “c” da LC. 101/00)"]
["- ADMINISTRAÇÃO DIRETA / INDIRETA / FUNDACIONAL -"]
[]
[{"$f":"'mod1 6b'!A5","v":"MUNICÍPIO DE TAUBATÉ  -  FUNDAÇÃO UNIVERSITÁRIA DE TAUBATÉ"}]
["3º BIMESTRE DE 2014"]
["Valores expressos em R$"]
["Cód. Função","Cód. Subf.","DESPESAS","Dotação Anual",null,"3ºBIMESTRE",null,"Acumulado"]
[null,null,"Funções/Subfunções","Inicial","Atualizada","Empenhado","Liquidado","Empenhado","Liquidado","a empenhar"]
[null,null,null,null,null,{"$f":"G10-1","v":5},{"$f":"COM!AH6*2","v":6}]
[]
[{"$f":"'mod2 6b'!A12","v":1},{"$f":"'mod2 6b'!B12","v":0},{"$f":"'mod2 6b'!C12","v":"LEGISLATIVO"},{"$f":"'mod2 6b'!D12","v":0},{"$f":"'mod2 6b'!E12","v":0},{"$f":"LOOKUP($F$10,'mod2 6b'!$F$10:$Q$10,'mod2 6b'!F12:Q12)","v":0},{"$f":"LOOKUP($G$10,'mod2 6b'!$F$10:$Q$10,'mod2 6b'!F12:Q12)","v":0},{"$f":"'mod2 6b'!R12","v":0},{"$f":"'mod2 6b'!S12","v":0},{"$f":"'mod2 6b'!T12","v":0}]
[{"$f":"'mod2 6b'!A13","v":1},{"$f":"'mod2 6b'!B13","v":31},{"$f":"'mod2 6b'!C13","v":"Ação Legislativa"},{"$f":"'mod2 6b'!D13","v":0},{"$f":"'mod2 6b'!E13","v":0},{"$f":"LOOKUP($F$10,'mod2 6b'!$F$10:$Q$10,'mod2 6b'!F13:Q13)","v":0},{"$f":"LOOKUP($G$10,'mod2 6b'!$F$10:$Q$10,'mod2 6b'!F13:Q13)","v":0},{"$f":"'mod2 6b'!R13","v":0},{"$f":"'mod2 6b'!S13","v":0},{"$f":"'mod2 6b'!T13","v":0}]
[{"$f":"'mod2 6b'!A14","v":1},{"$f":"'mod2 6b'!B14","v":32},{"$f":"'mod2 6b'!C14","v":"Controle Externo"},{"$f":"'mod2 6b'!D14","v":0},{"$f":"'mod2 6b'!E14","v":0},{"$f":"LOOKUP($F$10,'mod2 6b'!$F$10:$Q$10,'mod2 6b'!F14:Q14)","v":0},{"$f":"LOOKUP($G$10,'mod2 6b'!$F$10:$Q$10,'mod2 6b'!F14:Q14)","v":0},{"$f":"'mod2 6b'!R14","v":0},{"$f":"'mod2 6b'!S14","v":0},{"$f":"'mod2 6b'!T14","v":0}]
[{"$f":"'mod2 6b'!A15","v":1},{"$f":"'mod2 6b'!B15","v":0},{"$f":"'mod2 6b'!C15","v":0},{"$f":"'mod2 6b'!D15","v":0},{"$f":"'mod2 6b'!E15","v":0},{"$f":"LOOKUP($F$10,'mod2 6b'!$F$10:$Q$10,'mod2 6b'!F15:Q15)","v":0},{"$f":"LOOKUP($G$10,'mod2 6b'!$F$10:$Q$10,'mod2 6b'!F15:Q15)","v":0},{"$f":"'mod2 6b'!R15","v":0},{"$f":"'mod2 6b'!S15","v":0},{"$f":"'mod2 6b'!T15","v":0}]
[{"$f":"'mod2 6b'!A16","v":1},{"$f":"'mod2 6b'!B16","v":0},{"$f":"'mod2 6b'!C16","v":0},{"$f":"'mod2 6b'!D16","v":0},{"$f":"'mod2 6b'!E16","v":0},{"$f":"LOOKUP($F$10,'mod2 6b'!$F$10:$Q$10,'mod2 6b'!F16:Q16)","v":0},{"$f":"LOOKUP($G$10,'mod2 6b'!$F$10:$Q$10,'mod2 6b'!F16:Q16)","v":0},{"$f":"'mod2 6b'!R16","v":0},{"$f":"'mod2 6b'!S16","v":0},{"$f":"'mod2 6b'!T16","v":0}]
[{"$f":"'mod2 6b'!A17","v":1},{"$f":"'mod2 6b'!B17","v":0},{"$f":"'mod2 6b'!C17","v":0},{"$f":"'mod2 6b'!D17","v":0},{"$f":"'mod2 6b'!E17","v":0},{"$f":"LOOKUP($F$10,'mod2 6b'!$F$10:$Q$10,'mod2 6b'!F17:Q17)","v":0},{"$f":"LOOKUP($G$10,'mod2 6b'!$F$10:$Q$10,'mod2 6b'!F17:Q17)","v":0},{"$f":"'mod2 6b'!R17","v":0},{"$f":"'mod2 6b'!S17","v":0},{"$f":"'mod2 6b'!T17","v":0}]
[{"$f":"'mod2 6b'!A18","v":1},{"$f":"'mod2 6b'!B18","v":0},{"$f":"'mod2 6b'!C18","v":0},{"$f":"'mod2 6b'!D18","v":0},{"$f":"'mod2 6b'!E18","v":0},{"$f":"LOOKUP($F$10,'mod2 6b'!$F$10:$Q$10,'mod2 6b'!F18:Q18)","v":0},{"$f":"LOOKUP($G$10,'mod2 6b'!$F$10:$Q$10,'mod2 6b'!F18:Q18)","v":0},{"$f":"'mod2 6b'!R18","v":0},{"$f":"'mod2 6b'!S18","v":0},{"$f":"'mod2 6b'!T18","v":0}]
[{"$f":"'mod2 6b'!A19","v":1},{"$f":"'mod2 6b'!B19","v":0},{"$f":"'mod2 6b'!C19","v":0},{"$f":"'mod2 6b'!D19","v":0},{"$f":"'mod2 6b'!E19","v":0},{"$f":"LOOKUP($F$10,'mod2 6b'!$F$10:$Q$10,'mod2 6b'!F19:Q19)","v":0},{"$f":"LOOKUP($G$10,'mod2 6b'!$F$10:$Q$10,'mod2 6b'!F19:Q19)","v":0},{"$f":"'mod2 6b'!R19","v":0},{"$f":"'mod2 6b'!S19","v":0},{"$f":"'mod2 6b'!T19","v":0}]
[{"$f":"'mod2 6b'!A20","v":1},{"$f":"'mod2 6b'!B20","v":0},{"$f":"'mod2 6b'!C20","v":0},{"$f":"'mod2 6b'!D20","v":0},{"$f":"'mod2 6b'!E20","v":0},{"$f":"LOOKUP($F$10,'mod2 6b'!$F$10:$Q$10,'mod2 6b'!F20:Q20)","v":0},{"$f":"LOOKUP($G$10,'mod2 6b'!$F$10:$Q$10,'mod2 6b'!F20:Q20)","v":0},{"$f":"'mod2 6b'!R20","v":0},{"$f":"'mod2 6b'!S20","v":0},{"$f":"'mod2 6b'!T20","v":0}]
[{"$f":"'mod2 6b'!A21","v":1},{"$f":"'mod2 6b'!B21","v":0},{"$f":"'mod2 6b'!C21","v":0},{"$f":"'mod2 6b'!D21","v":0},{"$f":"'mod2 6b'!E21","v":0},{"$f":"LOOKUP($F$10,'mod2 6b'!$F$10:$Q$10,'mod2 6b'!F21:Q21)","v":0},{"$f":"LOOKUP($G$10,'mod2 6b'!$F$10:$Q$10,'mod2 6b'!F21:Q21)","v":0},{"$f":"'mod2 6b'!R21","v":0},{"$f":"'mod2 6b'!S21","v":0},{"$f":"'mod2 6b'!T21","v":0}]
[{"$f":"'mod2 6b'!A22","v":1},{"$f":"'mod2 6b'!B22","v":0},{"$f":"'mod2 6b'!C22","v":0},{"$f":"'mod2 6b'!D22","v":0},{"$f":"'mod2 6b'!E22","v":0},{"$f":"LOOKUP($F$10,'mod2 6b'!$F$10:$Q$10,'mod2 6b'!F22:Q22)","v":0},{"$f":"LOOKUP($G$10,'mod2 6b'!$F$10:$Q$10,'mod2 6b'!F22:Q22)","v":0},{"$f":"'mod2 6b'!R22","v":0},{"$f":"'mod2 6b'!S22","v":0},{"$f":"'mod2 6b'!T22","v":0}]
[{"$f":"'mod2 6b'!A23","v":2},{"$f":"'mod2 6b'!B23","v":0},{"$f":"'mod2 6b'!C23","v":"JUDI CIÁRIA"},{"$f":"'mod2 6b'!D23","v":0},{"$f":"'mod2 6b'!E23","v":0},{"$f":"LOOKUP($F$10,'mod2 6b'!$F$10:$Q$10,'mod2 6b'!F23:Q23)","v":0},{"$f":"LOOKUP($G$10,'mod2 6b'!$F$10:$Q$10,'mod2 6b'!F23:Q23)","v":0},{"$f":"'mod2 6b'!R23","v":0},{"$f":"'mod2 6b'!S23","v":0},{"$f":"'mod2 6b'!T23","v":0}]
[{"$f":"'mod2 6b'!A24","v":2},{"$f":"'mod2 6b'!B24","v":61},{"$f":"'mod2 6b'!C24","v":"Ação Judicária"},{"$f":"'mod2 6b'!D24","v":0},{"$f":"'mod2 6b'!E24","v":0},{"$f":"LOOKUP($F$10,'mod2 6b'!$F$10:$Q$10,'mod2 6b'!F24:Q24)","v":0},{"$f":"LOOKUP($G$10,'mod2 6b'!$F$10:$Q$10,'mod2 6b'!F24:Q24)","v":0},{"$f":"'mod2 6b'!R24","v":0},{"$f":"'mod2 6b'!S24","v":0},{"$f":"'mod2 6b'!T24","v":0}]
[{"$f":"'mod2 6b'!A25","v":2},{"$f":"'mod2 6b'!B25","v":62},{"$f":"'mod2 6b'!C25","v":"Defesa Int.Públ.no Proc.Judiciário"},{"$f":"'mod2 6b'!D25","v":0},{"$f":"'mod2 6b'!E25","v":0},{"$f":"LOOKUP($F$10,'mod2 6b'!$F$10:$Q$10,'mod2 6b'!F25:Q25)","v":0},{"$f":"LOOKUP($G$10,'mod2 6b'!$F$10:$Q$10,'mod2 6b'!F25:Q25)","v":0},{"$f":"'mod2 6b'!R25","v":0},{"$f":"'mod2 6b'!S25","v":0},{"$f":"'mod2 6b'!T25","v":0}]
[{"$f":"'mod2 6b'!A26","v":2},{"$f":"'mod2 6b'!B26","v":0},{"$f":"'mod2 6b'!C26","v":0},{"$f":"'mod2 6b'!D26","v":0},{"$f":"'mod2 6b'!E26","v":0},{"$f":"LOOKUP($F$10,'mod2 6b'!$F$10:$Q$10,'mod2 6b'!F26:Q26)","v":0},{"$f":"LOOKUP($G$10,'mod2 6b'!$F$10:$Q$10,'mod2 6b'!F26:Q26)","v":0},{"$f":"'mod2 6b'!R26","v":0},{"$f":"'mod2 6b'!S26","v":0},{"$f":"'mod2 6b'!T26","v":0}]
[{"$f":"'mod2 6b'!A27","v":2},{"$f":"'mod2 6b'!B27","v":0},{"$f":"'mod2 6b'!C27","v":0},{"$f":"'mod2 6b'!D27","v":0},{"$f":"'mod2 6b'!E27","v":0},{"$f":"LOOKUP($F$10,'mod2 6b'!$F$10:$Q$10,'mod2 6b'!F27:Q27)","v":0},{"$f":"LOOKUP($G$10,'mod2 6b'!$F$10:$Q$10,'mod2 6b'!F27:Q27)","v":0},{"$f":"'mod2 6b'!R27","v":0},{"$f":"'mod2 6b'!S27","v":0},{"$f":"'mod2 6b'!T27","v":0}]
[{"$f":"'mod2 6b'!A28","v":2},{"$f":"'mod2 6b'!B28","v":0},{"$f":"'mod2 6b'!C28","v":0},{"$f":"'mod2 6b'!D28","v":0},{"$f":"'mod2 6b'!E28","v":0},{"$f":"LOOKUP($F$10,'mod2 6b'!$F$10:$Q$10,'mod2 6b'!F28:Q28)","v":0},{"$f":"LOOKUP($G$10,'mod2 6b'!$F$10:$Q$10,'mod2 6b'!F28:Q28)","v":0},{"$f":"'mod2 6b'!R28","v":0},{"$f":"'mod2 6b'!S28","v":0},{"$f":"'mod2 6b'!T28","v":0}]
[{"$f":"'mod2 6b'!A29","v":2},{"$f":"'mod2 6b'!B29","v":0},{"$f":"'mod2 6b'!C29","v":0},{"$f":"'mod2 6b'!D29","v":0},{"$f":"'mod2 6b'!E29","v":0},{"$f":"LOOKUP($F$10,'mod2 6b'!$F$10:$Q$10,'mod2 6b'!F29:Q29)","v":0},{"$f":"LOOKUP($G$10,'mod2 6b'!$F$10:$Q$10,'mod2 6b'!F29:Q29)","v":0},{"$f":"'mod2 6b'!R29","v":0},{"$f":"'mod2 6b'!S29","v":0},{"$f":"'mod2 6b'!T29","v":0}]
[{"$f":"'mod2 6b'!A30","v":2},{"$f":"'mod2 6b'!B30","v":0},{"$f":"'mod2 6b'!C30","v":0},{"$f":"'mod2 6b'!D30","v":0},{"$f":"'mod2 6b'!E30","v":0},{"$f":"LOOKUP($F$10,'mod2 6b'!$F$10:$Q$10,'mod2 6b'!F30:Q30)","v":0},{"$f":"LOOKUP($G$10,'mod2 6b'!$F$10:$Q$10,'mod2 6b'!F30:Q30)","v":0},{"$f":"'mod2 6b'!R30","v":0},{"$f":"'mod2 6b'!S30","v":0},{"$f":"'mod2 6b'!T30","v":0}]
[{"$f":"'mod2 6b'!A31","v":3},{"$f":"'mod2 6b'!B31","v":0},{"$f":"'mod2 6b'!C31","v":"ESSENCIAL À JUSTIÇA"},{"$f":"'mod2 6b'!D31","v":0},{"$f":"'mod2 6b'!E31","v":0},{"$f":"LOOKUP($F$10,'mod2 6b'!$F$10:$Q$10,'mod2 6b'!F31:Q31)","v":0},{"$f":"LOOKUP($G$10,'mod2 6b'!$F$10:$Q$10,'mod2 6b'!F31:Q31)","v":0},{"$f":"'mod2 6b'!R31","v":0},{"$f":"'mod2 6b'!S31","v":0},{"$f":"'mod2 6b'!T31","v":0}]
[{"$f":"'mod2 6b'!A32","v":3},{"$f":"'mod2 6b'!B32","v":91},{"$f":"'mod2 6b'!C32","v":"Defesa da Ordem Judiciária"},{"$f":"'mod2 6b'!D32","v":0},{"$f":"'mod2 6b'!E32","v":0},{"$f":"LOOKUP($F$10,'mod2 6b'!$F$10:$Q$10,'mod2 6b'!F32:Q32)","v":0},{"$f":"LOOKUP($G$10,'mod2 6b'!$F$10:$Q$10,'mod2 6b'!F32:Q32)","v":0},{"$f":"'mod2 6b'!R32","v":0},{"$f":"'mod2 6b'!S32","v":0},{"$f":"'mod2 6b'!T32","v":0}]
[{"$f":"'mod2 6b'!A33","v":3},{"$f":"'mod2 6b'!B33","v":92},{"$f":"'mod2 6b'!C33","v":"Representação Judicial e Extrajudicial"},{"$f":"'mod2 6b'!D33","v":0},{"$f":"'mod2 6b'!E33","v":0},{"$f":"LOOKUP($F$10,'mod2 6b'!$F$10:$Q$10,'mod2 6b'!F33:Q33)","v":0},{"$f":"LOOKUP($G$10,'mod2 6b'!$F$10:$Q$10,'mod2 6b'!F33:Q33)","v":0},{"$f":"'mod2 6b'!R33","v":0},{"$f":"'mod2 6b'!S33","v":0},{"$f":"'mod2 6b'!T33","v":0}]
[{"$f":"'mod2 6b'!A34","v":3},{"$f":"'mod2 6b'!B34","v":0},{"$f":"'mod2 6b'!C34","v":0},{"$f":"'mod2 6b'!D34","v":0},{"$f":"'mod2 6b'!E34","v":0},{"$f":"LOOKUP($F$10,'mod2 6b'!$F$10:$Q$10,'mod2 6b'!F34:Q34)","v":0},{"$f":"LOOKUP($G$10,'mod2 6b'!$F$10:$Q$10,'mod2 6b'!F34:Q34)","v":0},{"$f":"'mod2 6b'!R34","v":0},{"$f":"'mod2 6b'!S34","v":0},{"$f":"'mod2 6b'!T34","v":0}]
[{"$f":"'mod2 6b'!A35","v":3},{"$f":"'mod2 6b'!B35","v":0},{"$f":"'mod2 6b'!C35","v":0},{"$f":"'mod2 6b'!D35","v":0},{"$f":"'mod2 6b'!E35","v":0},{"$f":"LOOKUP($F$10,'mod2 6b'!$F$10:$Q$10,'mod2 6b'!F35:Q35)","v":0},{"$f":"LOOKUP($G$10,'mod2 6b'!$F$10:$Q$10,'mod2 6b'!F35:Q35)","v":0},{"$f":"'mod2 6b'!R35","v":0},{"$f":"'mod2 6b'!S35","v":0},{"$f":"'mod2 6b'!T35","v":0}]
[{"$f":"'mod2 6b'!A36","v":3},{"$f":"'mod2 6b'!B36","v":0},{"$f":"'mod2 6b'!C36","v":0},{"$f":"'mod2 6b'!D36","v":0},{"$f":"'mod2 6b'!E36","v":0},{"$f":"LOOKUP($F$10,'mod2 6b'!$F$10:$Q$10,'mod2 6b'!F36:Q36)","v":0},{"$f":"LOOKUP($G$10,'mod2 6b'!$F$10:$Q$10,'mod2 6b'!F36:Q36)","v":0},{"$f":"'mod2 6b'!R36","v":0},{"$f":"'mod2 6b'!S36","v":0},{"$f":"'mod2 6b'!T36","v":0}]
[{"$f":"'mod2 6b'!A37","v":3},{"$f":"'mod2 6b'!B37","v":0},{"$f":"'mod2 6b'!C37","v":0},{"$f":"'mod2 6b'!D37","v":0},{"$f":"'mod2 6b'!E37","v":0},{"$f":"LOOKUP($F$10,'mod2 6b'!$F$10:$Q$10,'mod2 6b'!F37:Q37)","v":0},{"$f":"LOOKUP($G$10,'mod2 6b'!$F$10:$Q$10,'mod2 6b'!F37:Q37)","v":0},{"$f":"'mod2 6b'!R37","v":0},{"$f":"'mod2 6b'!S37","v":0},{"$f":"'mod2 6b'!T37","v":0}]
[{"$f":"'mod2 6b'!A38","v":3},{"$f":"'mod2 6b'!B38","v":0},{"$f":"'mod2 6b'!C38","v":0},{"$f":"'mod2 6b'!D38","v":0},{"$f":"'mod2 6b'!E38","v":0},{"$f":"LOOKUP($F$10,'mod2 6b'!$F$10:$Q$10,'mod2 6b'!F38:Q38)","v":0},{"$f":"LOOKUP($G$10,'mod2 6b'!$F$10:$Q$10,'mod2 6b'!F38:Q38)","v":0},{"$f":"'mod2 6b'!R38","v":0},{"$f":"'mod2 6b'!S38","v":0},{"$f":"'mod2 6b'!T38","v":0}]
[{"$f":"'mod2 6b'!A39","v":4},{"$f":"'mod2 6b'!B39","v":0},{"$f":"'mod2 6b'!C39","v":"ADMINISTRAÇÃO"},{"$f":"'mod2 6b'!D39","v":0},{"$f":"'mod2 6b'!E39","v":0},{"$f":"LOOKUP($F$10,'mod2 6b'!$F$10:$Q$10,'mod2 6b'!F39:Q39)","v":0},{"$f":"LOOKUP($G$10,'mod2 6b'!$F$10:$Q$10,'mod2 6b'!F39:Q39)","v":0},{"$f":"'mod2 6b'!R39","v":0},{"$f":"'mod2 6b'!S39","v":0},{"$f":"'mod2 6b'!T39","v":0}]
[{"$f":"'mod2 6b'!A40","v":4},{"$f":"'mod2 6b'!B40","v":121},{"$f":"'mod2 6b'!C40","v":"Planejamento e Orçamento"},{"$f":"'mod2 6b'!D40","v":0},{"$f":"'mod2 6b'!E40","v":0},{"$f":"LOOKUP($F$10,'mod2 6b'!$F$10:$Q$10,'mod2 6b'!F40:Q40)","v":0},{"$f":"LOOKUP($G$10,'mod2 6b'!$F$10:$Q$10,'mod2 6b'!F40:Q40)","v":0},{"$f":"'mod2 6b'!R40","v":0},{"$f":"'mod2 6b'!S40","v":0},{"$f":"'mod2 6b'!T40","v":0}]
[{"$f":"'mod2 6b'!A41","v":4},{"$f":"'mod2 6b'!B41","v":122},{"$f":"'mod2 6b'!C41","v":"Administração Geral"},{"$f":"'mod2 6b'!D41","v":0},{"$f":"'mod2 6b'!E41","v":0},{"$f":"LOOKUP($F$10,'mod2 6b'!$F$10:$Q$10,'mod2 6b'!F41:Q41)","v":0},{"$f":"LOOKUP($G$10,'mod2 6b'!$F$10:$Q$10,'mod2 6b'!F41:Q41)","v":0},{"$f":"'mod2 6b'!R41","v":0},{"$f":"'mod2 6b'!S41","v":0},{"$f":"'mod2 6b'!T41","v":0}]
[{"$f":"'mod2 6b'!A42","v":4},{"$f":"'mod2 6b'!B42","v":123},{"$f":"'mod2 6b'!C42","v":"Administração Financeira"},{"$f":"'mod2 6b'!D42","v":0},{"$f":"'mod2 6b'!E42","v":0},{"$f":"LOOKUP($F$10,'mod2 6b'!$F$10:$Q$10,'mod2 6b'!F42:Q42)","v":0},{"$f":"LOOKUP($G$10,'mod2 6b'!$F$10:$Q$10,'mod2 6b'!F42:Q42)","v":0},{"$f":"'mod2 6b'!R42","v":0},{"$f":"'mod2 6b'!S42","v":0},{"$f":"'mod2 6b'!T42","v":0}]
[{"$f":"'mod2 6b'!A43","v":4},{"$f":"'mod2 6b'!B43","v":124},{"$f":"'mod2 6b'!C43","v":"Controle Interno"},{"$f":"'mod2 6b'!D43","v":0},{"$f":"'mod2 6b'!E43","v":0},{"$f":"LOOKUP($F$10,'mod2 6b'!$F$10:$Q$10,'mod2 6b'!F43:Q43)","v":0},{"$f":"LOOKUP($G$10,'mod2 6b'!$F$10:$Q$10,'mod2 6b'!F43:Q43)","v":0},{"$f":"'mod2 6b'!R43","v":0},{"$f":"'mod2 6b'!S43","v":0},{"$f":"'mod2 6b'!T43","v":0}]
[{"$f":"'mod2 6b'!A44","v":4},{"$f":"'mod2 6b'!B44","v":125},{"$f":"'mod2 6b'!C44","v":"Normatização e Fiscalização"},{"$f":"'mod2 6b'!D44","v":0},{"$f":"'mod2 6b'!E44","v":0},{"$f":"LOOKUP($F$10,'mod2 6b'!$F$10:$Q$10,'mod2 6b'!F44:Q44)","v":0},{"$f":"LOOKUP($G$10,'mod2 6b'!$F$10:$Q$10,'mod2 6b'!F44:Q44)","v":0},{"$f":"'mod2 6b'!R44","v":0},{"$f":"'mod2 6b'!S44","v":0},{"$f":"'mod2 6b'!T44","v":0}]
[{"$f":"'mod2 6b'!A45","v":4},{"$f":"'mod2 6b'!B45","v":126},{"$f":"'mod2 6b'!C45","v":"Tecnologia da Informação"},{"$f":"'mod2 6b'!D45","v":0},{"$f":"'mod2 6b'!E45","v":0},{"$f":"LOOKUP($F$10,'mod2 6b'!$F$10:$Q$10,'mod2 6b'!F45:Q45)","v":0},{"$f":"LOOKUP($G$10,'mod2 6b'!$F$10:$Q$10,'mod2 6b'!F45:Q45)","v":0},{"$f":"'mod2 6b'!R45","v":0},{"$f":"'mod2 6b'!S45","v":0},{"$f":"'mod2 6b'!T45","v":0}]
[{"$f":"'mod2 6b'!A46","v":4},{"$f":"'mod2 6b'!B46","v":127},{"$f":"'mod2 6b'!C46","v":"Ordenamento Territorial"},{"$f":"'mod2 6b'!D46","v":0},{"$f":"'mod2 6b'!E46","v":0},{"$f":"LOOKUP($F$10,'mod2 6b'!$F$10:$Q$10,'mod2 6b'!F46:Q46)","v":0},{"$f":"LOOKUP($G$10,'mod2 6b'!$F$10:$Q$10,'mod2 6b'!F46:Q46)","v":0},{"$f":"'mod2 6b'!R46","v":0},{"$f":"'mod2 6b'!S46","v":0},{"$f":"'mod2 6b'!T46","v":0}]
[{"$f":"'mod2 6b'!A47","v":4},{"$f":"'mod2 6b'!B47","v":128},{"$f":"'mod2 6b'!C47","v":"Formação de Recursos Humanos"},{"$f":"'mod2 6b'!D47","v":0},{"$f":"'mod2 6b'!E47","v":0},{"$f":"LOOKUP($F$10,'mod2 6b'!$F$10:$Q$10,'mod2 6b'!F47:Q47)","v":0},{"$f":"LOOKUP($G$10,'mod2 6b'!$F$10:$Q$10,'mod2 6b'!F47:Q47)","v":0},{"$f":"'mod2 6b'!R47","v":0},{"$f":"'mod2 6b'!S47","v":0},{"$f":"'mod2 6b'!T47","v":0}]
[{"$f":"'mod2 6b'!A48","v":4},{"$f":"'mod2 6b'!B48","v":129},{"$f":"'mod2 6b'!C48","v":"Administração de Receitas"},{"$f":"'mod2 6b'!D48","v":0},{"$f":"'mod2 6b'!E48","v":0},{"$f":"LOOKUP($F$10,'mod2 6b'!$F$10:$Q$10,'mod2 6b'!F48:Q48)","v":0},{"$f":"LOOKUP($G$10,'mod2 6b'!$F$10:$Q$10,'mod2 6b'!F48:Q48)","v":0},{"$f":"'mod2 6b'!R48","v":0},{"$f":"'mod2 6b'!S48","v":0},{"$f":"'mod2 6b'!T48","v":0}]
[{"$f":"'mod2 6b'!A49","v":4},{"$f":"'mod2 6b'!B49","v":130},{"$f":"'mod2 6b'!C49","v":"Administração de Concessões"},{"$f":"'mod2 6b'!D49","v":0},{"$f":"'mod2 6b'!E49","v":0},{"$f":"LOOKUP($F$10,'mod2 6b'!$F$10:$Q$10,'mod2 6b'!F49:Q49)","v":0},{"$f":"LOOKUP($G$10,'mod2 6b'!$F$10:$Q$10,'mod2 6b'!F49:Q49)","v":0},{"$f":"'mod2 6b'!R49","v":0},{"$f":"'mod2 6b'!S49","v":0},{"$f":"'mod2 6b'!T49","v":0}]
[{"$f":"'mod2 6b'!A50","v":4},{"$f":"'mod2 6b'!B50","v":131},{"$f":"'mod2 6b'!C50","v":"Comunicação Social"},{"$f":"'mod2 6b'!D50","v":0},{"$f":"'mod2 6b'!E50","v":0},{"$f":"LOOKUP($F$10,'mod2 6b'!$F$10:$Q$10,'mod2 6b'!F50:Q50)","v":0},{"$f":"LOOKUP($G$10,'mod2 6b'!$F$10:$Q$10,'mod2 6b'!F50:Q50)","v":0},{"$f":"'mod2 6b'!R50","v":0},{"$f":"'mod2 6b'!S50","v":0},{"$f":"'mod2 6b'!T50","v":0}]
[{"$f":"'mod2 6b'!A51","v":4},{"$f":"'mod2 6b'!B51","v":0},{"$f":"'mod2 6b'!C51","v":0},{"$f":"'mod2 6b'!D51","v":0},{"$f":"'mod2 6b'!E51","v":0},{"$f":"LOOKUP($F$10,'mod2 6b'!$F$10:$Q$10,'mod2 6b'!F51:Q51)","v":0},{"$f":"LOOKUP($G$10,'mod2 6b'!$F$10:$Q$10,'mod2 6b'!F51:Q51)","v":0},{"$f":"'mod2 6b'!R51","v":0},{"$f":"'mod2 6b'!S51","v":0},{"$f":"'mod2 6b'!T51","v":0}]
[{"$f":"'mod2 6b'!A52","v":4},{"$f":"'mod2 6b'!B52","v":0},{"$f":"'mod2 6b'!C52","v":0},{"$f":"'mod2 6b'!D52","v":0},{"$f":"'mod2 6b'!E52","v":0},{"$f":"LOOKUP($F$10,'mod2 6b'!$F$10:$Q$10,'mod2 6b'!F52:Q52)","v":0},{"$f":"LOOKUP($G$10,'mod2 6b'!$F$10:$Q$10,'mod2 6b'!F52:Q52)","v":0},{"$f":"'mod2 6b'!R52","v":0},{"$f":"'mod2 6b'!S52","v":0},{"$f":"'mod2 6b'!T52","v":0}]
[{"$f":"'mod2 6b'!A53","v":4},{"$f":"'mod2 6b'!B53","v":0},{"$f":"'mod2 6b'!C53","v":0},{"$f":"'mod2 6b'!D53","v":0},{"$f":"'mod2 6b'!E53","v":0},{"$f":"LOOKUP($F$10,'mod2 6b'!$F$10:$Q$10,'mod2 6b'!F53:Q53)","v":0},{"$f":"LOOKUP($G$10,'mod2 6b'!$F$10:$Q$10,'mod2 6b'!F53:Q53)","v":0},{"$f":"'mod2 6b'!R53","v":0},{"$f":"'mod2 6b'!S53","v":0},{"$f":"'mod2 6b'!T53","v":0}]
[{"$f":"'mod2 6b'!A54","v":4},{"$f":"'mod2 6b'!B54","v":0},{"$f":"'mod2 6b'!C54","v":0},{"$f":"'mod2 6b'!D54","v":0},{"$f":"'mod2 6b'!E54","v":0},{"$f":"LOOKUP($F$10,'mod2 6b'!$F$10:$Q$10,'mod2 6b'!F54:Q54)","v":0},{"$f":"LOOKUP($G$10,'mod2 6b'!$F$10:$Q$10,'mod2 6b'!F54:Q54)","v":0},{"$f":"'mod2 6b'!R54","v":0},{"$f":"'mod2 6b'!S54","v":0},{"$f":"'mod2 6b'!T54","v":0}]
[{"$f":"'mod2 6b'!A55","v":4},{"$f":"'mod2 6b'!B55","v":0},{"$f":"'mod2 6b'!C55","v":0},{"$f":"'mod2 6b'!D55","v":0},{"$f":"'mod2 6b'!E55","v":0},{"$f":"LOOKUP($F$10,'mod2 6b'!$F$10:$Q$10,'mod2 6b'!F55:Q55)","v":0},{"$f":"LOOKUP($G$10,'mod2 6b'!$F$10:$Q$10,'mod2 6b'!F55:Q55)","v":0},{"$f":"'mod2 6b'!R55","v":0},{"$f":"'mod2 6b'!S55","v":0},{"$f":"'mod2 6b'!T55","v":0}]
[{"$f":"'mod2 6b'!A56","v":4},{"$f":"'mod2 6b'!B56","v":0},{"$f":"'mod2 6b'!C56","v":0},{"$f":"'mod2 6b'!D56","v":0},{"$f":"'mod2 6b'!E56","v":0},{"$f":"LOOKUP($F$10,'mod2 6b'!$F$10:$Q$10,'mod2 6b'!F56:Q56)","v":0},{"$f":"LOOKUP($G$10,'mod2 6b'!$F$10:$Q$10,'mod2 6b'!F56:Q56)","v":0},{"$f":"'mod2 6b'!R56","v":0},{"$f":"'mod2 6b'!S56","v":0},{"$f":"'mod2 6b'!T56","v":0}]
[{"$f":"'mod2 6b'!A57","v":4},{"$f":"'mod2 6b'!B57","v":0},{"$f":"'mod2 6b'!C57","v":0},{"$f":"'mod2 6b'!D57","v":0},{"$f":"'mod2 6b'!E57","v":0},{"$f":"LOOKUP($F$10,'mod2 6b'!$F$10:$Q$10,'mod2 6b'!F57:Q57)","v":0},{"$f":"LOOKUP($G$10,'mod2 6b'!$F$10:$Q$10,'mod2 6b'!F57:Q57)","v":0},{"$f":"'mod2 6b'!R57","v":0},{"$f":"'mod2 6b'!S57","v":0},{"$f":"'mod2 6b'!T57","v":0}]
[{"$f":"'mod2 6b'!A58","v":4},{"$f":"'mod2 6b'!B58","v":0},{"$f":"'mod2 6b'!C58","v":0},{"$f":"'mod2 6b'!D58","v":0},{"$f":"'mod2 6b'!E58","v":0},{"$f":"LOOKUP($F$10,'mod2 6b'!$F$10:$Q$10,'mod2 6b'!F58:Q58)","v":0},{"$f":"LOOKUP($G$10,'mod2 6b'!$F$10:$Q$10,'mod2 6b'!F58:Q58)","v":0},{"$f":"'mod2 6b'!R58","v":0},{"$f":"'mod2 6b'!S58","v":0},{"$f":"'mod2 6b'!T58","v":0}]
[{"$f":"'mod2 6b'!A59","v":4},{"$f":"'mod2 6b'!B59","v":0},{"$f":"'mod2 6b'!C59","v":0},{"$f":"'mod2 6b'!D59","v":0},{"$f":"'mod2 6b'!E59","v":0},{"$f":"LOOKUP($F$10,'mod2 6b'!$F$10:$Q$10,'mod2 6b'!F59:Q59)","v":0},{"$f":"LOOKUP($G$10,'mod2 6b'!$F$10:$Q$10,'mod2 6b'!F59:Q59)","v":0},{"$f":"'mod2 6b'!R59","v":0},{"$f":"'mod2 6b'!S59","v":0},{"$f":"'mod2 6b'!T59","v":0}]
[{"$f":"'mod2 6b'!A60","v":4},{"$f":"'mod2 6b'!B60","v":0},{"$f":"'mod2 6b'!C60","v":0},{"$f":"'mod2 6b'!D60","v":0},{"$f":"'mod2 6b'!E60","v":0},{"$f":"LOOKUP($F$10,'mod2 6b'!$F$10:$Q$10,'mod2 6b'!F60:Q60)","v":0},{"$f":"LOOKUP($G$10,'mod2 6b'!$F$10:$Q$10,'mod2 6b'!F60:Q60)","v":0},{"$f":"'mod2 6b'!R60","v":0},{"$f":"'mod2 6b'!S60","v":0},{"$f":"'mod2 6b'!T60","v":0}]
[{"$f":"'mod2 6b'!A61","v":5},{"$f":"'mod2 6b'!B61","v":0},{"$f":"'mod2 6b'!C61","v":"DEFESA NACIONAL"},{"$f":"'mod2 6b'!D61","v":0},{"$f":"'mod2 6b'!E61","v":0},{"$f":"LOOKUP($F$10,'mod2 6b'!$F$10:$Q$10,'mod2 6b'!F61:Q61)","v":0},{"$f":"LOOKUP($G$10,'mod2 6b'!$F$10:$Q$10,'mod2 6b'!F61:Q61)","v":0},{"$f":"'mod2 6b'!R61","v":0},{"$f":"'mod2 6b'!S61","v":0},{"$f":"'mod2 6b'!T61","v":0}]
[{"$f":"'mod2 6b'!A62","v":5},{"$f":"'mod2 6b'!B62","v":151},{"$f":"'mod2 6b'!C62","v":"Defesa Aérea"},{"$f":"'mod2 6b'!D62","v":0},{"$f":"'mod2 6b'!E62","v":0},{"$f":"LOOKUP($F$10,'mod2 6b'!$F$10:$Q$10,'mod2 6b'!F62:Q62)","v":0},{"$f":"LOOKUP($G$10,'mod2 6b'!$F$10:$Q$10,'mod2 6b'!F62:Q62)","v":0},{"$f":"'mod2 6b'!R62","v":0},{"$f":"'mod2 6b'!S62","v":0},{"$f":"'mod2 6b'!T62","v":0}]
[{"$f":"'mod2 6b'!A63","v":5},{"$f":"'mod2 6b'!B63","v":152},{"$f":"'mod2 6b'!C63","v":"Defesa Naval"},{"$f":"'mod2 6b'!D63","v":0},{"$f":"'mod2 6b'!E63","v":0},{"$f":"LOOKUP($F$10,'mod2 6b'!$F$10:$Q$10,'mod2 6b'!F63:Q63)","v":0},{"$f":"LOOKUP($G$10,'mod2 6b'!$F$10:$Q$10,'mod2 6b'!F63:Q63)","v":0},{"$f":"'mod2 6b'!R63","v":0},{"$f":"'mod2 6b'!S63","v":0},{"$f":"'mod2 6b'!T63","v":0}]
[{"$f":"'mod2 6b'!A64","v":5},{"$f":"'mod2 6b'!B64","v":153},{"$f":"'mod2 6b'!C64","v":"Defesa Terrestre"},{"$f":"'mod2 6b'!D64","v":0},{"$f":"'mod2 6b'!E64","v":0},{"$f":"LOOKUP($F$10,'mod2 6b'!$F$10:$Q$10,'mod2 6b'!F64:Q64)","v":0},{"$f":"LOOKUP($G$10,'mod2 6b'!$F$10:$Q$10,'mod2 6b'!F64:Q64)","v":0},{"$f":"'mod2 6b'!R64","v":0},{"$f":"'mod2 6b'!S64","v":0},{"$f":"'mod2 6b'!T64","v":0}]
[{"$f":"'mod2 6b'!A65","v":5},{"$f":"'mod2 6b'!B65","v":0},{"$f":"'mod2 6b'!C65","v":0},{"$f":"'mod2 6b'!D65","v":0},{"$f":"'mod2 6b'!E65","v":0},{"$f":"LOOKUP($F$10,'mod2 6b'!$F$10:$Q$10,'mod2 6b'!F65:Q65)","v":0},{"$f":"LOOKUP($G$10,'mod2 6b'!$F$10:$Q$10,'mod2 6b'!F65:Q65)","v":0},{"$f":"'mod2 6b'!R65","v":0},{"$f":"'mod2 6b'!S65","v":0},{"$f":"'mod2 6b'!T65","v":0}]
[{"$f":"'mod2 6b'!A66","v":5},{"$f":"'mod2 6b'!B66","v":0},{"$f":"'mod2 6b'!C66","v":0},{"$f":"'mod2 6b'!D66","v":0},{"$f":"'mod2 6b'!E66","v":0},{"$f":"LOOKUP($F$10,'mod2 6b'!$F$10:$Q$10,'mod2 6b'!F66:Q66)","v":0},{"$f":"LOOKUP($G$10,'mod2 6b'!$F$10:$Q$10,'mod2 6b'!F66:Q66)","v":0},{"$f":"'mod2 6b'!R66","v":0},{"$f":"'mod2 6b'!S66","v":0},{"$f":"'mod2 6b'!T66","v":0}]
[{"$f":"'mod2 6b'!A67","v":5},{"$f":"'mod2 6b'!B67","v":0},{"$f":"'mod2 6b'!C67","v":0},{"$f":"'mod2 6b'!D67","v":0},{"$f":"'mod2 6b'!E67","v":0},{"$f":"LOOKUP($F$10,'mod2 6b'!$F$10:$Q$10,'mod2 6b'!F67:Q67)","v":0},{"$f":"LOOKUP($G$10,'mod2 6b'!$F$10:$Q$10,'mod2 6b'!F67:Q67)","v":0},{"$f":"'mod2 6b'!R67","v":0},{"$f":"'mod2 6b'!S67","v":0},{"$f":"'mod2 6b'!T67","v":0}]
[{"$f":"'mod2 6b'!A68","v":5},{"$f":"'mod2 6b'!B68","v":0},{"$f":"'mod2 6b'!C68","v":0},{"$f":"'mod2 6b'!D68","v":0},{"$f":"'mod2 6b'!E68","v":0},{"$f":"LOOKUP($F$10,'mod2 6b'!$F$10:$Q$10,'mod2 6b'!F68:Q68)","v":0},{"$f":"LOOKUP($G$10,'mod2 6b'!$F$10:$Q$10,'mod2 6b'!F68:Q68)","v":0},{"$f":"'mod2 6b'!R68","v":0},{"$f":"'mod2 6b'!S68","v":0},{"$f":"'mod2 6b'!T68","v":0}]
[{"$f":"'mod2 6b'!A69","v":5},{"$f":"'mod2 6b'!B69","v":0},{"$f":"'mod2 6b'!C69","v":0},{"$f":"'mod2 6b'!D69","v":0},{"$f":"'mod2 6b'!E69","v":0},{"$f":"LOOKUP($F$10,'mod2 6b'!$F$10:$Q$10,'mod2 6b'!F69:Q69)","v":0},{"$f":"LOOKUP($G$10,'mod2 6b'!$F$10:$Q$10,'mod2 6b'!F69:Q69)","v":0},{"$f":"'mod2 6b'!R69","v":0},{"$f":"'mod2 6b'!S69","v":0},{"$f":"'mod2 6b'!T69","v":0}]
[{"$f":"'mod2 6b'!A70","v":6},{"$f":"'mod2 6b'!B70","v":0},{"$f":"'mod2 6b'!C70","v":"SEGURANÇA PÚBLICA"},{"$f":"'mod2 6b'!D70","v":0},{"$f":"'mod2 6b'!E70","v":0},{"$f":"LOOKUP($F$10,'mod2 6b'!$F$10:$Q$10,'mod2 6b'!F70:Q70)","v":0},{"$f":"LOOKUP($G$10,'mod2 6b'!$F$10:$Q$10,'mod2 6b'!F70:Q70)","v":0},{"$f":"'mod2 6b'!R70","v":0},{"$f":"'mod2 6b'!S70","v":0},{"$f":"'mod2 6b'!T70","v":0}]
[{"$f":"'mod2 6b'!A71","v":6},{"$f":"'mod2 6b'!B71","v":181},{"$f":"'mod2 6b'!C71","v":"Policiamento"},{"$f":"'mod2 6b'!D71","v":0},{"$f":"'mod2 6b'!E71","v":0},{"$f":"LOOKUP($F$10,'mod2 6b'!$F$10:$Q$10,'mod2 6b'!F71:Q71)","v":0},{"$f":"LOOKUP($G$10,'mod2 6b'!$F$10:$Q$10,'mod2 6b'!F71:Q71)","v":0},{"$f":"'mod2 6b'!R71","v":0},{"$f":"'mod2 6b'!S71","v":0},{"$f":"'mod2 6b'!T71","v":0}]
[{"$f":"'mod2 6b'!A72","v":6},{"$f":"'mod2 6b'!B72","v":182},{"$f":"'mod2 6b'!C72","v":"Defesa Civil"},{"$f":"'mod2 6b'!D72","v":0},{"$f":"'mod2 6b'!E72","v":0},{"$f":"LOOKUP($F$10,'mod2 6b'!$F$10:$Q$10,'mod2 6b'!F72:Q72)","v":0},{"$f":"LOOKUP($G$10,'mod2 6b'!$F$10:$Q$10,'mod2 6b'!F72:Q72)","v":0},{"$f":"'mod2 6b'!R72","v":0},{"$f":"'mod2 6b'!S72","v":0},{"$f":"'mod2 6b'!T72","v":0}]
[{"$f":"'mod2 6b'!A73","v":6},{"$f":"'mod2 6b'!B73","v":183},{"$f":"'mod2 6b'!C73","v":"Informação e Inteligência"},{"$f":"'mod2 6b'!D73","v":0},{"$f":"'mod2 6b'!E73","v":0},{"$f":"LOOKUP($F$10,'mod2 6b'!$F$10:$Q$10,'mod2 6b'!F73:Q73)","v":0},{"$f":"LOOKUP($G$10,'mod2 6b'!$F$10:$Q$10,'mod2 6b'!F73:Q73)","v":0},{"$f":"'mod2 6b'!R73","v":0},{"$f":"'mod2 6b'!S73","v":0},{"$f":"'mod2 6b'!T73","v":0}]
[{"$f":"'mod2 6b'!A74","v":6},{"$f":"'mod2 6b'!B74","v":0},{"$f":"'mod2 6b'!C74","v":0},{"$f":"'mod2 6b'!D74","v":0},{"$f":"'mod2 6b'!E74","v":0},{"$f":"LOOKUP($F$10,'mod2 6b'!$F$10:$Q$10,'mod2 6b'!F74:Q74)","v":0},{"$f":"LOOKUP($G$10,'mod2 6b'!$F$10:$Q$10,'mod2 6b'!F74:Q74)","v":0},{"$f":"'mod2 6b'!R74","v":0},{"$f":"'mod2 6b'!S74","v":0},{"$f":"'mod2 6b'!T74","v":0}]
[{"$f":"'mod2 6b'!A75","v":6},{"$f":"'mod2 6b'!B75","v":0},{"$f":"'mod2 6b'!C75","v":0},{"$f":"'mod2 6b'!D75","v":0},{"$f":"'mod2 6b'!E75","v":0},{"$f":"LOOKUP($F$10,'mod2 6b'!$F$10:$Q$10,'mod2 6b'!F75:Q75)","v":0},{"$f":"LOOKUP($G$10,'mod2 6b'!$F$10:$Q$10,'mod2 6b'!F75:Q75)","v":0},{"$f":"'mod2 6b'!R75","v":0},{"$f":"'mod2 6b'!S75","v":0},{"$f":"'mod2 6b'!T75","v":0}]
[{"$f":"'mod2 6b'!A76","v":6},{"$f":"'mod2 6b'!B76","v":0},{"$f":"'mod2 6b'!C76","v":0},{"$f":"'mod2 6b'!D76","v":0},{"$f":"'mod2 6b'!E76","v":0},{"$f":"LOOKUP($F$10,'mod2 6b'!$F$10:$Q$10,'mod2 6b'!F76:Q76)","v":0},{"$f":"LOOKUP($G$10,'mod2 6b'!$F$10:$Q$10,'mod2 6b'!F76:Q76)","v":0},{"$f":"'mod2 6b'!R76","v":0},{"$f":"'mod2 6b'!S76","v":0},{"$f":"'mod2 6b'!T76","v":0}]
[{"$f":"'mod2 6b'!A77","v":6},{"$f":"'mod2 6b'!B77","v":0},{"$f":"'mod2 6b'!C77","v":0},{"$f":"'mod2 6b'!D77","v":0},{"$f":"'mod2 6b'!E77","v":0},{"$f":"LOOKUP($F$10,'mod2 6b'!$F$10:$Q$10,'mod2 6b'!F77:Q77)","v":0},{"$f":"LOOKUP($G$10,'mod2 6b'!$F$10:$Q$10,'mod2 6b'!F77:Q77)","v":0},{"$f":"'mod2 6b'!R77","v":0},{"$f":"'mod2 6b'!S77","v":0},{"$f":"'mod2 6b'!T77","v":0}]
[{"$f":"'mod2 6b'!A78","v":6},{"$f":"'mod2 6b'!B78","v":0},{"$f":"'mod2 6b'!C78","v":0},{"$f":"'mod2 6b'!D78","v":0},{"$f":"'mod2 6b'!E78","v":0},{"$f":"LOOKUP($F$10,'mod2 6b'!$F$10:$Q$10,'mod2 6b'!F78:Q78)","v":0},{"$f":"LOOKUP($G$10,'mod2 6b'!$F$10:$Q$10,'mod2 6b'!F78:Q78)","v":0},{"$f":"'mod2 6b'!R78","v":0},{"$f":"'mod2 6b'!S78","v":0},{"$f":"'mod2 6b'!T78","v":0}]
[{"$f":"'mod2 6b'!A79","v":7},{"$f":"'mod2 6b'!B79","v":0},{"$f":"'mod2 6b'!C79","v":"RELAÇÕES EXTERIORES"},{"$f":"'mod2 6b'!D79","v":0},{"$f":"'mod2 6b'!E79","v":0},{"$f":"LOOKUP($F$10,'mod2 6b'!$F$10:$Q$10,'mod2 6b'!F79:Q79)","v":0},{"$f":"LOOKUP($G$10,'mod2 6b'!$F$10:$Q$10,'mod2 6b'!F79:Q79)","v":0},{"$f":"'mod2 6b'!R79","v":0},{"$f":"'mod2 6b'!S79","v":0},{"$f":"'mod2 6b'!T79","v":0}]
[{"$f":"'mod2 6b'!A80","v":7},{"$f":"'mod2 6b'!B80","v":211},{"$f":"'mod2 6b'!C80","v":"Relações Diplomáticas"},{"$f":"'mod2 6b'!D80","v":0},{"$f":"'mod2 6b'!E80","v":0},{"$f":"LOOKUP($F$10,'mod2 6b'!$F$10:$Q$10,'mod2 6b'!F80:Q80)","v":0},{"$f":"LOOKUP($G$10,'mod2 6b'!$F$10:$Q$10,'mod2 6b'!F80:Q80)","v":0},{"$f":"'mod2 6b'!R80","v":0},{"$f":"'mod2 6b'!S80","v":0},{"$f":"'mod2 6b'!T80","v":0}]
[{"$f":"'mod2 6b'!A81","v":7},{"$f":"'mod2 6b'!B81","v":212},{"$f":"'mod2 6b'!C81","v":"Cooperação Internacional"},{"$f":"'mod2 6b'!D81","v":0},{"$f":"'mod2 6b'!E81","v":0},{"$f":"LOOKUP($F$10,'mod2 6b'!$F$10:$Q$10,'mod2 6b'!F81:Q81)","v":0},{"$f":"LOOKUP($G$10,'mod2 6b'!$F$10:$Q$10,'mod2 6b'!F81:Q81)","v":0},{"$f":"'mod2 6b'!R81","v":0},{"$f":"'mod2 6b'!S81","v":0},{"$f":"'mod2 6b'!T81","v":0}]
[{"$f":"'mod2 6b'!A82","v":7},{"$f":"'mod2 6b'!B82","v":0},{"$f":"'mod2 6b'!C82","v":0},{"$f":"'mod2 6b'!D82","v":0},{"$f":"'mod2 6b'!E82","v":0},{"$f":"LOOKUP($F$10,'mod2 6b'!$F$10:$Q$10,'mod2 6b'!F82:Q82)","v":0},{"$f":"LOOKUP($G$10,'mod2 6b'!$F$10:$Q$10,'mod2 6b'!F82:Q82)","v":0},{"$f":"'mod2 6b'!R82","v":0},{"$f":"'mod2 6b'!S82","v":0},{"$f":"'mod2 6b'!T82","v":0}]
[{"$f":"'mod2 6b'!A83","v":7},{"$f":"'mod2 6b'!B83","v":0},{"$f":"'mod2 6b'!C83","v":0},{"$f":"'mod2 6b'!D83","v":0},{"$f":"'mod2 6b'!E83","v":0},{"$f":"LOOKUP($F$10,'mod2 6b'!$F$10:$Q$10,'mod2 6b'!F83:Q83)","v":0},{"$f":"LOOKUP($G$10,'mod2 6b'!$F$10:$Q$10,'mod2 6b'!F83:Q83)","v":0},{"$f":"'mod2 6b'!R83","v":0},{"$f":"'mod2 6b'!S83","v":0},{"$f":"'mod2 6b'!T83","v":0}]
[{"$f":"'mod2 6b'!A84","v":7},{"$f":"'mod2 6b'!B84","v":0},{"$f":"'mod2 6b'!C84","v":0},{"$f":"'mod2 6b'!D84","v":0},{"$f":"'mod2 6b'!E84","v":0},{"$f":"LOOKUP($F$10,'mod2 6b'!$F$10:$Q$10,'mod2 6b'!F84:Q84)","v":0},{"$f":"LOOKUP($G$10,'mod2 6b'!$F$10:$Q$10,'mod2 6b'!F84:Q84)","v":0},{"$f":"'mod2 6b'!R84","v":0},{"$f":"'mod2 6b'!S84","v":0},{"$f":"'mod2 6b'!T84","v":0}]
[{"$f":"'mod2 6b'!A85","v":7},{"$f":"'mod2 6b'!B85","v":0},{"$f":"'mod2 6b'!C85","v":0},{"$f":"'mod2 6b'!D85","v":0},{"$f":"'mod2 6b'!E85","v":0},{"$f":"LOOKUP($F$10,'mod2 6b'!$F$10:$Q$10,'mod2 6b'!F85:Q85)","v":0},{"$f":"LOOKUP($G$10,'mod2 6b'!$F$10:$Q$10,'mod2 6b'!F85:Q85)","v":0},{"$f":"'mod2 6b'!R85","v":0},{"$f":"'mod2 6b'!S85","v":0},{"$f":"'mod2 6b'!T85","v":0}]
[{"$f":"'mod2 6b'!A86","v":7},{"$f":"'mod2 6b'!B86","v":0},{"$f":"'mod2 6b'!C86","v":0},{"$f":"'mod2 6b'!D86","v":0},{"$f":"'mod2 6b'!E86","v":0},{"$f":"LOOKUP($F$10,'mod2 6b'!$F$10:$Q$10,'mod2 6b'!F86:Q86)","v":0},{"$f":"LOOKUP($G$10,'mod2 6b'!$F$10:$Q$10,'mod2 6b'!F86:Q86)","v":0},{"$f":"'mod2 6b'!R86","v":0},{"$f":"'mod2 6b'!S86","v":0},{"$f":"'mod2 6b'!T86","v":0}]
[{"$f":"'mod2 6b'!A87","v":8},{"$f":"'mod2 6b'!B87","v":0},{"$f":"'mod2 6b'!C87","v":"ASSISTÊNCIA SOCIAL"},{"$f":"'mod2 6b'!D87","v":0},{"$f":"'mod2 6b'!E87","v":0},{"$f":"LOOKUP($F$10,'mod2 6b'!$F$10:$Q$10,'mod2 6b'!F87:Q87)","v":0},{"$f":"LOOKUP($G$10,'mod2 6b'!$F$10:$Q$10,'mod2 6b'!F87:Q87)","v":0},{"$f":"'mod2 6b'!R87","v":0},{"$f":"'mod2 6b'!S87","v":0},{"$f":"'mod2 6b'!T87","v":0}]
[{"$f":"'mod2 6b'!A88","v":8},{"$f":"'mod2 6b'!B88","v":241},{"$f":"'mod2 6b'!C88","v":"Assistência ao Idoso"},{"$f":"'mod2 6b'!D88","v":0},{"$f":"'mod2 6b'!E88","v":0},{"$f":"LOOKUP($F$10,'mod2 6b'!$F$10:$Q$10,'mod2 6b'!F88:Q88)","v":0},{"$f":"LOOKUP($G$10,'mod2 6b'!$F$10:$Q$10,'mod2 6b'!F88:Q88)","v":0},{"$f":"'mod2 6b'!R88","v":0},{"$f":"'mod2 6b'!S88","v":0},{"$f":"'mod2 6b'!T88","v":0}]
[{"$f":"'mod2 6b'!A89","v":8},{"$f":"'mod2 6b'!B89","v":242},{"$f":"'mod2 6b'!C89","v":"Assist. ao Portador de Deficiência"},{"$f":"'mod2 6b'!D89","v":0},{"$f":"'mod2 6b'!E89","v":0},{"$f":"LOOKUP($F$10,'mod2 6b'!$F$10:$Q$10,'mod2 6b'!F89:Q89)","v":0},{"$f":"LOOKUP($G$10,'mod2 6b'!$F$10:$Q$10,'mod2 6b'!F89:Q89)","v":0},{"$f":"'mod2 6b'!R89","v":0},{"$f":"'mod2 6b'!S89","v":0},{"$f":"'mod2 6b'!T89","v":0}]
[{"$f":"'mod2 6b'!A90","v":8},{"$f":"'mod2 6b'!B90","v":243},{"$f":"'mod2 6b'!C90","v":"Assist. à Criança e ao Adolescente"},{"$f":"'mod2 6b'!D90","v":0},{"$f":"'mod2 6b'!E90","v":0},{"$f":"LOOKUP($F$10,'mod2 6b'!$F$10:$Q$10,'mod2 6b'!F90:Q90)","v":0},{"$f":"LOOKUP($G$10,'mod2 6b'!$F$10:$Q$10,'mod2 6b'!F90:Q90)","v":0},{"$f":"'mod2 6b'!R90","v":0},{"$f":"'mod2 6b'!S90","v":0},{"$f":"'mod2 6b'!T90","v":0}]
[{"$f":"'mod2 6b'!A91","v":8},{"$f":"'mod2 6b'!B91","v":244},{"$f":"'mod2 6b'!C91","v":"Assistência Comunitária"},{"$f":"'mod2 6b'!D91","v":0},{"$f":"'mod2 6b'!E91","v":0},{"$f":"LOOKUP($F$10,'mod2 6b'!$F$10:$Q$10,'mod2 6b'!F91:Q91)","v":0},{"$f":"LOOKUP($G$10,'mod2 6b'!$F$10:$Q$10,'mod2 6b'!F91:Q91)","v":0},{"$f":"'mod2 6b'!R91","v":0},{"$f":"'mod2 6b'!S91","v":0},{"$f":"'mod2 6b'!T91","v":0}]
[{"$f":"'mod2 6b'!A92","v":8},{"$f":"'mod2 6b'!B92","v":0},{"$f":"'mod2 6b'!C92","v":0},{"$f":"'mod2 6b'!D92","v":0},{"$f":"'mod2 6b'!E92","v":0},{"$f":"LOOKUP($F$10,'mod2 6b'!$F$10:$Q$10,'mod2 6b'!F92:Q92)","v":0},{"$f":"LOOKUP($G$10,'mod2 6b'!$F$10:$Q$10,'mod2 6b'!F92:Q92)","v":0},{"$f":"'mod2 6b'!R92","v":0},{"$f":"'mod2 6b'!S92","v":0},{"$f":"'mod2 6b'!T92","v":0}]
[{"$f":"'mod2 6b'!A93","v":8},{"$f":"'mod2 6b'!B93","v":0},{"$f":"'mod2 6b'!C93","v":0},{"$f":"'mod2 6b'!D93","v":0},{"$f":"'mod2 6b'!E93","v":0},{"$f":"LOOKUP($F$10,'mod2 6b'!$F$10:$Q$10,'mod2 6b'!F93:Q93)","v":0},{"$f":"LOOKUP($G$10,'mod2 6b'!$F$10:$Q$10,'mod2 6b'!F93:Q93)","v":0},{"$f":"'mod2 6b'!R93","v":0},{"$f":"'mod2 6b'!S93","v":0},{"$f":"'mod2 6b'!T93","v":0}]
[{"$f":"'mod2 6b'!A94","v":8},{"$f":"'mod2 6b'!B94","v":0},{"$f":"'mod2 6b'!C94","v":0},{"$f":"'mod2 6b'!D94","v":0},{"$f":"'mod2 6b'!E94","v":0},{"$f":"LOOKUP($F$10,'mod2 6b'!$F$10:$Q$10,'mod2 6b'!F94:Q94)","v":0},{"$f":"LOOKUP($G$10,'mod2 6b'!$F$10:$Q$10,'mod2 6b'!F94:Q94)","v":0},{"$f":"'mod2 6b'!R94","v":0},{"$f":"'mod2 6b'!S94","v":0},{"$f":"'mod2 6b'!T94","v":0}]
[{"$f":"'mod2 6b'!A95","v":8},{"$f":"'mod2 6b'!B95","v":0},{"$f":"'mod2 6b'!C95","v":0},{"$f":"'mod2 6b'!D95","v":0},{"$f":"'mod2 6b'!E95","v":0},{"$f":"LOOKUP($F$10,'mod2 6b'!$F$10:$Q$10,'mod2 6b'!F95:Q95)","v":0},{"$f":"LOOKUP($G$10,'mod2 6b'!$F$10:$Q$10,'mod2 6b'!F95:Q95)","v":0},{"$f":"'mod2 6b'!R95","v":0},{"$f":"'mod2 6b'!S95","v":0},{"$f":"'mod2 6b'!T95","v":0}]
[{"$f":"'mod2 6b'!A96","v":8},{"$f":"'mod2 6b'!B96","v":0},{"$f":"'mod2 6b'!C96","v":0},{"$f":"'mod2 6b'!D96","v":0},{"$f":"'mod2 6b'!E96","v":0},{"$f":"LOOKUP($F$10,'mod2 6b'!$F$10:$Q$10,'mod2 6b'!F96:Q96)","v":0},{"$f":"LOOKUP($G$10,'mod2 6b'!$F$10:$Q$10,'mod2 6b'!F96:Q96)","v":0},{"$f":"'mod2 6b'!R96","v":0},{"$f":"'mod2 6b'!S96","v":0},{"$f":"'mod2 6b'!T96","v":0}]
[{"$f":"'mod2 6b'!A97","v":9},{"$f":"'mod2 6b'!B97","v":0},{"$f":"'mod2 6b'!C97","v":"PREVIDÊNCIA SOCIAL"},{"$f":"'mod2 6b'!D97","v":0},{"$f":"'mod2 6b'!E97","v":0},{"$f":"LOOKUP($F$10,'mod2 6b'!$F$10:$Q$10,'mod2 6b'!F97:Q97)","v":0},{"$f":"LOOKUP($G$10,'mod2 6b'!$F$10:$Q$10,'mod2 6b'!F97:Q97)","v":0},{"$f":"'mod2 6b'!R97","v":0},{"$f":"'mod2 6b'!S97","v":0},{"$f":"'mod2 6b'!T97","v":0}]
[{"$f":"'mod2 6b'!A98","v":9},{"$f":"'mod2 6b'!B98","v":271},{"$f":"'mod2 6b'!C98","v":"Previdência Básica"},{"$f":"'mod2 6b'!D98","v":0},{"$f":"'mod2 6b'!E98","v":0},{"$f":"LOOKUP($F$10,'mod2 6b'!$F$10:$Q$10,'mod2 6b'!F98:Q98)","v":0},{"$f":"LOOKUP($G$10,'mod2 6b'!$F$10:$Q$10,'mod2 6b'!F98:Q98)","v":0},{"$f":"'mod2 6b'!R98","v":0},{"$f":"'mod2 6b'!S98","v":0},{"$f":"'mod2 6b'!T98","v":0}]
[{"$f":"'mod2 6b'!A99","v":9},{"$f":"'mod2 6b'!B99","v":272},{"$f":"'mod2 6b'!C99","v":"Previdência do Regime Estatutário"},{"$f":"'mod2 6b'!D99","v":0},{"$f":"'mod2 6b'!E99","v":0},{"$f":"LOOKUP($F$10,'mod2 6b'!$F$10:$Q$10,'mod2 6b'!F99:Q99)","v":0},{"$f":"LOOKUP($G$10,'mod2 6b'!$F$10:$Q$10,'mod2 6b'!F99:Q99)","v":0},{"$f":"'mod2 6b'!R99","v":0},{"$f":"'mod2 6b'!S99","v":0},{"$f":"'mod2 6b'!T99","v":0}]
[{"$f":"'mod2 6b'!A100","v":9},{"$f":"'mod2 6b'!B100","v":273},{"$f":"'mod2 6b'!C100","v":"Previdência Complementar"},{"$f":"'mod2 6b'!D100","v":0},{"$f":"'mod2 6b'!E100","v":0},{"$f":"LOOKUP($F$10,'mod2 6b'!$F$10:$Q$10,'mod2 6b'!F100:Q100)","v":0},{"$f":"LOOKUP($G$10,'mod2 6b'!$F$10:$Q$10,'mod2 6b'!F100:Q100)","v":0},{"$f":"'mod2 6b'!R100","v":0},{"$f":"'mod2 6b'!S100","v":0},{"$f":"'mod2 6b'!T100","v":0}]
[{"$f":"'mod2 6b'!A101","v":9},{"$f":"'mod2 6b'!B101","v":274},{"$f":"'mod2 6b'!C101","v":"Previdência Especial"},{"$f":"'mod2 6b'!D101","v":0},{"$f":"'mod2 6b'!E101","v":0},{"$f":"LOOKUP($F$10,'mod2 6b'!$F$10:$Q$10,'mod2 6b'!F101:Q101)","v":0},{"$f":"LOOKUP($G$10,'mod2 6b'!$F$10:$Q$10,'mod2 6b'!F101:Q101)","v":0},{"$f":"'mod2 6b'!R101","v":0},{"$f":"'mod2 6b'!S101","v":0},{"$f":"'mod2 6b'!T101","v":0}]
[{"$f":"'mod2 6b'!A102","v":9},{"$f":"'mod2 6b'!B102","v":0},{"$f":"'mod2 6b'!C102","v":0},{"$f":"'mod2 6b'!D102","v":0},{"$f":"'mod2 6b'!E102","v":0},{"$f":"LOOKUP($F$10,'mod2 6b'!$F$10:$Q$10,'mod2 6b'!F102:Q102)","v":0},{"$f":"LOOKUP($G$10,'mod2 6b'!$F$10:$Q$10,'mod2 6b'!F102:Q102)","v":0},{"$f":"'mod2 6b'!R102","v":0},{"$f":"'mod2 6b'!S102","v":0},{"$f":"'mod2 6b'!T102","v":0}]
[{"$f":"'mod2 6b'!A103","v":9},{"$f":"'mod2 6b'!B103","v":0},{"$f":"'mod2 6b'!C103","v":0},{"$f":"'mod2 6b'!D103","v":0},{"$f":"'mod2 6b'!E103","v":0},{"$f":"LOOKUP($F$10,'mod2 6b'!$F$10:$Q$10,'mod2 6b'!F103:Q103)","v":0},{"$f":"LOOKUP($G$10,'mod2 6b'!$F$10:$Q$10,'mod2 6b'!F103:Q103)","v":0},{"$f":"'mod2 6b'!R103","v":0},{"$f":"'mod2 6b'!S103","v":0},{"$f":"'mod2 6b'!T103","v":0}]
[{"$f":"'mod2 6b'!A104","v":9},{"$f":"'mod2 6b'!B104","v":0},{"$f":"'mod2 6b'!C104","v":0},{"$f":"'mod2 6b'!D104","v":0},{"$f":"'mod2 6b'!E104","v":0},{"$f":"LOOKUP($F$10,'mod2 6b'!$F$10:$Q$10,'mod2 6b'!F104:Q104)","v":0},{"$f":"LOOKUP($G$10,'mod2 6b'!$F$10:$Q$10,'mod2 6b'!F104:Q104)","v":0},{"$f":"'mod2 6b'!R104","v":0},{"$f":"'mod2 6b'!S104","v":0},{"$f":"'mod2 6b'!T104","v":0}]
[{"$f":"'mod2 6b'!A105","v":9},{"$f":"'mod2 6b'!B105","v":0},{"$f":"'mod2 6b'!C105","v":0},{"$f":"'mod2 6b'!D105","v":0},{"$f":"'mod2 6b'!E105","v":0},{"$f":"LOOKUP($F$10,'mod2 6b'!$F$10:$Q$10,'mod2 6b'!F105:Q105)","v":0},{"$f":"LOOKUP($G$10,'mod2 6b'!$F$10:$Q$10,'mod2 6b'!F105:Q105)","v":0},{"$f":"'mod2 6b'!R105","v":0},{"$f":"'mod2 6b'!S105","v":0},{"$f":"'mod2 6b'!T105","v":0}]
[{"$f":"'mod2 6b'!A106","v":9},{"$f":"'mod2 6b'!B106","v":0},{"$f":"'mod2 6b'!C106","v":0},{"$f":"'mod2 6b'!D106","v":0},{"$f":"'mod2 6b'!E106","v":0},{"$f":"LOOKUP($F$10,'mod2 6b'!$F$10:$Q$10,'mod2 6b'!F106:Q106)","v":0},{"$f":"LOOKUP($G$10,'mod2 6b'!$F$10:$Q$10,'mod2 6b'!F106:Q106)","v":0},{"$f":"'mod2 6b'!R106","v":0},{"$f":"'mod2 6b'!S106","v":0},{"$f":"'mod2 6b'!T106","v":0}]
[{"$f":"'mod2 6b'!A107","v":4},{"$f":"'mod2 6b'!B107","v":0},{"$f":"'mod2 6b'!C107","v":"ADMINISTRAÇÃO"},20123396,20123396,3166854.51,3166854.51,{"$f":"'mod2 6b'!R107","v":7606374.5},{"$f":"'mod2 6b'!S107","v":7606374.5},{"$f":"D107-I107","v":12517021.5}]
[{"$f":"'mod2 6b'!A108","v":10},{"$f":"'mod2 6b'!B108","v":301},{"$f":"'mod2 6b'!C108","v":"Atenção Básica"},{"$f":"'mod2 6b'!D108","v":0},{"$f":"'mod2 6b'!E108","v":0},{"$f":"LOOKUP($F$10,'mod2 6b'!$F$10:$Q$10,'mod2 6b'!F108:Q108)","v":0},{"$f":"LOOKUP($G$10,'mod2 6b'!$F$10:$Q$10,'mod2 6b'!F108:Q108)","v":0},{"$f":"'mod2 6b'!R108","v":0},{"$f":"'mod2 6b'!S108","v":0},{"$f":"'mod2 6b'!T108","v":0}]
[4,122,"Administração Geral",20123396,20123396,3166854.51,3166854.51,{"$f":"H107","v":7606374.5},{"$f":"I107","v":7606374.5},{"$f":"D109-I109","v":12517021.5}]
[{"$f":"'mod2 6b'!A110","v":10},{"$f":"'mod2 6b'!B110","v":303},{"$f":"'mod2 6b'!C110","v":"Suporte Profilático e Terapêutico"},{"$f":"'mod2 6b'!D110","v":0},{"$f":"'mod2 6b'!E110","v":0},{"$f":"LOOKUP($F$10,'mod2 6b'!$F$10:$Q$10,'mod2 6b'!F110:Q110)","v":0},{"$f":"LOOKUP($G$10,'mod2 6b'!$F$10:$Q$10,'mod2 6b'!F110:Q110)","v":0},{"$f":"'mod2 6b'!R110","v":0},{"$f":"'mod2 6b'!S110","v":0},{"$f":"'mod2 6b'!T110","v":0}]
[{"$f":"'mod2 6b'!A111","v":10},{"$f":"'mod2 6b'!B111","v":304},{"$f":"'mod2 6b'!C111","v":"Vigilância Sanitária"},{"$f":"'mod2 6b'!D111","v":0},{"$f":"'mod2 6b'!E111","v":0},{"$f":"LOOKUP($F$10,'mod2 6b'!$F$10:$Q$10,'mod2 6b'!F111:Q111)","v":0},{"$f":"LOOKUP($G$10,'mod2 6b'!$F$10:$Q$10,'mod2 6b'!F111:Q111)","v":0},{"$f":"'mod2 6b'!R111","v":0},{"$f":"'mod2 6b'!S111","v":0},{"$f":"'mod2 6b'!T111","v":0}]
[{"$f":"'mod2 6b'!A112","v":10},{"$f":"'mod2 6b'!B112","v":305},{"$f":"'mod2 6b'!C112","v":"Vigilância Epidemiológica"},{"$f":"'mod2 6b'!D112","v":0},{"$f":"'mod2 6b'!E112","v":0},{"$f":"LOOKUP($F$10,'mod2 6b'!$F$10:$Q$10,'mod2 6b'!F112:Q112)","v":0},{"$f":"LOOKUP($G$10,'mod2 6b'!$F$10:$Q$10,'mod2 6b'!F112:Q112)","v":0},{"$f":"'mod2 6b'!R112","v":0},{"$f":"'mod2 6b'!S112","v":0},{"$f":"'mod2 6b'!T112","v":0}]
[{"$f":"'mod2 6b'!A113","v":10},{"$f":"'mod2 6b'!B113","v":306},{"$f":"'mod2 6b'!C113","v":"Alimentação e Nutrição"},{"$f":"'mod2 6b'!D113","v":0},{"$f":"'mod2 6b'!E113","v":0},{"$f":"LOOKUP($F$10,'mod2 6b'!$F$10:$Q$10,'mod2 6b'!F113:Q113)","v":0},{"$f":"LOOKUP($G$10,'mod2 6b'!$F$10:$Q$10,'mod2 6b'!F113:Q113)","v":0},{"$f":"'mod2 6b'!R113","v":0},{"$f":"'mod2 6b'!S113","v":0},{"$f":"'mod2 6b'!T113","v":0}]
[{"$f":"'mod2 6b'!A114","v":10},{"$f":"'mod2 6b'!B114","v":0},{"$f":"'mod2 6b'!C114","v":0},{"$f":"'mod2 6b'!D114","v":0},{"$f":"'mod2 6b'!E114","v":0},{"$f":"LOOKUP($F$10,'mod2 6b'!$F$10:$Q$10,'mod2 6b'!F114:Q114)","v":0},{"$f":"LOOKUP($G$10,'mod2 6b'!$F$10:$Q$10,'mod2 6b'!F114:Q114)","v":0},{"$f":"'mod2 6b'!R114","v":0},{"$f":"'mod2 6b'!S114","v":0},{"$f":"'mod2 6b'!T114","v":0}]
[{"$f":"'mod2 6b'!A115","v":10},{"$f":"'mod2 6b'!B115","v":0},{"$f":"'mod2 6b'!C115","v":0},{"$f":"'mod2 6b'!D115","v":0},{"$f":"'mod2 6b'!E115","v":0},{"$f":"LOOKUP($F$10,'mod2 6b'!$F$10:$Q$10,'mod2 6b'!F115:Q115)","v":0},{"$f":"LOOKUP($G$10,'mod2 6b'!$F$10:$Q$10,'mod2 6b'!F115:Q115)","v":0},{"$f":"'mod2 6b'!R115","v":0},{"$f":"'mod2 6b'!S115","v":0},{"$f":"'mod2 6b'!T115","v":0}]
[{"$f":"'mod2 6b'!A116","v":10},{"$f":"'mod2 6b'!B116","v":0},{"$f":"'mod2 6b'!C116","v":0},{"$f":"'mod2 6b'!D116","v":0},{"$f":"'mod2 6b'!E116","v":0},{"$f":"LOOKUP($F$10,'mod2 6b'!$F$10:$Q$10,'mod2 6b'!F116:Q116)","v":0},{"$f":"LOOKUP($G$10,'mod2 6b'!$F$10:$Q$10,'mod2 6b'!F116:Q116)","v":0},{"$f":"'mod2 6b'!R116","v":0},{"$f":"'mod2 6b'!S116","v":0},{"$f":"'mod2 6b'!T116","v":0}]
[{"$f":"'mod2 6b'!A117","v":10},{"$f":"'mod2 6b'!B117","v":0},{"$f":"'mod2 6b'!C117","v":0},{"$f":"'mod2 6b'!D117","v":0},{"$f":"'mod2 6b'!E117","v":0},{"$f":"LOOKUP($F$10,'mod2 6b'!$F$10:$Q$10,'mod2 6b'!F117:Q117)","v":0},{"$f":"LOOKUP($G$10,'mod2 6b'!$F$10:$Q$10,'mod2 6b'!F117:Q117)","v":0},{"$f":"'mod2 6b'!R117","v":0},{"$f":"'mod2 6b'!S117","v":0},{"$f":"'mod2 6b'!T117","v":0}]
[{"$f":"'mod2 6b'!A118","v":10},{"$f":"'mod2 6b'!B118","v":0},{"$f":"'mod2 6b'!C118","v":0},{"$f":"'mod2 6b'!D118","v":0},{"$f":"'mod2 6b'!E118","v":0},{"$f":"LOOKUP($F$10,'mod2 6b'!$F$10:$Q$10,'mod2 6b'!F118:Q118)","v":0},{"$f":"LOOKUP($G$10,'mod2 6b'!$F$10:$Q$10,'mod2 6b'!F118:Q118)","v":0},{"$f":"'mod2 6b'!R118","v":0},{"$f":"'mod2 6b'!S118","v":0},{"$f":"'mod2 6b'!T118","v":0}]
[{"$f":"'mod2 6b'!A119","v":10},{"$f":"'mod2 6b'!B119","v":0},{"$f":"'mod2 6b'!C119","v":0},{"$f":"'mod2 6b'!D119","v":0},{"$f":"'mod2 6b'!E119","v":0},{"$f":"LOOKUP($F$10,'mod2 6b'!$F$10:$Q$10,'mod2 6b'!F119:Q119)","v":0},{"$f":"LOOKUP($G$10,'mod2 6b'!$F$10:$Q$10,'mod2 6b'!F119:Q119)","v":0},{"$f":"'mod2 6b'!R119","v":0},{"$f":"'mod2 6b'!S119","v":0},{"$f":"'mod2 6b'!T119","v":0}]
[{"$f":"'mod2 6b'!A120","v":10},{"$f":"'mod2 6b'!B120","v":0},{"$f":"'mod2 6b'!C120","v":0},{"$f":"'mod2 6b'!D120","v":0},{"$f":"'mod2 6b'!E120","v":0},{"$f":"LOOKUP($F$10,'mod2 6b'!$F$10:$Q$10,'mod2 6b'!F120:Q120)","v":0},{"$f":"LOOKUP($G$10,'mod2 6b'!$F$10:$Q$10,'mod2 6b'!F120:Q120)","v":0},{"$f":"'mod2 6b'!R120","v":0},{"$f":"'mod2 6b'!S120","v":0},{"$f":"'mod2 6b'!T120","v":0}]
[{"$f":"'mod2 6b'!A121","v":10},{"$f":"'mod2 6b'!B121","v":0},{"$f":"'mod2 6b'!C121","v":0},{"$f":"'mod2 6b'!D121","v":0},{"$f":"'mod2 6b'!E121","v":0},{"$f":"LOOKUP($F$10,'mod2 6b'!$F$10:$Q$10,'mod2 6b'!F121:Q121)","v":0},{"$f":"LOOKUP($G$10,'mod2 6b'!$F$10:$Q$10,'mod2 6b'!F121:Q121)","v":0},{"$f":"'mod2 6b'!R121","v":0},{"$f":"'mod2 6b'!S121","v":0},{"$f":"'mod2 6b'!T121","v":0}]
[{"$f":"'mod2 6b'!A122","v":10},{"$f":"'mod2 6b'!B122","v":0},{"$f":"'mod2 6b'!C122","v":0},{"$f":"'mod2 6b'!D122","v":0},{"$f":"'mod2 6b'!E122","v":0},{"$f":"LOOKUP($F$10,'mod2 6b'!$F$10:$Q$10,'mod2 6b'!F122:Q122)","v":0},{"$f":"LOOKUP($G$10,'mod2 6b'!$F$10:$Q$10,'mod2 6b'!F122:Q122)","v":0},{"$f":"'mod2 6b'!R122","v":0},{"$f":"'mod2 6b'!S122","v":0},{"$f":"'mod2 6b'!T122","v":0}]
[{"$f":"'mod2 6b'!A123","v":10},{"$f":"'mod2 6b'!B123","v":0},{"$f":"'mod2 6b'!C123","v":0},{"$f":"'mod2 6b'!D123","v":0},{"$f":"'mod2 6b'!E123","v":0},{"$f":"LOOKUP($F$10,'mod2 6b'!$F$10:$Q$10,'mod2 6b'!F123:Q123)","v":0},{"$f":"LOOKUP($G$10,'mod2 6b'!$F$10:$Q$10,'mod2 6b'!F123:Q123)","v":0},{"$f":"'mod2 6b'!R123","v":0},{"$f":"'mod2 6b'!S123","v":0},{"$f":"'mod2 6b'!T123","v":0}]
[{"$f":"'mod2 6b'!A124","v":11},{"$f":"'mod2 6b'!B124","v":0},{"$f":"'mod2 6b'!C124","v":"TRABALHO"},{"$f":"'mod2 6b'!D124","v":0},{"$f":"'mod2 6b'!E124","v":0},{"$f":"LOOKUP($F$10,'mod2 6b'!$F$10:$Q$10,'mod2 6b'!F124:Q124)","v":0},{"$f":"LOOKUP($G$10,'mod2 6b'!$F$10:$Q$10,'mod2 6b'!F124:Q124)","v":0},{"$f":"'mod2 6b'!R124","v":0},{"$f":"'mod2 6b'!S124","v":0},{"$f":"'mod2 6b'!T124","v":0}]
[{"$f":"'mod2 6b'!A125","v":11},{"$f":"'mod2 6b'!B125","v":331},{"$f":"'mod2 6b'!C125","v":"Proteção e Benefícios ao Trabalhador"},{"$f":"'mod2 6b'!D125","v":0},{"$f":"'mod2 6b'!E125","v":0},{"$f":"LOOKUP($F$10,'mod2 6b'!$F$10:$Q$10,'mod2 6b'!F125:Q125)","v":0},{"$f":"LOOKUP($G$10,'mod2 6b'!$F$10:$Q$10,'mod2 6b'!F125:Q125)","v":0},{"$f":"'mod2 6b'!R125","v":0},{"$f":"'mod2 6b'!S125","v":0},{"$f":"'mod2 6b'!T125","v":0}]
[{"$f":"'mod2 6b'!A126","v":11},{"$f":"'mod2 6b'!B126","v":332},{"$f":"'mod2 6b'!C126","v":"Relações de Trabalho"},{"$f":"'mod2 6b'!D126","v":0},{"$f":"'mod2 6b'!E126","v":0},{"$f":"LOOKUP($F$10,'mod2 6b'!$F$10:$Q$10,'mod2 6b'!F126:Q126)","v":0},{"$f":"LOOKUP($G$10,'mod2 6b'!$F$10:$Q$10,'mod2 6b'!F126:Q126)","v":0},{"$f":"'mod2 6b'!R126","v":0},{"$f":"'mod2 6b'!S126","v":0},{"$f":"'mod2 6b'!T126","v":0}]
[{"$f":"'mod2 6b'!A127","v":11},{"$f":"'mod2 6b'!B127","v":333},{"$f":"'mod2 6b'!C127","v":"Empregabilidade"},{"$f":"'mod2 6b'!D127","v":0},{"$f":"'mod2 6b'!E127","v":0},{"$f":"LOOKUP($F$10,'mod2 6b'!$F$10:$Q$10,'mod2 6b'!F127:Q127)","v":0},{"$f":"LOOKUP($G$10,'mod2 6b'!$F$10:$Q$10,'mod2 6b'!F127:Q127)","v":0},{"$f":"'mod2 6b'!R127","v":0},{"$f":"'mod2 6b'!S127","v":0},{"$f":"'mod2 6b'!T127","v":0}]
[{"$f":"'mod2 6b'!A128","v":11},{"$f":"'mod2 6b'!B128","v":334},{"$f":"'mod2 6b'!C128","v":"Fomento ao Trabalho"},{"$f":"'mod2 6b'!D128","v":0},{"$f":"'mod2 6b'!E128","v":0},{"$f":"LOOKUP($F$10,'mod2 6b'!$F$10:$Q$10,'mod2 6b'!F128:Q128)","v":0},{"$f":"LOOKUP($G$10,'mod2 6b'!$F$10:$Q$10,'mod2 6b'!F128:Q128)","v":0},{"$f":"'mod2 6b'!R128","v":0},{"$f":"'mod2 6b'!S128","v":0},{"$f":"'mod2 6b'!T128","v":0}]
[{"$f":"'mod2 6b'!A129","v":11},{"$f":"'mod2 6b'!B129","v":0},{"$f":"'mod2 6b'!C129","v":0},{"$f":"'mod2 6b'!D129","v":0},{"$f":"'mod2 6b'!E129","v":0},{"$f":"LOOKUP($F$10,'mod2 6b'!$F$10:$Q$10,'mod2 6b'!F129:Q129)","v":0},{"$f":"LOOKUP($G$10,'mod2 6b'!$F$10:$Q$10,'mod2 6b'!F129:Q129)","v":0},{"$f":"'mod2 6b'!R129","v":0},{"$f":"'mod2 6b'!S129","v":0},{"$f":"'mod2 6b'!T129","v":0}]
[{"$f":"'mod2 6b'!A130","v":11},{"$f":"'mod2 6b'!B130","v":0},{"$f":"'mod2 6b'!C130","v":0},{"$f":"'mod2 6b'!D130","v":0},{"$f":"'mod2 6b'!E130","v":0},{"$f":"LOOKUP($F$10,'mod2 6b'!$F$10:$Q$10,'mod2 6b'!F130:Q130)","v":0},{"$f":"LOOKUP($G$10,'mod2 6b'!$F$10:$Q$10,'mod2 6b'!F130:Q130)","v":0},{"$f":"'mod2 6b'!R130","v":0},{"$f":"'mod2 6b'!S130","v":0},{"$f":"'mod2 6b'!T130","v":0}]
[{"$f":"'mod2 6b'!A131","v":11},{"$f":"'mod2 6b'!B131","v":0},{"$f":"'mod2 6b'!C131","v":0},{"$f":"'mod2 6b'!D131","v":0},{"$f":"'mod2 6b'!E131","v":0},{"$f":"LOOKUP($F$10,'mod2 6b'!$F$10:$Q$10,'mod2 6b'!F131:Q131)","v":0},{"$f":"LOOKUP($G$10,'mod2 6b'!$F$10:$Q$10,'mod2 6b'!F131:Q131)","v":0},{"$f":"'mod2 6b'!R131","v":0},{"$f":"'mod2 6b'!S131","v":0},{"$f":"'mod2 6b'!T131","v":0}]
[{"$f":"'mod2 6b'!A132","v":11},{"$f":"'mod2 6b'!B132","v":0},{"$f":"'mod2 6b'!C132","v":0},{"$f":"'mod2 6b'!D132","v":0},{"$f":"'mod2 6b'!E132","v":0},{"$f":"LOOKUP($F$10,'mod2 6b'!$F$10:$Q$10,'mod2 6b'!F132:Q132)","v":0},{"$f":"LOOKUP($G$10,'mod2 6b'!$F$10:$Q$10,'mod2 6b'!F132:Q132)","v":0},{"$f":"'mod2 6b'!R132","v":0},{"$f":"'mod2 6b'!S132","v":0},{"$f":"'mod2 6b'!T132","v":0}]
[{"$f":"'mod2 6b'!A133","v":11},{"$f":"'mod2 6b'!B133","v":0},{"$f":"'mod2 6b'!C133","v":0},{"$f":"'mod2 6b'!D133","v":0},{"$f":"'mod2 6b'!E133","v":0},{"$f":"LOOKUP($F$10,'mod2 6b'!$F$10:$Q$10,'mod2 6b'!F133:Q133)","v":0},{"$f":"LOOKUP($G$10,'mod2 6b'!$F$10:$Q$10,'mod2 6b'!F133:Q133)","v":0},{"$f":"'mod2 6b'!R133","v":0},{"$f":"'mod2 6b'!S133","v":0},{"$f":"'mod2 6b'!T133","v":0}]
[{"$f":"'mod2 6b'!A134","v":12},{"$f":"'mod2 6b'!B134","v":0},{"$f":"'mod2 6b'!C134","v":"EDUCAÇÃO"},{"$f":"'mod2 6b'!D134","v":0},{"$f":"'mod2 6b'!E134","v":0},{"$f":"LOOKUP($F$10,'mod2 6b'!$F$10:$Q$10,'mod2 6b'!F134:Q134)","v":0},{"$f":"LOOKUP($G$10,'mod2 6b'!$F$10:$Q$10,'mod2 6b'!F134:Q134)","v":0},{"$f":"'mod2 6b'!R134","v":0},{"$f":"'mod2 6b'!S134","v":0},{"$f":"'mod2 6b'!T134","v":0}]
[{"$f":"'mod2 6b'!A135","v":12},{"$f":"'mod2 6b'!B135","v":361},{"$f":"'mod2 6b'!C135","v":"Ensino Fundamental"},{"$f":"'mod2 6b'!D135","v":0},{"$f":"'mod2 6b'!E135","v":0},{"$f":"LOOKUP($F$10,'mod2 6b'!$F$10:$Q$10,'mod2 6b'!F135:Q135)","v":0},{"$f":"LOOKUP($G$10,'mod2 6b'!$F$10:$Q$10,'mod2 6b'!F135:Q135)","v":0},{"$f":"'mod2 6b'!R135","v":0},{"$f":"'mod2 6b'!S135","v":0},{"$f":"'mod2 6b'!T135","v":0}]
[{"$f":"'mod2 6b'!A136","v":12},{"$f":"'mod2 6b'!B136","v":362},{"$f":"'mod2 6b'!C136","v":"Ensino Médio"},{"$f":"'mod2 6b'!D136","v":0},{"$f":"'mod2 6b'!E136","v":0},{"$f":"LOOKUP($F$10,'mod2 6b'!$F$10:$Q$10,'mod2 6b'!F136:Q136)","v":0},{"$f":"LOOKUP($G$10,'mod2 6b'!$F$10:$Q$10,'mod2 6b'!F136:Q136)","v":0},{"$f":"'mod2 6b'!R136","v":0},{"$f":"'mod2 6b'!S136","v":0},{"$f":"'mod2 6b'!T136","v":0}]
[{"$f":"'mod2 6b'!A137","v":12},{"$f":"'mod2 6b'!B137","v":363},{"$f":"'mod2 6b'!C137","v":"Ensino Profissional"},{"$f":"'mod2 6b'!D137","v":0},{"$f":"'mod2 6b'!E137","v":0},{"$f":"LOOKUP($F$10,'mod2 6b'!$F$10:$Q$10,'mod2 6b'!F137:Q137)","v":0},{"$f":"LOOKUP($G$10,'mod2 6b'!$F$10:$Q$10,'mod2 6b'!F137:Q137)","v":0},{"$f":"'mod2 6b'!R137","v":0},{"$f":"'mod2 6b'!S137","v":0},{"$f":"'mod2 6b'!T137","v":0}]
[{"$f":"'mod2 6b'!A138","v":12},{"$f":"'mod2 6b'!B138","v":364},{"$f":"'mod2 6b'!C138","v":"Ensino Superior"},{"$f":"'mod2 6b'!D138","v":0},{"$f":"'mod2 6b'!E138","v":0},{"$f":"LOOKUP($F$10,'mod2 6b'!$F$10:$Q$10,'mod2 6b'!F138:Q138)","v":0},{"$f":"LOOKUP($G$10,'mod2 6b'!$F$10:$Q$10,'mod2 6b'!F138:Q138)","v":0},{"$f":"'mod2 6b'!R138","v":0},{"$f":"'mod2 6b'!S138","v":0},{"$f":"'mod2 6b'!T138","v":0}]
[{"$f":"'mod2 6b'!A139","v":12},{"$f":"'mod2 6b'!B139","v":365},{"$f":"'mod2 6b'!C139","v":"Educação Infantil"},{"$f":"'mod2 6b'!D139","v":0},{"$f":"'mod2 6b'!E139","v":0},{"$f":"LOOKUP($F$10,'mod2 6b'!$F$10:$Q$10,'mod2 6b'!F139:Q139)","v":0},{"$f":"LOOKUP($G$10,'mod2 6b'!$F$10:$Q$10,'mod2 6b'!F139:Q139)","v":0},{"$f":"'mod2 6b'!R139","v":0},{"$f":"'mod2 6b'!S139","v":0},{"$f":"'mod2 6b'!T139","v":0}]
[{"$f":"'mod2 6b'!A140","v":12},{"$f":"'mod2 6b'!B140","v":366},{"$f":"'mod2 6b'!C140","v":"Educação de Jovens e Adultos"},{"$f":"'mod2 6b'!D140","v":0},{"$f":"'mod2 6b'!E140","v":0},{"$f":"LOOKUP($F$10,'mod2 6b'!$F$10:$Q$10,'mod2 6b'!F140:Q140)","v":0},{"$f":"LOOKUP($G$10,'mod2 6b'!$F$10:$Q$10,'mod2 6b'!F140:Q140)","v":0},{"$f":"'mod2 6b'!R140","v":0},{"$f":"'mod2 6b'!S140","v":0},{"$f":"'mod2 6b'!T140","v":0}]
[{"$f":"'mod2 6b'!A141","v":12},{"$f":"'mod2 6b'!B141","v":367},{"$f":"'mod2 6b'!C141","v":"Educação Especial"},{"$f":"'mod2 6b'!D141","v":0},{"$f":"'mod2 6b'!E141","v":0},{"$f":"LOOKUP($F$10,'mod2 6b'!$F$10:$Q$10,'mod2 6b'!F141:Q141)","v":0},{"$f":"LOOKUP($G$10,'mod2 6b'!$F$10:$Q$10,'mod2 6b'!F141:Q141)","v":0},{"$f":"'mod2 6b'!R141","v":0},{"$f":"'mod2 6b'!S141","v":0},{"$f":"'mod2 6b'!T141","v":0}]
[{"$f":"'mod2 6b'!A142","v":12},{"$f":"'mod2 6b'!B142","v":0},{"$f":"'mod2 6b'!C142","v":0},{"$f":"'mod2 6b'!D142","v":0},{"$f":"'mod2 6b'!E142","v":0},{"$f":"LOOKUP($F$10,'mod2 6b'!$F$10:$Q$10,'mod2 6b'!F142:Q142)","v":0},{"$f":"LOOKUP($G$10,'mod2 6b'!$F$10:$Q$10,'mod2 6b'!F142:Q142)","v":0},{"$f":"'mod2 6b'!R142","v":0},{"$f":"'mod2 6b'!S142","v":0},{"$f":"'mod2 6b'!T142","v":0}]
[{"$f":"'mod2 6b'!A143","v":12},{"$f":"'mod2 6b'!B143","v":0},{"$f":"'mod2 6b'!C143","v":0},{"$f":"'mod2 6b'!D143","v":0},{"$f":"'mod2 6b'!E143","v":0},{"$f":"LOOKUP($F$10,'mod2 6b'!$F$10:$Q$10,'mod2 6b'!F143:Q143)","v":0},{"$f":"LOOKUP($G$10,'mod2 6b'!$F$10:$Q$10,'mod2 6b'!F143:Q143)","v":0},{"$f":"'mod2 6b'!R143","v":0},{"$f":"'mod2 6b'!S143","v":0},{"$f":"'mod2 6b'!T143","v":0}]
[{"$f":"'mod2 6b'!A144","v":12},{"$f":"'mod2 6b'!B144","v":0},{"$f":"'mod2 6b'!C144","v":0},{"$f":"'mod2 6b'!D144","v":0},{"$f":"'mod2 6b'!E144","v":0},{"$f":"LOOKUP($F$10,'mod2 6b'!$F$10:$Q$10,'mod2 6b'!F144:Q144)","v":0},{"$f":"LOOKUP($G$10,'mod2 6b'!$F$10:$Q$10,'mod2 6b'!F144:Q144)","v":0},{"$f":"'mod2 6b'!R144","v":0},{"$f":"'mod2 6b'!S144","v":0},{"$f":"'mod2 6b'!T144","v":0}]
[{"$f":"'mod2 6b'!A145","v":12},{"$f":"'mod2 6b'!B145","v":0},{"$f":"'mod2 6b'!C145","v":0},{"$f":"'mod2 6b'!D145","v":0},{"$f":"'mod2 6b'!E145","v":0},{"$f":"LOOKUP($F$10,'mod2 6b'!$F$10:$Q$10,'mod2 6b'!F145:Q145)","v":0},{"$f":"LOOKUP($G$10,'mod2 6b'!$F$10:$Q$10,'mod2 6b'!F145:Q145)","v":0},{"$f":"'mod2 6b'!R145","v":0},{"$f":"'mod2 6b'!S145","v":0},{"$f":"'mod2 6b'!T145","v":0}]
[{"$f":"'mod2 6b'!A146","v":12},{"$f":"'mod2 6b'!B146","v":0},{"$f":"'mod2 6b'!C146","v":0},{"$f":"'mod2 6b'!D146","v":0},{"$f":"'mod2 6b'!E146","v":0},{"$f":"LOOKUP($F$10,'mod2 6b'!$F$10:$Q$10,'mod2 6b'!F146:Q146)","v":0},{"$f":"LOOKUP($G$10,'mod2 6b'!$F$10:$Q$10,'mod2 6b'!F146:Q146)","v":0},{"$f":"'mod2 6b'!R146","v":0},{"$f":"'mod2 6b'!S146","v":0},{"$f":"'mod2 6b'!T146","v":0}]
[{"$f":"'mod2 6b'!A147","v":12},{"$f":"'mod2 6b'!B147","v":0},{"$f":"'mod2 6b'!C147","v":0},{"$f":"'mod2 6b'!D147","v":0},{"$f":"'mod2 6b'!E147","v":0},{"$f":"LOOKUP($F$10,'mod2 6b'!$F$10:$Q$10,'mod2 6b'!F147:Q147)","v":0},{"$f":"LOOKUP($G$10,'mod2 6b'!$F$10:$Q$10,'mod2 6b'!F147:Q147)","v":0},{"$f":"'mod2 6b'!R147","v":0},{"$f":"'mod2 6b'!S147","v":0},{"$f":"'mod2 6b'!T147","v":0}]
[{"$f":"'mod2 6b'!A148","v":12},{"$f":"'mod2 6b'!B148","v":0},{"$f":"'mod2 6b'!C148","v":0},{"$f":"'mod2 6b'!D148","v":0},{"$f":"'mod2 6b'!E148","v":0},{"$f":"LOOKUP($F$10,'mod2 6b'!$F$10:$Q$10,'mod2 6b'!F148:Q148)","v":0},{"$f":"LOOKUP($G$10,'mod2 6b'!$F$10:$Q$10,'mod2 6b'!F148:Q148)","v":0},{"$f":"'mod2 6b'!R148","v":0},{"$f":"'mod2 6b'!S148","v":0},{"$f":"'mod2 6b'!T148","v":0}]
[{"$f":"'mod2 6b'!A149","v":12},{"$f":"'mod2 6b'!B149","v":0},{"$f":"'mod2 6b'!C149","v":0},{"$f":"'mod2 6b'!D149","v":0},{"$f":"'mod2 6b'!E149","v":0},{"$f":"LOOKUP($F$10,'mod2 6b'!$F$10:$Q$10,'mod2 6b'!F149:Q149)","v":0},{"$f":"LOOKUP($G$10,'mod2 6b'!$F$10:$Q$10,'mod2 6b'!F149:Q149)","v":0},{"$f":"'mod2 6b'!R149","v":0},{"$f":"'mod2 6b'!S149","v":0},{"$f":"'mod2 6b'!T149","v":0}]
[{"$f":"'mod2 6b'!A150","v":12},{"$f":"'mod2 6b'!B150","v":0},{"$f":"'mod2 6b'!C150","v":0},{"$f":"'mod2 6b'!D150","v":0},{"$f":"'mod2 6b'!E150","v":0},{"$f":"LOOKUP($F$10,'mod2 6b'!$F$10:$Q$10,'mod2 6b'!F150:Q150)","v":0},{"$f":"LOOKUP($G$10,'mod2 6b'!$F$10:$Q$10,'mod2 6b'!F150:Q150)","v":0},{"$f":"'mod2 6b'!R150","v":0},{"$f":"'mod2 6b'!S150","v":0},{"$f":"'mod2 6b'!T150","v":0}]
[{"$f":"'mod2 6b'!A151","v":12},{"$f":"'mod2 6b'!B151","v":0},{"$f":"'mod2 6b'!C151","v":0},{"$f":"'mod2 6b'!D151","v":0},{"$f":"'mod2 6b'!E151","v":0},{"$f":"LOOKUP($F$10,'mod2 6b'!$F$10:$Q$10,'mod2 6b'!F151:Q151)","v":0},{"$f":"LOOKUP($G$10,'mod2 6b'!$F$10:$Q$10,'mod2 6b'!F151:Q151)","v":0},{"$f":"'mod2 6b'!R151","v":0},{"$f":"'mod2 6b'!S151","v":0},{"$f":"'mod2 6b'!T151","v":0}]
[{"$f":"'mod2 6b'!A152","v":12},{"$f":"'mod2 6b'!B152","v":0},{"$f":"'mod2 6b'!C152","v":0},{"$f":"'mod2 6b'!D152","v":0},{"$f":"'mod2 6b'!E152","v":0},{"$f":"LOOKUP($F$10,'mod2 6b'!$F$10:$Q$10,'mod2 6b'!F152:Q152)","v":0},{"$f":"LOOKUP($G$10,'mod2 6b'!$F$10:$Q$10,'mod2 6b'!F152:Q152)","v":0},{"$f":"'mod2 6b'!R152","v":0},{"$f":"'mod2 6b'!S152","v":0},{"$f":"'mod2 6b'!T152","v":0}]
[{"$f":"'mod2 6b'!A153","v":13},{"$f":"'mod2 6b'!B153","v":0},{"$f":"'mod2 6b'!C153","v":"CULTURA"},{"$f":"'mod2 6b'!D153","v":0},{"$f":"'mod2 6b'!E153","v":0},{"$f":"LOOKUP($F$10,'mod2 6b'!$F$10:$Q$10,'mod2 6b'!F153:Q153)","v":0},{"$f":"LOOKUP($G$10,'mod2 6b'!$F$10:$Q$10,'mod2 6b'!F153:Q153)","v":0},{"$f":"'mod2 6b'!R153","v":0},{"$f":"'mod2 6b'!S153","v":0},{"$f":"'mod2 6b'!T153","v":0}]
[{"$f":"'mod2 6b'!A154","v":13},{"$f":"'mod2 6b'!B154","v":391},{"$f":"'mod2 6b'!C154","v":"Patr. Histórico, Artístico e Arqueológico"},{"$f":"'mod2 6b'!D154","v":0},{"$f":"'mod2 6b'!E154","v":0},{"$f":"LOOKUP($F$10,'mod2 6b'!$F$10:$Q$10,'mod2 6b'!F154:Q154)","v":0},{"$f":"LOOKUP($G$10,'mod2 6b'!$F$10:$Q$10,'mod2 6b'!F154:Q154)","v":0},{"$f":"'mod2 6b'!R154","v":0},{"$f":"'mod2 6b'!S154","v":0},{"$f":"'mod2 6b'!T154","v":0}]
[{"$f":"'mod2 6b'!A155","v":13},{"$f":"'mod2 6b'!B155","v":392},{"$f":"'mod2 6b'!C155","v":"Difusão Cultural"},{"$f":"'mod2 6b'!D155","v":0},{"$f":"'mod2 6b'!E155","v":0},{"$f":"LOOKUP($F$10,'mod2 6b'!$F$10:$Q$10,'mod2 6b'!F155:Q155)","v":0},{"$f":"LOOKUP($G$10,'mod2 6b'!$F$10:$Q$10,'mod2 6b'!F155:Q155)","v":0},{"$f":"'mod2 6b'!R155","v":0},{"$f":"'mod2 6b'!S155","v":0},{"$f":"'mod2 6b'!T155","v":0}]
[{"$f":"'mod2 6b'!A156","v":13},{"$f":"'mod2 6b'!B156","v":0},{"$f":"'mod2 6b'!C156","v":0},{"$f":"'mod2 6b'!D156","v":0},{"$f":"'mod2 6b'!E156","v":0},{"$f":"LOOKUP($F$10,'mod2 6b'!$F$10:$Q$10,'mod2 6b'!F156:Q156)","v":0},{"$f":"LOOKUP($G$10,'mod2 6b'!$F$10:$Q$10,'mod2 6b'!F156:Q156)","v":0},{"$f":"'mod2 6b'!R156","v":0},{"$f":"'mod2 6b'!S156","v":0},{"$f":"'mod2 6b'!T156","v":0}]
[{"$f":"'mod2 6b'!A157","v":13},{"$f":"'mod2 6b'!B157","v":0},{"$f":"'mod2 6b'!C157","v":0},{"$f":"'mod2 6b'!D157","v":0},{"$f":"'mod2 6b'!E157","v":0},{"$f":"LOOKUP($F$10,'mod2 6b'!$F$10:$Q$10,'mod2 6b'!F157:Q157)","v":0},{"$f":"LOOKUP($G$10,'mod2 6b'!$F$10:$Q$10,'mod2 6b'!F157:Q157)","v":0},{"$f":"'mod2 6b'!R157","v":0},{"$f":"'mod2 6b'!S157","v":0},{"$f":"'mod2 6b'!T157","v":0}]
[{"$f":"'mod2 6b'!A158","v":13},{"$f":"'mod2 6b'!B158","v":0},{"$f":"'mod2 6b'!C158","v":0},{"$f":"'mod2 6b'!D158","v":0},{"$f":"'mod2 6b'!E158","v":0},{"$f":"LOOKUP($F$10,'mod2 6b'!$F$10:$Q$10,'mod2 6b'!F158:Q158)","v":0},{"$f":"LOOKUP($G$10,'mod2 6b'!$F$10:$Q$10,'mod2 6b'!F158:Q158)","v":0},{"$f":"'mod2 6b'!R158","v":0},{"$f":"'mod2 6b'!S158","v":0},{"$f":"'mod2 6b'!T158","v":0}]
[{"$f":"'mod2 6b'!A159","v":13},{"$f":"'mod2 6b'!B159","v":0},{"$f":"'mod2 6b'!C159","v":0},{"$f":"'mod2 6b'!D159","v":0},{"$f":"'mod2 6b'!E159","v":0},{"$f":"LOOKUP($F$10,'mod2 6b'!$F$10:$Q$10,'mod2 6b'!F159:Q159)","v":0},{"$f":"LOOKUP($G$10,'mod2 6b'!$F$10:$Q$10,'mod2 6b'!F159:Q159)","v":0},{"$f":"'mod2 6b'!R159","v":0},{"$f":"'mod2 6b'!S159","v":0},{"$f":"'mod2 6b'!T159","v":0}]
[{"$f":"'mod2 6b'!A160","v":13},{"$f":"'mod2 6b'!B160","v":0},{"$f":"'mod2 6b'!C160","v":0},{"$f":"'mod2 6b'!D160","v":0},{"$f":"'mod2 6b'!E160","v":0},{"$f":"LOOKUP($F$10,'mod2 6b'!$F$10:$Q$10,'mod2 6b'!F160:Q160)","v":0},{"$f":"LOOKUP($G$10,'mod2 6b'!$F$10:$Q$10,'mod2 6b'!F160:Q160)","v":0},{"$f":"'mod2 6b'!R160","v":0},{"$f":"'mod2 6b'!S160","v":0},{"$f":"'mod2 6b'!T160","v":0}]
[{"$f":"'mod2 6b'!A161","v":13},{"$f":"'mod2 6b'!B161","v":0},{"$f":"'mod2 6b'!C161","v":0},{"$f":"'mod2 6b'!D161","v":0},{"$f":"'mod2 6b'!E161","v":0},{"$f":"LOOKUP($F$10,'mod2 6b'!$F$10:$Q$10,'mod2 6b'!F161:Q161)","v":0},{"$f":"LOOKUP($G$10,'mod2 6b'!$F$10:$Q$10,'mod2 6b'!F161:Q161)","v":0},{"$f":"'mod2 6b'!R161","v":0},{"$f":"'mod2 6b'!S161","v":0},{"$f":"'mod2 6b'!T161","v":0}]
[{"$f":"'mod2 6b'!A162","v":13},{"$f":"'mod2 6b'!B162","v":0},{"$f":"'mod2 6b'!C162","v":0},{"$f":"'mod2 6b'!D162","v":0},{"$f":"'mod2 6b'!E162","v":0},{"$f":"LOOKUP($F$10,'mod2 6b'!$F$10:$Q$10,'mod2 6b'!F162:Q162)","v":0},{"$f":"LOOKUP($G$10,'mod2 6b'!$F$10:$Q$10,'mod2 6b'!F162:Q162)","v":0},{"$f":"'mod2 6b'!R162","v":0},{"$f":"'mod2 6b'!S162","v":0},{"$f":"'mod2 6b'!T162","v":0}]
[{"$f":"'mod2 6b'!A163","v":13},{"$f":"'mod2 6b'!B163","v":0},{"$f":"'mod2 6b'!C163","v":0},{"$f":"'mod2 6b'!D163","v":0},{"$f":"'mod2 6b'!E163","v":0},{"$f":"LOOKUP($F$10,'mod2 6b'!$F$10:$Q$10,'mod2 6b'!F163:Q163)","v":0},{"$f":"LOOKUP($G$10,'mod2 6b'!$F$10:$Q$10,'mod2 6b'!F163:Q163)","v":0},{"$f":"'mod2 6b'!R163","v":0},{"$f":"'mod2 6b'!S163","v":0},{"$f":"'mod2 6b'!T163","v":0}]
[{"$f":"'mod2 6b'!A164","v":13},{"$f":"'mod2 6b'!B164","v":0},{"$f":"'mod2 6b'!C164","v":0},{"$f":"'mod2 6b'!D164","v":0},{"$f":"'mod2 6b'!E164","v":0},{"$f":"LOOKUP($F$10,'mod2 6b'!$F$10:$Q$10,'mod2 6b'!F164:Q164)","v":0},{"$f":"LOOKUP($G$10,'mod2 6b'!$F$10:$Q$10,'mod2 6b'!F164:Q164)","v":0},{"$f":"'mod2 6b'!R164","v":0},{"$f":"'mod2 6b'!S164","v":0},{"$f":"'mod2 6b'!T164","v":0}]
[{"$f":"'mod2 6b'!A165","v":13},{"$f":"'mod2 6b'!B165","v":0},{"$f":"'mod2 6b'!C165","v":0},{"$f":"'mod2 6b'!D165","v":0},{"$f":"'mod2 6b'!E165","v":0},{"$f":"LOOKUP($F$10,'mod2 6b'!$F$10:$Q$10,'mod2 6b'!F165:Q165)","v":0},{"$f":"LOOKUP($G$10,'mod2 6b'!$F$10:$Q$10,'mod2 6b'!F165:Q165)","v":0},{"$f":"'mod2 6b'!R165","v":0},{"$f":"'mod2 6b'!S165","v":0},{"$f":"'mod2 6b'!T165","v":0}]
[{"$f":"'mod2 6b'!A166","v":13},{"$f":"'mod2 6b'!B166","v":0},{"$f":"'mod2 6b'!C166","v":0},{"$f":"'mod2 6b'!D166","v":0},{"$f":"'mod2 6b'!E166","v":0},{"$f":"LOOKUP($F$10,'mod2 6b'!$F$10:$Q$10,'mod2 6b'!F166:Q166)","v":0},{"$f":"LOOKUP($G$10,'mod2 6b'!$F$10:$Q$10,'mod2 6b'!F166:Q166)","v":0},{"$f":"'mod2 6b'!R166","v":0},{"$f":"'mod2 6b'!S166","v":0},{"$f":"'mod2 6b'!T166","v":0}]
[{"$f":"'mod2 6b'!A167","v":14},{"$f":"'mod2 6b'!B167","v":0},{"$f":"'mod2 6b'!C167","v":"DIRETORIA DA CIDADANIA"},{"$f":"'mod2 6b'!D167","v":0},{"$f":"'mod2 6b'!E167","v":0},{"$f":"LOOKUP($F$10,'mod2 6b'!$F$10:$Q$10,'mod2 6b'!F167:Q167)","v":0},{"$f":"LOOKUP($G$10,'mod2 6b'!$F$10:$Q$10,'mod2 6b'!F167:Q167)","v":0},{"$f":"'mod2 6b'!R167","v":0},{"$f":"'mod2 6b'!S167","v":0},{"$f":"'mod2 6b'!T167","v":0}]
[{"$f":"'mod2 6b'!A168","v":14},{"$f":"'mod2 6b'!B168","v":421},{"$f":"'mod2 6b'!C168","v":"Custódia e Reintegração Social"},{"$f":"'mod2 6b'!D168","v":0},{"$f":"'mod2 6b'!E168","v":0},{"$f":"LOOKUP($F$10,'mod2 6b'!$F$10:$Q$10,'mod2 6b'!F168:Q168)","v":0},{"$f":"LOOKUP($G$10,'mod2 6b'!$F$10:$Q$10,'mod2 6b'!F168:Q168)","v":0},{"$f":"'mod2 6b'!R168","v":0},{"$f":"'mod2 6b'!S168","v":0},{"$f":"'mod2 6b'!T168","v":0}]
[{"$f":"'mod2 6b'!A169","v":14},{"$f":"'mod2 6b'!B169","v":422},{"$f":"'mod2 6b'!C169","v":"Direitos Individuais, Coletivos e Difusos"},{"$f":"'mod2 6b'!D169","v":0},{"$f":"'mod2 6b'!E169","v":0},{"$f":"LOOKUP($F$10,'mod2 6b'!$F$10:$Q$10,'mod2 6b'!F169:Q169)","v":0},{"$f":"LOOKUP($G$10,'mod2 6b'!$F$10:$Q$10,'mod2 6b'!F169:Q169)","v":0},{"$f":"'mod2 6b'!R169","v":0},{"$f":"'mod2 6b'!S169","v":0},{"$f":"'mod2 6b'!T169","v":0}]
[{"$f":"'mod2 6b'!A170","v":14},{"$f":"'mod2 6b'!B170","v":423},{"$f":"'mod2 6b'!C170","v":"Assistência aos Povos Indígenas"},{"$f":"'mod2 6b'!D170","v":0},{"$f":"'mod2 6b'!E170","v":0},{"$f":"LOOKUP($F$10,'mod2 6b'!$F$10:$Q$10,'mod2 6b'!F170:Q170)","v":0},{"$f":"LOOKUP($G$10,'mod2 6b'!$F$10:$Q$10,'mod2 6b'!F170:Q170)","v":0},{"$f":"'mod2 6b'!R170","v":0},{"$f":"'mod2 6b'!S170","v":0},{"$f":"'mod2 6b'!T170","v":0}]
[{"$f":"'mod2 6b'!A171","v":14},{"$f":"'mod2 6b'!B171","v":0},{"$f":"'mod2 6b'!C171","v":0},{"$f":"'mod2 6b'!D171","v":0},{"$f":"'mod2 6b'!E171","v":0},{"$f":"LOOKUP($F$10,'mod2 6b'!$F$10:$Q$10,'mod2 6b'!F171:Q171)","v":0},{"$f":"LOOKUP($G$10,'mod2 6b'!$F$10:$Q$10,'mod2 6b'!F171:Q171)","v":0},{"$f":"'mod2 6b'!R171","v":0},{"$f":"'mod2 6b'!S171","v":0},{"$f":"'mod2 6b'!T171","v":0}]
[{"$f":"'mod2 6b'!A172","v":14},{"$f":"'mod2 6b'!B172","v":0},{"$f":"'mod2 6b'!C172","v":0},{"$f":"'mod2 6b'!D172","v":0},{"$f":"'mod2 6b'!E172","v":0},{"$f":"LOOKUP($F$10,'mod2 6b'!$F$10:$Q$10,'mod2 6b'!F172:Q172)","v":0},{"$f":"LOOKUP($G$10,'mod2 6b'!$F$10:$Q$10,'mod2 6b'!F172:Q172)","v":0},{"$f":"'mod2 6b'!R172","v":0},{"$f":"'mod2 6b'!S172","v":0},{"$f":"'mod2 6b'!T172","v":0}]
[{"$f":"'mod2 6b'!A173","v":14},{"$f":"'mod2 6b'!B173","v":0},{"$f":"'mod2 6b'!C173","v":0},{"$f":"'mod2 6b'!D173","v":0},{"$f":"'mod2 6b'!E173","v":0},{"$f":"LOOKUP($F$10,'mod2 6b'!$F$10:$Q$10,'mod2 6b'!F173:Q173)","v":0},{"$f":"LOOKUP($G$10,'mod2 6b'!$F$10:$Q$10,'mod2 6b'!F173:Q173)","v":0},{"$f":"'mod2 6b'!R173","v":0},{"$f":"'mod2 6b'!S173","v":0},{"$f":"'mod2 6b'!T173","v":0}]
[{"$f":"'mod2 6b'!A174","v":14},{"$f":"'mod2 6b'!B174","v":0},{"$f":"'mod2 6b'!C174","v":0},{"$f":"'mod2 6b'!D174","v":0},{"$f":"'mod2 6b'!E174","v":0},{"$f":"LOOKUP($F$10,'mod2 6b'!$F$10:$Q$10,'mod2 6b'!F174:Q174)","v":0},{"$f":"LOOKUP($G$10,'mod2 6b'!$F$10:$Q$10,'mod2 6b'!F174:Q174)","v":0},{"$f":"'mod2 6b'!R174","v":0},{"$f":"'mod2 6b'!S174","v":0},{"$f":"'mod2 6b'!T174","v":0}]
[{"$f":"'mod2 6b'!A175","v":14},{"$f":"'mod2 6b'!B175","v":0},{"$f":"'mod2 6b'!C175","v":0},{"$f":"'mod2 6b'!D175","v":0},{"$f":"'mod2 6b'!E175","v":0},{"$f":"LOOKUP($F$10,'mod2 6b'!$F$10:$Q$10,'mod2 6b'!F175:Q175)","v":0},{"$f":"LOOKUP($G$10,'mod2 6b'!$F$10:$Q$10,'mod2 6b'!F175:Q175)","v":0},{"$f":"'mod2 6b'!R175","v":0},{"$f":"'mod2 6b'!S175","v":0},{"$f":"'mod2 6b'!T175","v":0}]
[{"$f":"'mod2 6b'!A176","v":15},{"$f":"'mod2 6b'!B176","v":0},{"$f":"'mod2 6b'!C176","v":"URBANISMO"},{"$f":"'mod2 6b'!D176","v":0},{"$f":"'mod2 6b'!E176","v":0},{"$f":"LOOKUP($F$10,'mod2 6b'!$F$10:$Q$10,'mod2 6b'!F176:Q176)","v":0},{"$f":"LOOKUP($G$10,'mod2 6b'!$F$10:$Q$10,'mod2 6b'!F176:Q176)","v":0},{"$f":"'mod2 6b'!R176","v":0},{"$f":"'mod2 6b'!S176","v":0},{"$f":"'mod2 6b'!T176","v":0}]
[{"$f":"'mod2 6b'!A177","v":15},{"$f":"'mod2 6b'!B177","v":451},{"$f":"'mod2 6b'!C177","v":"Infra-Estrutura Urbana"},{"$f":"'mod2 6b'!D177","v":0},{"$f":"'mod2 6b'!E177","v":0},{"$f":"LOOKUP($F$10,'mod2 6b'!$F$10:$Q$10,'mod2 6b'!F177:Q177)","v":0},{"$f":"LOOKUP($G$10,'mod2 6b'!$F$10:$Q$10,'mod2 6b'!F177:Q177)","v":0},{"$f":"'mod2 6b'!R177","v":0},{"$f":"'mod2 6b'!S177","v":0},{"$f":"'mod2 6b'!T177","v":0}]
[{"$f":"'mod2 6b'!A178","v":15},{"$f":"'mod2 6b'!B178","v":452},{"$f":"'mod2 6b'!C178","v":"Serviços Urbanos"},{"$f":"'mod2 6b'!D178","v":0},{"$f":"'mod2 6b'!E178","v":0},{"$f":"LOOKUP($F$10,'mod2 6b'!$F$10:$Q$10,'mod2 6b'!F178:Q178)","v":0},{"$f":"LOOKUP($G$10,'mod2 6b'!$F$10:$Q$10,'mod2 6b'!F178:Q178)","v":0},{"$f":"'mod2 6b'!R178","v":0},{"$f":"'mod2 6b'!S178","v":0},{"$f":"'mod2 6b'!T178","v":0}]
[{"$f":"'mod2 6b'!A179","v":15},{"$f":"'mod2 6b'!B179","v":453},{"$f":"'mod2 6b'!C179","v":"Transportes Coletivos Urbanos"},{"$f":"'mod2 6b'!D179","v":0},{"$f":"'mod2 6b'!E179","v":0},{"$f":"LOOKUP($F$10,'mod2 6b'!$F$10:$Q$10,'mod2 6b'!F179:Q179)","v":0},{"$f":"LOOKUP($G$10,'mod2 6b'!$F$10:$Q$10,'mod2 6b'!F179:Q179)","v":0},{"$f":"'mod2 6b'!R179","v":0},{"$f":"'mod2 6b'!S179","v":0},{"$f":"'mod2 6b'!T179","v":0}]
[{"$f":"'mod2 6b'!A180","v":15},{"$f":"'mod2 6b'!B180","v":0},{"$f":"'mod2 6b'!C180","v":0},{"$f":"'mod2 6b'!D180","v":0},{"$f":"'mod2 6b'!E180","v":0},{"$f":"LOOKUP($F$10,'mod2 6b'!$F$10:$Q$10,'mod2 6b'!F180:Q180)","v":0},{"$f":"LOOKUP($G$10,'mod2 6b'!$F$10:$Q$10,'mod2 6b'!F180:Q180)","v":0},{"$f":"'mod2 6b'!R180","v":0},{"$f":"'mod2 6b'!S180","v":0},{"$f":"'mod2 6b'!T180","v":0}]
[{"$f":"'mod2 6b'!A181","v":15},{"$f":"'mod2 6b'!B181","v":0},{"$f":"'mod2 6b'!C181","v":0},{"$f":"'mod2 6b'!D181","v":0},{"$f":"'mod2 6b'!E181","v":0},{"$f":"LOOKUP($F$10,'mod2 6b'!$F$10:$Q$10,'mod2 6b'!F181:Q181)","v":0},{"$f":"LOOKUP($G$10,'mod2 6b'!$F$10:$Q$10,'mod2 6b'!F181:Q181)","v":0},{"$f":"'mod2 6b'!R181","v":0},{"$f":"'mod2 6b'!S181","v":0},{"$f":"'mod2 6b'!T181","v":0}]
[{"$f":"'mod2 6b'!A182","v":15},{"$f":"'mod2 6b'!B182","v":0},{"$f":"'mod2 6b'!C182","v":0},{"$f":"'mod2 6b'!D182","v":0},{"$f":"'mod2 6b'!E182","v":0},{"$f":"LOOKUP($F$10,'mod2 6b'!$F$10:$Q$10,'mod2 6b'!F182:Q182)","v":0},{"$f":"LOOKUP($G$10,'mod2 6b'!$F$10:$Q$10,'mod2 6b'!F182:Q182)","v":0},{"$f":"'mod2 6b'!R182","v":0},{"$f":"'mod2 6b'!S182","v":0},{"$f":"'mod2 6b'!T182","v":0}]
[{"$f":"'mod2 6b'!A183","v":15},{"$f":"'mod2 6b'!B183","v":0},{"$f":"'mod2 6b'!C183","v":0},{"$f":"'mod2 6b'!D183","v":0},{"$f":"'mod2 6b'!E183","v":0},{"$f":"LOOKUP($F$10,'mod2 6b'!$F$10:$Q$10,'mod2 6b'!F183:Q183)","v":0},{"$f":"LOOKUP($G$10,'mod2 6b'!$F$10:$Q$10,'mod2 6b'!F183:Q183)","v":0},{"$f":"'mod2 6b'!R183","v":0},{"$f":"'mod2 6b'!S183","v":0},{"$f":"'mod2 6b'!T183","v":0}]
[{"$f":"'mod2 6b'!A184","v":15},{"$f":"'mod2 6b'!B184","v":0},{"$f":"'mod2 6b'!C184","v":0},{"$f":"'mod2 6b'!D184","v":0},{"$f":"'mod2 6b'!E184","v":0},{"$f":"LOOKUP($F$10,'mod2 6b'!$F$10:$Q$10,'mod2 6b'!F184:Q184)","v":0},{"$f":"LOOKUP($G$10,'mod2 6b'!$F$10:$Q$10,'mod2 6b'!F184:Q184)","v":0},{"$f":"'mod2 6b'!R184","v":0},{"$f":"'mod2 6b'!S184","v":0},{"$f":"'mod2 6b'!T184","v":0}]
[{"$f":"'mod2 6b'!A185","v":15},{"$f":"'mod2 6b'!B185","v":0},{"$f":"'mod2 6b'!C185","v":0},{"$f":"'mod2 6b'!D185","v":0},{"$f":"'mod2 6b'!E185","v":0},{"$f":"LOOKUP($F$10,'mod2 6b'!$F$10:$Q$10,'mod2 6b'!F185:Q185)","v":0},{"$f":"LOOKUP($G$10,'mod2 6b'!$F$10:$Q$10,'mod2 6b'!F185:Q185)","v":0},{"$f":"'mod2 6b'!R185","v":0},{"$f":"'mod2 6b'!S185","v":0},{"$f":"'mod2 6b'!T185","v":0}]
[{"$f":"'mod2 6b'!A186","v":16},{"$f":"'mod2 6b'!B186","v":0},{"$f":"'mod2 6b'!C186","v":"HABITAÇÃO"},{"$f":"'mod2 6b'!D186","v":0},{"$f":"'mod2 6b'!E186","v":0},{"$f":"LOOKUP($F$10,'mod2 6b'!$F$10:$Q$10,'mod2 6b'!F186:Q186)","v":0},{"$f":"LOOKUP($G$10,'mod2 6b'!$F$10:$Q$10,'mod2 6b'!F186:Q186)","v":0},{"$f":"'mod2 6b'!R186","v":0},{"$f":"'mod2 6b'!S186","v":0},{"$f":"'mod2 6b'!T186","v":0}]
[{"$f":"'mod2 6b'!A187","v":16},{"$f":"'mod2 6b'!B187","v":481},{"$f":"'mod2 6b'!C187","v":"Habitação Rural"},{"$f":"'mod2 6b'!D187","v":0},{"$f":"'mod2 6b'!E187","v":0},{"$f":"LOOKUP($F$10,'mod2 6b'!$F$10:$Q$10,'mod2 6b'!F187:Q187)","v":0},{"$f":"LOOKUP($G$10,'mod2 6b'!$F$10:$Q$10,'mod2 6b'!F187:Q187)","v":0},{"$f":"'mod2 6b'!R187","v":0},{"$f":"'mod2 6b'!S187","v":0},{"$f":"'mod2 6b'!T187","v":0}]
[{"$f":"'mod2 6b'!A188","v":16},{"$f":"'mod2 6b'!B188","v":482},{"$f":"'mod2 6b'!C188","v":"Habitação Urbana"},{"$f":"'mod2 6b'!D188","v":0},{"$f":"'mod2 6b'!E188","v":0},{"$f":"LOOKUP($F$10,'mod2 6b'!$F$10:$Q$10,'mod2 6b'!F188:Q188)","v":0},{"$f":"LOOKUP($G$10,'mod2 6b'!$F$10:$Q$10,'mod2 6b'!F188:Q188)","v":0},{"$f":"'mod2 6b'!R188","v":0},{"$f":"'mod2 6b'!S188","v":0},{"$f":"'mod2 6b'!T188","v":0}]
[{"$f":"'mod2 6b'!A189","v":16},{"$f":"'mod2 6b'!B189","v":0},{"$f":"'mod2 6b'!C189","v":0},{"$f":"'mod2 6b'!D189","v":0},{"$f":"'mod2 6b'!E189","v":0},{"$f":"LOOKUP($F$10,'mod2 6b'!$F$10:$Q$10,'mod2 6b'!F189:Q189)","v":0},{"$f":"LOOKUP($G$10,'mod2 6b'!$F$10:$Q$10,'mod2 6b'!F189:Q189)","v":0},{"$f":"'mod2 6b'!R189","v":0},{"$f":"'mod2 6b'!S189","v":0},{"$f":"'mod2 6b'!T189","v":0}]
[{"$f":"'mod2 6b'!A190","v":16},{"$f":"'mod2 6b'!B190","v":0},{"$f":"'mod2 6b'!C190","v":0},{"$f":"'mod2 6b'!D190","v":0},{"$f":"'mod2 6b'!E190","v":0},{"$f":"LOOKUP($F$10,'mod2 6b'!$F$10:$Q$10,'mod2 6b'!F190:Q190)","v":0},{"$f":"LOOKUP($G$10,'mod2 6b'!$F$10:$Q$10,'mod2 6b'!F190:Q190)","v":0},{"$f":"'mod2 6b'!R190","v":0},{"$f":"'mod2 6b'!S190","v":0},{"$f":"'mod2 6b'!T190","v":0}]
[{"$f":"'mod2 6b'!A191","v":16},{"$f":"'mod2 6b'!B191","v":0},{"$f":"'mod2 6b'!C191","v":0},{"$f":"'mod2 6b'!D191","v":0},{"$f":"'mod2 6b'!E191","v":0},{"$f":"LOOKUP($F$10,'mod2 6b'!$F$10:$Q$10,'mod2 6b'!F191:Q191)","v":0},{"$f":"LOOKUP($G$10,'mod2 6b'!$F$10:$Q$10,'mod2 6b'!F191:Q191)","v":0},{"$f":"'mod2 6b'!R191","v":0},{"$f":"'mod2 6b'!S191","v":0},{"$f":"'mod2 6b'!T191","v":0}]
[{"$f":"'mod2 6b'!A192","v":16},{"$f":"'mod2 6b'!B192","v":0},{"$f":"'mod2 6b'!C192","v":0},{"$f":"'mod2 6b'!D192","v":0},{"$f":"'mod2 6b'!E192","v":0},{"$f":"LOOKUP($F$10,'mod2 6b'!$F$10:$Q$10,'mod2 6b'!F192:Q192)","v":0},{"$f":"LOOKUP($G$10,'mod2 6b'!$F$10:$Q$10,'mod2 6b'!F192:Q192)","v":0},{"$f":"'mod2 6b'!R192","v":0},{"$f":"'mod2 6b'!S192","v":0},{"$f":"'mod2 6b'!T192","v":0}]
[{"$f":"'mod2 6b'!A193","v":16},{"$f":"'mod2 6b'!B193","v":0},{"$f":"'mod2 6b'!C193","v":0},{"$f":"'mod2 6b'!D193","v":0},{"$f":"'mod2 6b'!E193","v":0},{"$f":"LOOKUP($F$10,'mod2 6b'!$F$10:$Q$10,'mod2 6b'!F193:Q193)","v":0},{"$f":"LOOKUP($G$10,'mod2 6b'!$F$10:$Q$10,'mod2 6b'!F193:Q193)","v":0},{"$f":"'mod2 6b'!R193","v":0},{"$f":"'mod2 6b'!S193","v":0},{"$f":"'mod2 6b'!T193","v":0}]
[{"$f":"'mod2 6b'!A194","v":17},{"$f":"'mod2 6b'!B194","v":0},{"$f":"'mod2 6b'!C194","v":"SANEAMENTO"},{"$f":"'mod2 6b'!D194","v":0},{"$f":"'mod2 6b'!E194","v":0},{"$f":"LOOKUP($F$10,'mod2 6b'!$F$10:$Q$10,'mod2 6b'!F194:Q194)","v":0},{"$f":"LOOKUP($G$10,'mod2 6b'!$F$10:$Q$10,'mod2 6b'!F194:Q194)","v":0},{"$f":"'mod2 6b'!R194","v":0},{"$f":"'mod2 6b'!S194","v":0},{"$f":"'mod2 6b'!T194","v":0}]
[{"$f":"'mod2 6b'!A195","v":17},{"$f":"'mod2 6b'!B195","v":511},{"$f":"'mod2 6b'!C195","v":"Saneamento Básico Rural"},{"$f":"'mod2 6b'!D195","v":0},{"$f":"'mod2 6b'!E195","v":0},{"$f":"LOOKUP($F$10,'mod2 6b'!$F$10:$Q$10,'mod2 6b'!F195:Q195)","v":0},{"$f":"LOOKUP($G$10,'mod2 6b'!$F$10:$Q$10,'mod2 6b'!F195:Q195)","v":0},{"$f":"'mod2 6b'!R195","v":0},{"$f":"'mod2 6b'!S195","v":0},{"$f":"'mod2 6b'!T195","v":0}]
[{"$f":"'mod2 6b'!A196","v":17},{"$f":"'mod2 6b'!B196","v":512},{"$f":"'mod2 6b'!C196","v":"Saneamento Básico Urbano"},{"$f":"'mod2 6b'!D196","v":0},{"$f":"'mod2 6b'!E196","v":0},{"$f":"LOOKUP($F$10,'mod2 6b'!$F$10:$Q$10,'mod2 6b'!F196:Q196)","v":0},{"$f":"LOOKUP($G$10,'mod2 6b'!$F$10:$Q$10,'mod2 6b'!F196:Q196)","v":0},{"$f":"'mod2 6b'!R196","v":0},{"$f":"'mod2 6b'!S196","v":0},{"$f":"'mod2 6b'!T196","v":0}]
[{"$f":"'mod2 6b'!A197","v":17},{"$f":"'mod2 6b'!B197","v":0},{"$f":"'mod2 6b'!C197","v":0},{"$f":"'mod2 6b'!D197","v":0},{"$f":"'mod2 6b'!E197","v":0},{"$f":"LOOKUP($F$10,'mod2 6b'!$F$10:$Q$10,'mod2 6b'!F197:Q197)","v":0},{"$f":"LOOKUP($G$10,'mod2 6b'!$F$10:$Q$10,'mod2 6b'!F197:Q197)","v":0},{"$f":"'mod2 6b'!R197","v":0},{"$f":"'mod2 6b'!S197","v":0},{"$f":"'mod2 6b'!T197","v":0}]
[{"$f":"'mod2 6b'!A198","v":17},{"$f":"'mod2 6b'!B198","v":0},{"$f":"'mod2 6b'!C198","v":0},{"$f":"'mod2 6b'!D198","v":0},{"$f":"'mod2 6b'!E198","v":0},{"$f":"LOOKUP($F$10,'mod2 6b'!$F$10:$Q$10,'mod2 6b'!F198:Q198)","v":0},{"$f":"LOOKUP($G$10,'mod2 6b'!$F$10:$Q$10,'mod2 6b'!F198:Q198)","v":0},{"$f":"'mod2 6b'!R198","v":0},{"$f":"'mod2 6b'!S198","v":0},{"$f":"'mod2 6b'!T198","v":0}]
[{"$f":"'mod2 6b'!A199","v":17},{"$f":"'mod2 6b'!B199","v":0},{"$f":"'mod2 6b'!C199","v":0},{"$f":"'mod2 6b'!D199","v":0},{"$f":"'mod2 6b'!E199","v":0},{"$f":"LOOKUP($F$10,'mod2 6b'!$F$10:$Q$10,'mod2 6b'!F199:Q199)","v":0},{"$f":"LOOKUP($G$10,'mod2 6b'!$F$10:$Q$10,'mod2 6b'!F199:Q199)","v":0},{"$f":"'mod2 6b'!R199","v":0},{"$f":"'mod2 6b'!S199","v":0},{"$f":"'mod2 6b'!T199","v":0}]
[{"$f":"'mod2 6b'!A200","v":17},{"$f":"'mod2 6b'!B200","v":0},{"$f":"'mod2 6b'!C200","v":0},{"$f":"'mod2 6b'!D200","v":0},{"$f":"'mod2 6b'!E200","v":0},{"$f":"LOOKUP($F$10,'mod2 6b'!$F$10:$Q$10,'mod2 6b'!F200:Q200)","v":0},{"$f":"LOOKUP($G$10,'mod2 6b'!$F$10:$Q$10,'mod2 6b'!F200:Q200)","v":0},{"$f":"'mod2 6b'!R200","v":0},{"$f":"'mod2 6b'!S200","v":0},{"$f":"'mod2 6b'!T200","v":0}]
[{"$f":"'mod2 6b'!A201","v":17},{"$f":"'mod2 6b'!B201","v":0},{"$f":"'mod2 6b'!C201","v":0},{"$f":"'mod2 6b'!D201","v":0},{"$f":"'mod2 6b'!E201","v":0},{"$f":"LOOKUP($F$10,'mod2 6b'!$F$10:$Q$10,'mod2 6b'!F201:Q201)","v":0},{"$f":"LOOKUP($G$10,'mod2 6b'!$F$10:$Q$10,'mod2 6b'!F201:Q201)","v":0},{"$f":"'mod2 6b'!R201","v":0},{"$f":"'mod2 6b'!S201","v":0},{"$f":"'mod2 6b'!T201","v":0}]
[{"$f":"'mod2 6b'!A202","v":18},{"$f":"'mod2 6b'!B202","v":0},{"$f":"'mod2 6b'!C202","v":"GESTÃO AMBIENTAL"},{"$f":"'mod2 6b'!D202","v":0},{"$f":"'mod2 6b'!E202","v":0},{"$f":"LOOKUP($F$10,'mod2 6b'!$F$10:$Q$10,'mod2 6b'!F202:Q202)","v":0},{"$f":"LOOKUP($G$10,'mod2 6b'!$F$10:$Q$10,'mod2 6b'!F202:Q202)","v":0},{"$f":"'mod2 6b'!R202","v":0},{"$f":"'mod2 6b'!S202","v":0},{"$f":"'mod2 6b'!T202","v":0}]
[{"$f":"'mod2 6b'!A203","v":18},{"$f":"'mod2 6b'!B203","v":541},{"$f":"'mod2 6b'!C203","v":"Preservação e Conservação Ambiental"},{"$f":"'mod2 6b'!D203","v":0},{"$f":"'mod2 6b'!E203","v":0},{"$f":"LOOKUP($F$10,'mod2 6b'!$F$10:$Q$10,'mod2 6b'!F203:Q203)","v":0},{"$f":"LOOKUP($G$10,'mod2 6b'!$F$10:$Q$10,'mod2 6b'!F203:Q203)","v":0},{"$f":"'mod2 6b'!R203","v":0},{"$f":"'mod2 6b'!S203","v":0},{"$f":"'mod2 6b'!T203","v":0}]
[{"$f":"'mod2 6b'!A204","v":18},{"$f":"'mod2 6b'!B204","v":542},{"$f":"'mod2 6b'!C204","v":"Controle Ambiental"},{"$f":"'mod2 6b'!D204","v":0},{"$f":"'mod2 6b'!E204","v":0},{"$f":"LOOKUP($F$10,'mod2 6b'!$F$10:$Q$10,'mod2 6b'!F204:Q204)","v":0},{"$f":"LOOKUP($G$10,'mod2 6b'!$F$10:$Q$10,'mod2 6b'!F204:Q204)","v":0},{"$f":"'mod2 6b'!R204","v":0},{"$f":"'mod2 6b'!S204","v":0},{"$f":"'mod2 6b'!T204","v":0}]
[{"$f":"'mod2 6b'!A205","v":18},{"$f":"'mod2 6b'!B205","v":543},{"$f":"'mod2 6b'!C205","v":"Recuperação de Áreas Degradadas"},{"$f":"'mod2 6b'!D205","v":0},{"$f":"'mod2 6b'!E205","v":0},{"$f":"LOOKUP($F$10,'mod2 6b'!$F$10:$Q$10,'mod2 6b'!F205:Q205)","v":0},{"$f":"LOOKUP($G$10,'mod2 6b'!$F$10:$Q$10,'mod2 6b'!F205:Q205)","v":0},{"$f":"'mod2 6b'!R205","v":0},{"$f":"'mod2 6b'!S205","v":0},{"$f":"'mod2 6b'!T205","v":0}]
[{"$f":"'mod2 6b'!A206","v":18},{"$f":"'mod2 6b'!B206","v":544},{"$f":"'mod2 6b'!C206","v":"Recursos Hídricos"},{"$f":"'mod2 6b'!D206","v":0},{"$f":"'mod2 6b'!E206","v":0},{"$f":"LOOKUP($F$10,'mod2 6b'!$F$10:$Q$10,'mod2 6b'!F206:Q206)","v":0},{"$f":"LOOKUP($G$10,'mod2 6b'!$F$10:$Q$10,'mod2 6b'!F206:Q206)","v":0},{"$f":"'mod2 6b'!R206","v":0},{"$f":"'mod2 6b'!S206","v":0},{"$f":"'mod2 6b'!T206","v":0}]
[{"$f":"'mod2 6b'!A207","v":18},{"$f":"'mod2 6b'!B207","v":545},{"$f":"'mod2 6b'!C207","v":"Meteorologia"},{"$f":"'mod2 6b'!D207","v":0},{"$f":"'mod2 6b'!E207","v":0},{"$f":"LOOKUP($F$10,'mod2 6b'!$F$10:$Q$10,'mod2 6b'!F207:Q207)","v":0},{"$f":"LOOKUP($G$10,'mod2 6b'!$F$10:$Q$10,'mod2 6b'!F207:Q207)","v":0},{"$f":"'mod2 6b'!R207","v":0},{"$f":"'mod2 6b'!S207","v":0},{"$f":"'mod2 6b'!T207","v":0}]
[{"$f":"'mod2 6b'!A208","v":18},{"$f":"'mod2 6b'!B208","v":0},{"$f":"'mod2 6b'!C208","v":0},{"$f":"'mod2 6b'!D208","v":0},{"$f":"'mod2 6b'!E208","v":0},{"$f":"LOOKUP($F$10,'mod2 6b'!$F$10:$Q$10,'mod2 6b'!F208:Q208)","v":0},{"$f":"LOOKUP($G$10,'mod2 6b'!$F$10:$Q$10,'mod2 6b'!F208:Q208)","v":0},{"$f":"'mod2 6b'!R208","v":0},{"$f":"'mod2 6b'!S208","v":0},{"$f":"'mod2 6b'!T208","v":0}]
[{"$f":"'mod2 6b'!A209","v":18},{"$f":"'mod2 6b'!B209","v":0},{"$f":"'mod2 6b'!C209","v":0},{"$f":"'mod2 6b'!D209","v":0},{"$f":"'mod2 6b'!E209","v":0},{"$f":"LOOKUP($F$10,'mod2 6b'!$F$10:$Q$10,'mod2 6b'!F209:Q209)","v":0},{"$f":"LOOKUP($G$10,'mod2 6b'!$F$10:$Q$10,'mod2 6b'!F209:Q209)","v":0},{"$f":"'mod2 6b'!R209","v":0},{"$f":"'mod2 6b'!S209","v":0},{"$f":"'mod2 6b'!T209","v":0}]
[{"$f":"'mod2 6b'!A210","v":18},{"$f":"'mod2 6b'!B210","v":0},{"$f":"'mod2 6b'!C210","v":0},{"$f":"'mod2 6b'!D210","v":0},{"$f":"'mod2 6b'!E210","v":0},{"$f":"LOOKUP($F$10,'mod2 6b'!$F$10:$Q$10,'mod2 6b'!F210:Q210)","v":0},{"$f":"LOOKUP($G$10,'mod2 6b'!$F$10:$Q$10,'mod2 6b'!F210:Q210)","v":0},{"$f":"'mod2 6b'!R210","v":0},{"$f":"'mod2 6b'!S210","v":0},{"$f":"'mod2 6b'!T210","v":0}]
[{"$f":"'mod2 6b'!A211","v":18},{"$f":"'mod2 6b'!B211","v":0},{"$f":"'mod2 6b'!C211","v":0},{"$f":"'mod2 6b'!D211","v":0},{"$f":"'mod2 6b'!E211","v":0},{"$f":"LOOKUP($F$10,'mod2 6b'!$F$10:$Q$10,'mod2 6b'!F211:Q211)","v":0},{"$f":"LOOKUP($G$10,'mod2 6b'!$F$10:$Q$10,'mod2 6b'!F211:Q211)","v":0},{"$f":"'mod2 6b'!R211","v":0},{"$f":"'mod2 6b'!S211","v":0},{"$f":"'mod2 6b'!T211","v":0}]
[{"$f":"'mod2 6b'!A212","v":18},{"$f":"'mod2 6b'!B212","v":0},{"$f":"'mod2 6b'!C212","v":0},{"$f":"'mod2 6b'!D212","v":0},{"$f":"'mod2 6b'!E212","v":0},{"$f":"LOOKUP($F$10,'mod2 6b'!$F$10:$Q$10,'mod2 6b'!F212:Q212)","v":0},{"$f":"LOOKUP($G$10,'mod2 6b'!$F$10:$Q$10,'mod2 6b'!F212:Q212)","v":0},{"$f":"'mod2 6b'!R212","v":0},{"$f":"'mod2 6b'!S212","v":0},{"$f":"'mod2 6b'!T212","v":0}]
[{"$f":"'mod2 6b'!A213","v":19},{"$f":"'mod2 6b'!B213","v":0},{"$f":"'mod2 6b'!C213","v":"CIÊNCIA E TECNOLOGIA"},{"$f":"'mod2 6b'!D213","v":0},{"$f":"'mod2 6b'!E213","v":0},{"$f":"LOOKUP($F$10,'mod2 6b'!$F$10:$Q$10,'mod2 6b'!F213:Q213)","v":0},{"$f":"LOOKUP($G$10,'mod2 6b'!$F$10:$Q$10,'mod2 6b'!F213:Q213)","v":0},{"$f":"'mod2 6b'!R213","v":0},{"$f":"'mod2 6b'!S213","v":0},{"$f":"'mod2 6b'!T213","v":0}]
[{"$f":"'mod2 6b'!A214","v":19},{"$f":"'mod2 6b'!B214","v":571},{"$f":"'mod2 6b'!C214","v":"Desenvolvimento Científico"},{"$f":"'mod2 6b'!D214","v":0},{"$f":"'mod2 6b'!E214","v":0},{"$f":"LOOKUP($F$10,'mod2 6b'!$F$10:$Q$10,'mod2 6b'!F214:Q214)","v":0},{"$f":"LOOKUP($G$10,'mod2 6b'!$F$10:$Q$10,'mod2 6b'!F214:Q214)","v":0},{"$f":"'mod2 6b'!R214","v":0},{"$f":"'mod2 6b'!S214","v":0},{"$f":"'mod2 6b'!T214","v":0}]
[{"$f":"'mod2 6b'!A215","v":19},{"$f":"'mod2 6b'!B215","v":572},{"$f":"'mod2 6b'!C215","v":"Desenvolvimento Tecnol. e Engenharia"},{"$f":"'mod2 6b'!D215","v":0},{"$f":"'mod2 6b'!E215","v":0},{"$f":"LOOKUP($F$10,'mod2 6b'!$F$10:$Q$10,'mod2 6b'!F215:Q215)","v":0},{"$f":"LOOKUP($G$10,'mod2 6b'!$F$10:$Q$10,'mod2 6b'!F215:Q215)","v":0},{"$f":"'mod2 6b'!R215","v":0},{"$f":"'mod2 6b'!S215","v":0},{"$f":"'mod2 6b'!T215","v":0}]
[{"$f":"'mod2 6b'!A216","v":19},{"$f":"'mod2 6b'!B216","v":573},{"$f":"'mod2 6b'!C216","v":"Difusão do Conhec. Cient. e Tecnológico"},{"$f":"'mod2 6b'!D216","v":0},{"$f":"'mod2 6b'!E216","v":0},{"$f":"LOOKUP($F$10,'mod2 6b'!$F$10:$Q$10,'mod2 6b'!F216:Q216)","v":0},{"$f":"LOOKUP($G$10,'mod2 6b'!$F$10:$Q$10,'mod2 6b'!F216:Q216)","v":0},{"$f":"'mod2 6b'!R216","v":0},{"$f":"'mod2 6b'!S216","v":0},{"$f":"'mod2 6b'!T216","v":0}]
[{"$f":"'mod2 6b'!A217","v":19},{"$f":"'mod2 6b'!B217","v":0},{"$f":"'mod2 6b'!C217","v":0},{"$f":"'mod2 6b'!D217","v":0},{"$f":"'mod2 6b'!E217","v":0},{"$f":"LOOKUP($F$10,'mod2 6b'!$F$10:$Q$10,'mod2 6b'!F217:Q217)","v":0},{"$f":"LOOKUP($G$10,'mod2 6b'!$F$10:$Q$10,'mod2 6b'!F217:Q217)","v":0},{"$f":"'mod2 6b'!R217","v":0},{"$f":"'mod2 6b'!S217","v":0},{"$f":"'mod2 6b'!T217","v":0}]
[{"$f":"'mod2 6b'!A218","v":19},{"$f":"'mod2 6b'!B218","v":0},{"$f":"'mod2 6b'!C218","v":0},{"$f":"'mod2 6b'!D218","v":0},{"$f":"'mod2 6b'!E218","v":0},{"$f":"LOOKUP($F$10,'mod2 6b'!$F$10:$Q$10,'mod2 6b'!F218:Q218)","v":0},{"$f":"LOOKUP($G$10,'mod2 6b'!$F$10:$Q$10,'mod2 6b'!F218:Q218)","v":0},{"$f":"'mod2 6b'!R218","v":0},{"$f":"'mod2 6b'!S218","v":0},{"$f":"'mod2 6b'!T218","v":0}]
[{"$f":"'mod2 6b'!A219","v":19},{"$f":"'mod2 6b'!B219","v":0},{"$f":"'mod2 6b'!C219","v":0},{"$f":"'mod2 6b'!D219","v":0},{"$f":"'mod2 6b'!E219","v":0},{"$f":"LOOKUP($F$10,'mod2 6b'!$F$10:$Q$10,'mod2 6b'!F219:Q219)","v":0},{"$f":"LOOKUP($G$10,'mod2 6b'!$F$10:$Q$10,'mod2 6b'!F219:Q219)","v":0},{"$f":"'mod2 6b'!R219","v":0},{"$f":"'mod2 6b'!S219","v":0},{"$f":"'mod2 6b'!T219","v":0}]
[{"$f":"'mod2 6b'!A220","v":19},{"$f":"'mod2 6b'!B220","v":0},{"$f":"'mod2 6b'!C220","v":0},{"$f":"'mod2 6b'!D220","v":0},{"$f":"'mod2 6b'!E220","v":0},{"$f":"LOOKUP($F$10,'mod2 6b'!$F$10:$Q$10,'mod2 6b'!F220:Q220)","v":0},{"$f":"LOOKUP($G$10,'mod2 6b'!$F$10:$Q$10,'mod2 6b'!F220:Q220)","v":0},{"$f":"'mod2 6b'!R220","v":0},{"$f":"'mod2 6b'!S220","v":0},{"$f":"'mod2 6b'!T220","v":0}]
[{"$f":"'mod2 6b'!A221","v":19},{"$f":"'mod2 6b'!B221","v":0},{"$f":"'mod2 6b'!C221","v":0},{"$f":"'mod2 6b'!D221","v":0},{"$f":"'mod2 6b'!E221","v":0},{"$f":"LOOKUP($F$10,'mod2 6b'!$F$10:$Q$10,'mod2 6b'!F221:Q221)","v":0},{"$f":"LOOKUP($G$10,'mod2 6b'!$F$10:$Q$10,'mod2 6b'!F221:Q221)","v":0},{"$f":"'mod2 6b'!R221","v":0},{"$f":"'mod2 6b'!S221","v":0},{"$f":"'mod2 6b'!T221","v":0}]
[{"$f":"'mod2 6b'!A222","v":20},{"$f":"'mod2 6b'!B222","v":0},{"$f":"'mod2 6b'!C222","v":"AGRICULTURA"},{"$f":"'mod2 6b'!D222","v":0},{"$f":"'mod2 6b'!E222","v":0},{"$f":"LOOKUP($F$10,'mod2 6b'!$F$10:$Q$10,'mod2 6b'!F222:Q222)","v":0},{"$f":"LOOKUP($G$10,'mod2 6b'!$F$10:$Q$10,'mod2 6b'!F222:Q222)","v":0},{"$f":"'mod2 6b'!R222","v":0},{"$f":"'mod2 6b'!S222","v":0},{"$f":"'mod2 6b'!T222","v":0}]
[{"$f":"'mod2 6b'!A223","v":20},{"$f":"'mod2 6b'!B223","v":601},{"$f":"'mod2 6b'!C223","v":"Promoção da Produção Vegetal"},{"$f":"'mod2 6b'!D223","v":0},{"$f":"'mod2 6b'!E223","v":0},{"$f":"LOOKUP($F$10,'mod2 6b'!$F$10:$Q$10,'mod2 6b'!F223:Q223)","v":0},{"$f":"LOOKUP($G$10,'mod2 6b'!$F$10:$Q$10,'mod2 6b'!F223:Q223)","v":0},{"$f":"'mod2 6b'!R223","v":0},{"$f":"'mod2 6b'!S223","v":0},{"$f":"'mod2 6b'!T223","v":0}]
[{"$f":"'mod2 6b'!A224","v":20},{"$f":"'mod2 6b'!B224","v":602},{"$f":"'mod2 6b'!C224","v":"Promoção da Produção Animal"},{"$f":"'mod2 6b'!D224","v":0},{"$f":"'mod2 6b'!E224","v":0},{"$f":"LOOKUP($F$10,'mod2 6b'!$F$10:$Q$10,'mod2 6b'!F224:Q224)","v":0},{"$f":"LOOKUP($G$10,'mod2 6b'!$F$10:$Q$10,'mod2 6b'!F224:Q224)","v":0},{"$f":"'mod2 6b'!R224","v":0},{"$f":"'mod2 6b'!S224","v":0},{"$f":"'mod2 6b'!T224","v":0}]
[{"$f":"'mod2 6b'!A225","v":20},{"$f":"'mod2 6b'!B225","v":603},{"$f":"'mod2 6b'!C225","v":"Defesa Sanitária Vegetal"},{"$f":"'mod2 6b'!D225","v":0},{"$f":"'mod2 6b'!E225","v":0},{"$f":"LOOKUP($F$10,'mod2 6b'!$F$10:$Q$10,'mod2 6b'!F225:Q225)","v":0},{"$f":"LOOKUP($G$10,'mod2 6b'!$F$10:$Q$10,'mod2 6b'!F225:Q225)","v":0},{"$f":"'mod2 6b'!R225","v":0},{"$f":"'mod2 6b'!S225","v":0},{"$f":"'mod2 6b'!T225","v":0}]
[{"$f":"'mod2 6b'!A226","v":20},{"$f":"'mod2 6b'!B226","v":604},{"$f":"'mod2 6b'!C226","v":"Defesa Sanitária Animal"},{"$f":"'mod2 6b'!D226","v":0},{"$f":"'mod2 6b'!E226","v":0},{"$f":"LOOKUP($F$10,'mod2 6b'!$F$10:$Q$10,'mod2 6b'!F226:Q226)","v":0},{"$f":"LOOKUP($G$10,'mod2 6b'!$F$10:$Q$10,'mod2 6b'!F226:Q226)","v":0},{"$f":"'mod2 6b'!R226","v":0},{"$f":"'mod2 6b'!S226","v":0},{"$f":"'mod2 6b'!T226","v":0}]
[{"$f":"'mod2 6b'!A227","v":20},{"$f":"'mod2 6b'!B227","v":605},{"$f":"'mod2 6b'!C227","v":"Abastecimento"},{"$f":"'mod2 6b'!D227","v":0},{"$f":"'mod2 6b'!E227","v":0},{"$f":"LOOKUP($F$10,'mod2 6b'!$F$10:$Q$10,'mod2 6b'!F227:Q227)","v":0},{"$f":"LOOKUP($G$10,'mod2 6b'!$F$10:$Q$10,'mod2 6b'!F227:Q227)","v":0},{"$f":"'mod2 6b'!R227","v":0},{"$f":"'mod2 6b'!S227","v":0},{"$f":"'mod2 6b'!T227","v":0}]
[{"$f":"'mod2 6b'!A228","v":20},{"$f":"'mod2 6b'!B228","v":606},{"$f":"'mod2 6b'!C228","v":"Extensão Rural"},{"$f":"'mod2 6b'!D228","v":0},{"$f":"'mod2 6b'!E228","v":0},{"$f":"LOOKUP($F$10,'mod2 6b'!$F$10:$Q$10,'mod2 6b'!F228:Q228)","v":0},{"$f":"LOOKUP($G$10,'mod2 6b'!$F$10:$Q$10,'mod2 6b'!F228:Q228)","v":0},{"$f":"'mod2 6b'!R228","v":0},{"$f":"'mod2 6b'!S228","v":0},{"$f":"'mod2 6b'!T228","v":0}]
[{"$f":"'mod2 6b'!A229","v":20},{"$f":"'mod2 6b'!B229","v":607},{"$f":"'mod2 6b'!C229","v":"Irrigação"},{"$f":"'mod2 6b'!D229","v":0},{"$f":"'mod2 6b'!E229","v":0},{"$f":"LOOKUP($F$10,'mod2 6b'!$F$10:$Q$10,'mod2 6b'!F229:Q229)","v":0},{"$f":"LOOKUP($G$10,'mod2 6b'!$F$10:$Q$10,'mod2 6b'!F229:Q229)","v":0},{"$f":"'mod2 6b'!R229","v":0},{"$f":"'mod2 6b'!S229","v":0},{"$f":"'mod2 6b'!T229","v":0}]
[{"$f":"'mod2 6b'!A230","v":20},{"$f":"'mod2 6b'!B230","v":0},{"$f":"'mod2 6b'!C230","v":0},{"$f":"'mod2 6b'!D230","v":0},{"$f":"'mod2 6b'!E230","v":0},{"$f":"LOOKUP($F$10,'mod2 6b'!$F$10:$Q$10,'mod2 6b'!F230:Q230)","v":0},{"$f":"LOOKUP($G$10,'mod2 6b'!$F$10:$Q$10,'mod2 6b'!F230:Q230)","v":0},{"$f":"'mod2 6b'!R230","v":0},{"$f":"'mod2 6b'!S230","v":0},{"$f":"'mod2 6b'!T230","v":0}]
[{"$f":"'mod2 6b'!A231","v":20},{"$f":"'mod2 6b'!B231","v":0},{"$f":"'mod2 6b'!C231","v":0},{"$f":"'mod2 6b'!D231","v":0},{"$f":"'mod2 6b'!E231","v":0},{"$f":"LOOKUP($F$10,'mod2 6b'!$F$10:$Q$10,'mod2 6b'!F231:Q231)","v":0},{"$f":"LOOKUP($G$10,'mod2 6b'!$F$10:$Q$10,'mod2 6b'!F231:Q231)","v":0},{"$f":"'mod2 6b'!R231","v":0},{"$f":"'mod2 6b'!S231","v":0},{"$f":"'mod2 6b'!T231","v":0}]
[{"$f":"'mod2 6b'!A232","v":20},{"$f":"'mod2 6b'!B232","v":0},{"$f":"'mod2 6b'!C232","v":0},{"$f":"'mod2 6b'!D232","v":0},{"$f":"'mod2 6b'!E232","v":0},{"$f":"LOOKUP($F$10,'mod2 6b'!$F$10:$Q$10,'mod2 6b'!F232:Q232)","v":0},{"$f":"LOOKUP($G$10,'mod2 6b'!$F$10:$Q$10,'mod2 6b'!F232:Q232)","v":0},{"$f":"'mod2 6b'!R232","v":0},{"$f":"'mod2 6b'!S232","v":0},{"$f":"'mod2 6b'!T232","v":0}]
[{"$f":"'mod2 6b'!A233","v":20},{"$f":"'mod2 6b'!B233","v":0},{"$f":"'mod2 6b'!C233","v":0},{"$f":"'mod2 6b'!D233","v":0},{"$f":"'mod2 6b'!E233","v":0},{"$f":"LOOKUP($F$10,'mod2 6b'!$F$10:$Q$10,'mod2 6b'!F233:Q233)","v":0},{"$f":"LOOKUP($G$10,'mod2 6b'!$F$10:$Q$10,'mod2 6b'!F233:Q233)","v":0},{"$f":"'mod2 6b'!R233","v":0},{"$f":"'mod2 6b'!S233","v":0},{"$f":"'mod2 6b'!T233","v":0}]
[{"$f":"'mod2 6b'!A234","v":20},{"$f":"'mod2 6b'!B234","v":0},{"$f":"'mod2 6b'!C234","v":0},{"$f":"'mod2 6b'!D234","v":0},{"$f":"'mod2 6b'!E234","v":0},{"$f":"LOOKUP($F$10,'mod2 6b'!$F$10:$Q$10,'mod2 6b'!F234:Q234)","v":0},{"$f":"LOOKUP($G$10,'mod2 6b'!$F$10:$Q$10,'mod2 6b'!F234:Q234)","v":0},{"$f":"'mod2 6b'!R234","v":0},{"$f":"'mod2 6b'!S234","v":0},{"$f":"'mod2 6b'!T234","v":0}]
[{"$f":"'mod2 6b'!A235","v":20},{"$f":"'mod2 6b'!B235","v":0},{"$f":"'mod2 6b'!C235","v":0},{"$f":"'mod2 6b'!D235","v":0},{"$f":"'mod2 6b'!E235","v":0},{"$f":"LOOKUP($F$10,'mod2 6b'!$F$10:$Q$10,'mod2 6b'!F235:Q235)","v":0},{"$f":"LOOKUP($G$10,'mod2 6b'!$F$10:$Q$10,'mod2 6b'!F235:Q235)","v":0},{"$f":"'mod2 6b'!R235","v":0},{"$f":"'mod2 6b'!S235","v":0},{"$f":"'mod2 6b'!T235","v":0}]
[{"$f":"'mod2 6b'!A236","v":20},{"$f":"'mod2 6b'!B236","v":0},{"$f":"'mod2 6b'!C236","v":0},{"$f":"'mod2 6b'!D236","v":0},{"$f":"'mod2 6b'!E236","v":0},{"$f":"LOOKUP($F$10,'mod2 6b'!$F$10:$Q$10,'mod2 6b'!F236:Q236)","v":0},{"$f":"LOOKUP($G$10,'mod2 6b'!$F$10:$Q$10,'mod2 6b'!F236:Q236)","v":0},{"$f":"'mod2 6b'!R236","v":0},{"$f":"'mod2 6b'!S236","v":0},{"$f":"'mod2 6b'!T236","v":0}]
[{"$f":"'mod2 6b'!A237","v":20},{"$f":"'mod2 6b'!B237","v":0},{"$f":"'mod2 6b'!C237","v":0},{"$f":"'mod2 6b'!D237","v":0},{"$f":"'mod2 6b'!E237","v":0},{"$f":"LOOKUP($F$10,'mod2 6b'!$F$10:$Q$10,'mod2 6b'!F237:Q237)","v":0},{"$f":"LOOKUP($G$10,'mod2 6b'!$F$10:$Q$10,'mod2 6b'!F237:Q237)","v":0},{"$f":"'mod2 6b'!R237","v":0},{"$f":"'mod2 6b'!S237","v":0},{"$f":"'mod2 6b'!T237","v":0}]
[{"$f":"'mod2 6b'!A238","v":20},{"$f":"'mod2 6b'!B238","v":0},{"$f":"'mod2 6b'!C238","v":0},{"$f":"'mod2 6b'!D238","v":0},{"$f":"'mod2 6b'!E238","v":0},{"$f":"LOOKUP($F$10,'mod2 6b'!$F$10:$Q$10,'mod2 6b'!F238:Q238)","v":0},{"$f":"LOOKUP($G$10,'mod2 6b'!$F$10:$Q$10,'mod2 6b'!F238:Q238)","v":0},{"$f":"'mod2 6b'!R238","v":0},{"$f":"'mod2 6b'!S238","v":0},{"$f":"'mod2 6b'!T238","v":0}]
[{"$f":"'mod2 6b'!A239","v":20},{"$f":"'mod2 6b'!B239","v":0},{"$f":"'mod2 6b'!C239","v":0},{"$f":"'mod2 6b'!D239","v":0},{"$f":"'mod2 6b'!E239","v":0},{"$f":"LOOKUP($F$10,'mod2 6b'!$F$10:$Q$10,'mod2 6b'!F239:Q239)","v":0},{"$f":"LOOKUP($G$10,'mod2 6b'!$F$10:$Q$10,'mod2 6b'!F239:Q239)","v":0},{"$f":"'mod2 6b'!R239","v":0},{"$f":"'mod2 6b'!S239","v":0},{"$f":"'mod2 6b'!T239","v":0}]
[{"$f":"'mod2 6b'!A240","v":21},{"$f":"'mod2 6b'!B240","v":0},{"$f":"'mod2 6b'!C240","v":"ORGANIZAÇÃO AGRÁRIA"},{"$f":"'mod2 6b'!D240","v":0},{"$f":"'mod2 6b'!E240","v":0},{"$f":"LOOKUP($F$10,'mod2 6b'!$F$10:$Q$10,'mod2 6b'!F240:Q240)","v":0},{"$f":"LOOKUP($G$10,'mod2 6b'!$F$10:$Q$10,'mod2 6b'!F240:Q240)","v":0},{"$f":"'mod2 6b'!R240","v":0},{"$f":"'mod2 6b'!S240","v":0},{"$f":"'mod2 6b'!T240","v":0}]
[{"$f":"'mod2 6b'!A241","v":21},{"$f":"'mod2 6b'!B241","v":631},{"$f":"'mod2 6b'!C241","v":"Reforma Agrária"},{"$f":"'mod2 6b'!D241","v":0},{"$f":"'mod2 6b'!E241","v":0},{"$f":"LOOKUP($F$10,'mod2 6b'!$F$10:$Q$10,'mod2 6b'!F241:Q241)","v":0},{"$f":"LOOKUP($G$10,'mod2 6b'!$F$10:$Q$10,'mod2 6b'!F241:Q241)","v":0},{"$f":"'mod2 6b'!R241","v":0},{"$f":"'mod2 6b'!S241","v":0},{"$f":"'mod2 6b'!T241","v":0}]
[{"$f":"'mod2 6b'!A242","v":21},{"$f":"'mod2 6b'!B242","v":632},{"$f":"'mod2 6b'!C242","v":"Colonização"},{"$f":"'mod2 6b'!D242","v":0},{"$f":"'mod2 6b'!E242","v":0},{"$f":"LOOKUP($F$10,'mod2 6b'!$F$10:$Q$10,'mod2 6b'!F242:Q242)","v":0},{"$f":"LOOKUP($G$10,'mod2 6b'!$F$10:$Q$10,'mod2 6b'!F242:Q242)","v":0},{"$f":"'mod2 6b'!R242","v":0},{"$f":"'mod2 6b'!S242","v":0},{"$f":"'mod2 6b'!T242","v":0}]
[{"$f":"'mod2 6b'!A243","v":21},{"$f":"'mod2 6b'!B243","v":0},{"$f":"'mod2 6b'!C243","v":0},{"$f":"'mod2 6b'!D243","v":0},{"$f":"'mod2 6b'!E243","v":0},{"$f":"LOOKUP($F$10,'mod2 6b'!$F$10:$Q$10,'mod2 6b'!F243:Q243)","v":0},{"$f":"LOOKUP($G$10,'mod2 6b'!$F$10:$Q$10,'mod2 6b'!F243:Q243)","v":0},{"$f":"'mod2 6b'!R243","v":0},{"$f":"'mod2 6b'!S243","v":0},{"$f":"'mod2 6b'!T243","v":0}]
[{"$f":"'mod2 6b'!A244","v":21},{"$f":"'mod2 6b'!B244","v":0},{"$f":"'mod2 6b'!C244","v":0},{"$f":"'mod2 6b'!D244","v":0},{"$f":"'mod2 6b'!E244","v":0},{"$f":"LOOKUP($F$10,'mod2 6b'!$F$10:$Q$10,'mod2 6b'!F244:Q244)","v":0},{"$f":"LOOKUP($G$10,'mod2 6b'!$F$10:$Q$10,'mod2 6b'!F244:Q244)","v":0},{"$f":"'mod2 6b'!R244","v":0},{"$f":"'mod2 6b'!S244","v":0},{"$f":"'mod2 6b'!T244","v":0}]
[{"$f":"'mod2 6b'!A245","v":21},{"$f":"'mod2 6b'!B245","v":0},{"$f":"'mod2 6b'!C245","v":0},{"$f":"'mod2 6b'!D245","v":0},{"$f":"'mod2 6b'!E245","v":0},{"$f":"LOOKUP($F$10,'mod2 6b'!$F$10:$Q$10,'mod2 6b'!F245:Q245)","v":0},{"$f":"LOOKUP($G$10,'mod2 6b'!$F$10:$Q$10,'mod2 6b'!F245:Q245)","v":0},{"$f":"'mod2 6b'!R245","v":0},{"$f":"'mod2 6b'!S245","v":0},{"$f":"'mod2 6b'!T245","v":0}]
[{"$f":"'mod2 6b'!A246","v":21},{"$f":"'mod2 6b'!B246","v":0},{"$f":"'mod2 6b'!C246","v":0},{"$f":"'mod2 6b'!D246","v":0},{"$f":"'mod2 6b'!E246","v":0},{"$f":"LOOKUP($F$10,'mod2 6b'!$F$10:$Q$10,'mod2 6b'!F246:Q246)","v":0},{"$f":"LOOKUP($G$10,'mod2 6b'!$F$10:$Q$10,'mod2 6b'!F246:Q246)","v":0},{"$f":"'mod2 6b'!R246","v":0},{"$f":"'mod2 6b'!S246","v":0},{"$f":"'mod2 6b'!T246","v":0}]
[{"$f":"'mod2 6b'!A247","v":21},{"$f":"'mod2 6b'!B247","v":0},{"$f":"'mod2 6b'!C247","v":0},{"$f":"'mod2 6b'!D247","v":0},{"$f":"'mod2 6b'!E247","v":0},{"$f":"LOOKUP($F$10,'mod2 6b'!$F$10:$Q$10,'mod2 6b'!F247:Q247)","v":0},{"$f":"LOOKUP($G$10,'mod2 6b'!$F$10:$Q$10,'mod2 6b'!F247:Q247)","v":0},{"$f":"'mod2 6b'!R247","v":0},{"$f":"'mod2 6b'!S247","v":0},{"$f":"'mod2 6b'!T247","v":0}]
[{"$f":"'mod2 6b'!A248","v":22},{"$f":"'mod2 6b'!B248","v":0},{"$f":"'mod2 6b'!C248","v":"INDÚSTRIA"},{"$f":"'mod2 6b'!D248","v":0},{"$f":"'mod2 6b'!E248","v":0},{"$f":"LOOKUP($F$10,'mod2 6b'!$F$10:$Q$10,'mod2 6b'!F248:Q248)","v":0},{"$f":"LOOKUP($G$10,'mod2 6b'!$F$10:$Q$10,'mod2 6b'!F248:Q248)","v":0},{"$f":"'mod2 6b'!R248","v":0},{"$f":"'mod2 6b'!S248","v":0},{"$f":"'mod2 6b'!T248","v":0}]
[{"$f":"'mod2 6b'!A249","v":22},{"$f":"'mod2 6b'!B249","v":661},{"$f":"'mod2 6b'!C249","v":"Promoção Industrial"},{"$f":"'mod2 6b'!D249","v":0},{"$f":"'mod2 6b'!E249","v":0},{"$f":"LOOKUP($F$10,'mod2 6b'!$F$10:$Q$10,'mod2 6b'!F249:Q249)","v":0},{"$f":"LOOKUP($G$10,'mod2 6b'!$F$10:$Q$10,'mod2 6b'!F249:Q249)","v":0},{"$f":"'mod2 6b'!R249","v":0},{"$f":"'mod2 6b'!S249","v":0},{"$f":"'mod2 6b'!T249","v":0}]
[{"$f":"'mod2 6b'!A250","v":22},{"$f":"'mod2 6b'!B250","v":662},{"$f":"'mod2 6b'!C250","v":"Produção Industrial"},{"$f":"'mod2 6b'!D250","v":0},{"$f":"'mod2 6b'!E250","v":0},{"$f":"LOOKUP($F$10,'mod2 6b'!$F$10:$Q$10,'mod2 6b'!F250:Q250)","v":0},{"$f":"LOOKUP($G$10,'mod2 6b'!$F$10:$Q$10,'mod2 6b'!F250:Q250)","v":0},{"$f":"'mod2 6b'!R250","v":0},{"$f":"'mod2 6b'!S250","v":0},{"$f":"'mod2 6b'!T250","v":0}]
[{"$f":"'mod2 6b'!A251","v":22},{"$f":"'mod2 6b'!B251","v":663},{"$f":"'mod2 6b'!C251","v":"Mineração"},{"$f":"'mod2 6b'!D251","v":0},{"$f":"'mod2 6b'!E251","v":0},{"$f":"LOOKUP($F$10,'mod2 6b'!$F$10:$Q$10,'mod2 6b'!F251:Q251)","v":0},{"$f":"LOOKUP($G$10,'mod2 6b'!$F$10:$Q$10,'mod2 6b'!F251:Q251)","v":0},{"$f":"'mod2 6b'!R251","v":0},{"$f":"'mod2 6b'!S251","v":0},{"$f":"'mod2 6b'!T251","v":0}]
[{"$f":"'mod2 6b'!A252","v":22},{"$f":"'mod2 6b'!B252","v":664},{"$f":"'mod2 6b'!C252","v":"Propriedade Industrial"},{"$f":"'mod2 6b'!D252","v":0},{"$f":"'mod2 6b'!E252","v":0},{"$f":"LOOKUP($F$10,'mod2 6b'!$F$10:$Q$10,'mod2 6b'!F252:Q252)","v":0},{"$f":"LOOKUP($G$10,'mod2 6b'!$F$10:$Q$10,'mod2 6b'!F252:Q252)","v":0},{"$f":"'mod2 6b'!R252","v":0},{"$f":"'mod2 6b'!S252","v":0},{"$f":"'mod2 6b'!T252","v":0}]
[{"$f":"'mod2 6b'!A253","v":22},{"$f":"'mod2 6b'!B253","v":665},{"$f":"'mod2 6b'!C253","v":"Normalização e Qualidade"},{"$f":"'mod2 6b'!D253","v":0},{"$f":"'mod2 6b'!E253","v":0},{"$f":"LOOKUP($F$10,'mod2 6b'!$F$10:$Q$10,'mod2 6b'!F253:Q253)","v":0},{"$f":"LOOKUP($G$10,'mod2 6b'!$F$10:$Q$10,'mod2 6b'!F253:Q253)","v":0},{"$f":"'mod2 6b'!R253","v":0},{"$f":"'mod2 6b'!S253","v":0},{"$f":"'mod2 6b'!T253","v":0}]
[{"$f":"'mod2 6b'!A254","v":22},{"$f":"'mod2 6b'!B254","v":0},{"$f":"'mod2 6b'!C254","v":0},{"$f":"'mod2 6b'!D254","v":0},{"$f":"'mod2 6b'!E254","v":0},{"$f":"LOOKUP($F$10,'mod2 6b'!$F$10:$Q$10,'mod2 6b'!F254:Q254)","v":0},{"$f":"LOOKUP($G$10,'mod2 6b'!$F$10:$Q$10,'mod2 6b'!F254:Q254)","v":0},{"$f":"'mod2 6b'!R254","v":0},{"$f":"'mod2 6b'!S254","v":0},{"$f":"'mod2 6b'!T254","v":0}]
[{"$f":"'mod2 6b'!A255","v":22},{"$f":"'mod2 6b'!B255","v":0},{"$f":"'mod2 6b'!C255","v":0},{"$f":"'mod2 6b'!D255","v":0},{"$f":"'mod2 6b'!E255","v":0},{"$f":"LOOKUP($F$10,'mod2 6b'!$F$10:$Q$10,'mod2 6b'!F255:Q255)","v":0},{"$f":"LOOKUP($G$10,'mod2 6b'!$F$10:$Q$10,'mod2 6b'!F255:Q255)","v":0},{"$f":"'mod2 6b'!R255","v":0},{"$f":"'mod2 6b'!S255","v":0},{"$f":"'mod2 6b'!T255","v":0}]
[{"$f":"'mod2 6b'!A256","v":22},{"$f":"'mod2 6b'!B256","v":0},{"$f":"'mod2 6b'!C256","v":0},{"$f":"'mod2 6b'!D256","v":0},{"$f":"'mod2 6b'!E256","v":0},{"$f":"LOOKUP($F$10,'mod2 6b'!$F$10:$Q$10,'mod2 6b'!F256:Q256)","v":0},{"$f":"LOOKUP($G$10,'mod2 6b'!$F$10:$Q$10,'mod2 6b'!F256:Q256)","v":0},{"$f":"'mod2 6b'!R256","v":0},{"$f":"'mod2 6b'!S256","v":0},{"$f":"'mod2 6b'!T256","v":0}]
[{"$f":"'mod2 6b'!A257","v":22},{"$f":"'mod2 6b'!B257","v":0},{"$f":"'mod2 6b'!C257","v":0},{"$f":"'mod2 6b'!D257","v":0},{"$f":"'mod2 6b'!E257","v":0},{"$f":"LOOKUP($F$10,'mod2 6b'!$F$10:$Q$10,'mod2 6b'!F257:Q257)","v":0},{"$f":"LOOKUP($G$10,'mod2 6b'!$F$10:$Q$10,'mod2 6b'!F257:Q257)","v":0},{"$f":"'mod2 6b'!R257","v":0},{"$f":"'mod2 6b'!S257","v":0},{"$f":"'mod2 6b'!T257","v":0}]
[{"$f":"'mod2 6b'!A258","v":22},{"$f":"'mod2 6b'!B258","v":0},{"$f":"'mod2 6b'!C258","v":0},{"$f":"'mod2 6b'!D258","v":0},{"$f":"'mod2 6b'!E258","v":0},{"$f":"LOOKUP($F$10,'mod2 6b'!$F$10:$Q$10,'mod2 6b'!F258:Q258)","v":0},{"$f":"LOOKUP($G$10,'mod2 6b'!$F$10:$Q$10,'mod2 6b'!F258:Q258)","v":0},{"$f":"'mod2 6b'!R258","v":0},{"$f":"'mod2 6b'!S258","v":0},{"$f":"'mod2 6b'!T258","v":0}]
[{"$f":"'mod2 6b'!A259","v":23},{"$f":"'mod2 6b'!B259","v":0},{"$f":"'mod2 6b'!C259","v":"COMÉRCIO E SERVIÇOS"},{"$f":"'mod2 6b'!D259","v":0},{"$f":"'mod2 6b'!E259","v":0},{"$f":"LOOKUP($F$10,'mod2 6b'!$F$10:$Q$10,'mod2 6b'!F259:Q259)","v":0},{"$f":"LOOKUP($G$10,'mod2 6b'!$F$10:$Q$10,'mod2 6b'!F259:Q259)","v":0},{"$f":"'mod2 6b'!R259","v":0},{"$f":"'mod2 6b'!S259","v":0},{"$f":"'mod2 6b'!T259","v":0}]
[{"$f":"'mod2 6b'!A260","v":23},{"$f":"'mod2 6b'!B260","v":691},{"$f":"'mod2 6b'!C260","v":"Promoção Comercial"},{"$f":"'mod2 6b'!D260","v":0},{"$f":"'mod2 6b'!E260","v":0},{"$f":"LOOKUP($F$10,'mod2 6b'!$F$10:$Q$10,'mod2 6b'!F260:Q260)","v":0},{"$f":"LOOKUP($G$10,'mod2 6b'!$F$10:$Q$10,'mod2 6b'!F260:Q260)","v":0},{"$f":"'mod2 6b'!R260","v":0},{"$f":"'mod2 6b'!S260","v":0},{"$f":"'mod2 6b'!T260","v":0}]
[{"$f":"'mod2 6b'!A261","v":23},{"$f":"'mod2 6b'!B261","v":692},{"$f":"'mod2 6b'!C261","v":"Comercialização"},{"$f":"'mod2 6b'!D261","v":0},{"$f":"'mod2 6b'!E261","v":0},{"$f":"LOOKUP($F$10,'mod2 6b'!$F$10:$Q$10,'mod2 6b'!F261:Q261)","v":0},{"$f":"LOOKUP($G$10,'mod2 6b'!$F$10:$Q$10,'mod2 6b'!F261:Q261)","v":0},{"$f":"'mod2 6b'!R261","v":0},{"$f":"'mod2 6b'!S261","v":0},{"$f":"'mod2 6b'!T261","v":0}]
[{"$f":"'mod2 6b'!A262","v":23},{"$f":"'mod2 6b'!B262","v":693},{"$f":"'mod2 6b'!C262","v":"Comércio Exterior"},{"$f":"'mod2 6b'!D262","v":0},{"$f":"'mod2 6b'!E262","v":0},{"$f":"LOOKUP($F$10,'mod2 6b'!$F$10:$Q$10,'mod2 6b'!F262:Q262)","v":0},{"$f":"LOOKUP($G$10,'mod2 6b'!$F$10:$Q$10,'mod2 6b'!F262:Q262)","v":0},{"$f":"'mod2 6b'!R262","v":0},{"$f":"'mod2 6b'!S262","v":0},{"$f":"'mod2 6b'!T262","v":0}]
[{"$f":"'mod2 6b'!A263","v":23},{"$f":"'mod2 6b'!B263","v":694},{"$f":"'mod2 6b'!C263","v":"Serviços Financeiros"},{"$f":"'mod2 6b'!D263","v":0},{"$f":"'mod2 6b'!E263","v":0},{"$f":"LOOKUP($F$10,'mod2 6b'!$F$10:$Q$10,'mod2 6b'!F263:Q263)","v":0},{"$f":"LOOKUP($G$10,'mod2 6b'!$F$10:$Q$10,'mod2 6b'!F263:Q263)","v":0},{"$f":"'mod2 6b'!R263","v":0},{"$f":"'mod2 6b'!S263","v":0},{"$f":"'mod2 6b'!T263","v":0}]
[{"$f":"'mod2 6b'!A264","v":23},{"$f":"'mod2 6b'!B264","v":695},{"$f":"'mod2 6b'!C264","v":"Turismo"},{"$f":"'mod2 6b'!D264","v":0},{"$f":"'mod2 6b'!E264","v":0},{"$f":"LOOKUP($F$10,'mod2 6b'!$F$10:$Q$10,'mod2 6b'!F264:Q264)","v":0},{"$f":"LOOKUP($G$10,'mod2 6b'!$F$10:$Q$10,'mod2 6b'!F264:Q264)","v":0},{"$f":"'mod2 6b'!R264","v":0},{"$f":"'mod2 6b'!S264","v":0},{"$f":"'mod2 6b'!T264","v":0}]
[{"$f":"'mod2 6b'!A265","v":23},{"$f":"'mod2 6b'!B265","v":0},{"$f":"'mod2 6b'!C265","v":0},{"$f":"'mod2 6b'!D265","v":0},{"$f":"'mod2 6b'!E265","v":0},{"$f":"LOOKUP($F$10,'mod2 6b'!$F$10:$Q$10,'mod2 6b'!F265:Q265)","v":0},{"$f":"LOOKUP($G$10,'mod2 6b'!$F$10:$Q$10,'mod2 6b'!F265:Q265)","v":0},{"$f":"'mod2 6b'!R265","v":0},{"$f":"'mod2 6b'!S265","v":0},{"$f":"'mod2 6b'!T265","v":0}]
[{"$f":"'mod2 6b'!A266","v":23},{"$f":"'mod2 6b'!B266","v":0},{"$f":"'mod2 6b'!C266","v":0},{"$f":"'mod2 6b'!D266","v":0},{"$f":"'mod2 6b'!E266","v":0},{"$f":"LOOKUP($F$10,'mod2 6b'!$F$10:$Q$10,'mod2 6b'!F266:Q266)","v":0},{"$f":"LOOKUP($G$10,'mod2 6b'!$F$10:$Q$10,'mod2 6b'!F266:Q266)","v":0},{"$f":"'mod2 6b'!R266","v":0},{"$f":"'mod2 6b'!S266","v":0},{"$f":"'mod2 6b'!T266","v":0}]
[{"$f":"'mod2 6b'!A267","v":23},{"$f":"'mod2 6b'!B267","v":0},{"$f":"'mod2 6b'!C267","v":0},{"$f":"'mod2 6b'!D267","v":0},{"$f":"'mod2 6b'!E267","v":0},{"$f":"LOOKUP($F$10,'mod2 6b'!$F$10:$Q$10,'mod2 6b'!F267:Q267)","v":0},{"$f":"LOOKUP($G$10,'mod2 6b'!$F$10:$Q$10,'mod2 6b'!F267:Q267)","v":0},{"$f":"'mod2 6b'!R267","v":0},{"$f":"'mod2 6b'!S267","v":0},{"$f":"'mod2 6b'!T267","v":0}]
[{"$f":"'mod2 6b'!A268","v":23},{"$f":"'mod2 6b'!B268","v":0},{"$f":"'mod2 6b'!C268","v":0},{"$f":"'mod2 6b'!D268","v":0},{"$f":"'mod2 6b'!E268","v":0},{"$f":"LOOKUP($F$10,'mod2 6b'!$F$10:$Q$10,'mod2 6b'!F268:Q268)","v":0},{"$f":"LOOKUP($G$10,'mod2 6b'!$F$10:$Q$10,'mod2 6b'!F268:Q268)","v":0},{"$f":"'mod2 6b'!R268","v":0},{"$f":"'mod2 6b'!S268","v":0},{"$f":"'mod2 6b'!T268","v":0}]
[{"$f":"'mod2 6b'!A269","v":23},{"$f":"'mod2 6b'!B269","v":0},{"$f":"'mod2 6b'!C269","v":0},{"$f":"'mod2 6b'!D269","v":0},{"$f":"'mod2 6b'!E269","v":0},{"$f":"LOOKUP($F$10,'mod2 6b'!$F$10:$Q$10,'mod2 6b'!F269:Q269)","v":0},{"$f":"LOOKUP($G$10,'mod2 6b'!$F$10:$Q$10,'mod2 6b'!F269:Q269)","v":0},{"$f":"'mod2 6b'!R269","v":0},{"$f":"'mod2 6b'!S269","v":0},{"$f":"'mod2 6b'!T269","v":0}]
[{"$f":"'mod2 6b'!A270","v":24},{"$f":"'mod2 6b'!B270","v":0},{"$f":"'mod2 6b'!C270","v":"COMUNICAÇÕES"},{"$f":"'mod2 6b'!D270","v":0},{"$f":"'mod2 6b'!E270","v":0},{"$f":"LOOKUP($F$10,'mod2 6b'!$F$10:$Q$10,'mod2 6b'!F270:Q270)","v":0},{"$f":"LOOKUP($G$10,'mod2 6b'!$F$10:$Q$10,'mod2 6b'!F270:Q270)","v":0},{"$f":"'mod2 6b'!R270","v":0},{"$f":"'mod2 6b'!S270","v":0},{"$f":"'mod2 6b'!T270","v":0}]
[{"$f":"'mod2 6b'!A271","v":24},{"$f":"'mod2 6b'!B271","v":721},{"$f":"'mod2 6b'!C271","v":"Comunicações Postais"},{"$f":"'mod2 6b'!D271","v":0},{"$f":"'mod2 6b'!E271","v":0},{"$f":"LOOKUP($F$10,'mod2 6b'!$F$10:$Q$10,'mod2 6b'!F271:Q271)","v":0},{"$f":"LOOKUP($G$10,'mod2 6b'!$F$10:$Q$10,'mod2 6b'!F271:Q271)","v":0},{"$f":"'mod2 6b'!R271","v":0},{"$f":"'mod2 6b'!S271","v":0},{"$f":"'mod2 6b'!T271","v":0}]
[{"$f":"'mod2 6b'!A272","v":24},{"$f":"'mod2 6b'!B272","v":722},{"$f":"'mod2 6b'!C272","v":"Telecomunicações"},{"$f":"'mod2 6b'!D272","v":0},{"$f":"'mod2 6b'!E272","v":0},{"$f":"LOOKUP($F$10,'mod2 6b'!$F$10:$Q$10,'mod2 6b'!F272:Q272)","v":0},{"$f":"LOOKUP($G$10,'mod2 6b'!$F$10:$Q$10,'mod2 6b'!F272:Q272)","v":0},{"$f":"'mod2 6b'!R272","v":0},{"$f":"'mod2 6b'!S272","v":0},{"$f":"'mod2 6b'!T272","v":0}]
[{"$f":"'mod2 6b'!A273","v":24},{"$f":"'mod2 6b'!B273","v":0},{"$f":"'mod2 6b'!C273","v":0},{"$f":"'mod2 6b'!D273","v":0},{"$f":"'mod2 6b'!E273","v":0},{"$f":"LOOKUP($F$10,'mod2 6b'!$F$10:$Q$10,'mod2 6b'!F273:Q273)","v":0},{"$f":"LOOKUP($G$10,'mod2 6b'!$F$10:$Q$10,'mod2 6b'!F273:Q273)","v":0},{"$f":"'mod2 6b'!R273","v":0},{"$f":"'mod2 6b'!S273","v":0},{"$f":"'mod2 6b'!T273","v":0}]
[{"$f":"'mod2 6b'!A274","v":24},{"$f":"'mod2 6b'!B274","v":0},{"$f":"'mod2 6b'!C274","v":0},{"$f":"'mod2 6b'!D274","v":0},{"$f":"'mod2 6b'!E274","v":0},{"$f":"LOOKUP($F$10,'mod2 6b'!$F$10:$Q$10,'mod2 6b'!F274:Q274)","v":0},{"$f":"LOOKUP($G$10,'mod2 6b'!$F$10:$Q$10,'mod2 6b'!F274:Q274)","v":0},{"$f":"'mod2 6b'!R274","v":0},{"$f":"'mod2 6b'!S274","v":0},{"$f":"'mod2 6b'!T274","v":0}]
[{"$f":"'mod2 6b'!A275","v":24},{"$f":"'mod2 6b'!B275","v":0},{"$f":"'mod2 6b'!C275","v":0},{"$f":"'mod2 6b'!D275","v":0},{"$f":"'mod2 6b'!E275","v":0},{"$f":"LOOKUP($F$10,'mod2 6b'!$F$10:$Q$10,'mod2 6b'!F275:Q275)","v":0},{"$f":"LOOKUP($G$10,'mod2 6b'!$F$10:$Q$10,'mod2 6b'!F275:Q275)","v":0},{"$f":"'mod2 6b'!R275","v":0},{"$f":"'mod2 6b'!S275","v":0},{"$f":"'mod2 6b'!T275","v":0}]
[{"$f":"'mod2 6b'!A276","v":24},{"$f":"'mod2 6b'!B276","v":0},{"$f":"'mod2 6b'!C276","v":0},{"$f":"'mod2 6b'!D276","v":0},{"$f":"'mod2 6b'!E276","v":0},{"$f":"LOOKUP($F$10,'mod2 6b'!$F$10:$Q$10,'mod2 6b'!F276:Q276)","v":0},{"$f":"LOOKUP($G$10,'mod2 6b'!$F$10:$Q$10,'mod2 6b'!F276:Q276)","v":0},{"$f":"'mod2 6b'!R276","v":0},{"$f":"'mod2 6b'!S276","v":0},{"$f":"'mod2 6b'!T276","v":0}]
[{"$f":"'mod2 6b'!A277","v":24},{"$f":"'mod2 6b'!B277","v":0},{"$f":"'mod2 6b'!C277","v":0},{"$f":"'mod2 6b'!D277","v":0},{"$f":"'mod2 6b'!E277","v":0},{"$f":"LOOKUP($F$10,'mod2 6b'!$F$10:$Q$10,'mod2 6b'!F277:Q277)","v":0},{"$f":"LOOKUP($G$10,'mod2 6b'!$F$10:$Q$10,'mod2 6b'!F277:Q277)","v":0},{"$f":"'mod2 6b'!R277","v":0},{"$f":"'mod2 6b'!S277","v":0},{"$f":"'mod2 6b'!T277","v":0}]
[{"$f":"'mod2 6b'!A278","v":25},{"$f":"'mod2 6b'!B278","v":0},{"$f":"'mod2 6b'!C278","v":"ENERGIA"},{"$f":"'mod2 6b'!D278","v":0},{"$f":"'mod2 6b'!E278","v":0},{"$f":"LOOKUP($F$10,'mod2 6b'!$F$10:$Q$10,'mod2 6b'!F278:Q278)","v":0},{"$f":"LOOKUP($G$10,'mod2 6b'!$F$10:$Q$10,'mod2 6b'!F278:Q278)","v":0},{"$f":"'mod2 6b'!R278","v":0},{"$f":"'mod2 6b'!S278","v":0},{"$f":"'mod2 6b'!T278","v":0}]
[{"$f":"'mod2 6b'!A279","v":25},{"$f":"'mod2 6b'!B279","v":751},{"$f":"'mod2 6b'!C279","v":"Conservação de Energia"},{"$f":"'mod2 6b'!D279","v":0},{"$f":"'mod2 6b'!E279","v":0},{"$f":"LOOKUP($F$10,'mod2 6b'!$F$10:$Q$10,'mod2 6b'!F279:Q279)","v":0},{"$f":"LOOKUP($G$10,'mod2 6b'!$F$10:$Q$10,'mod2 6b'!F279:Q279)","v":0},{"$f":"'mod2 6b'!R279","v":0},{"$f":"'mod2 6b'!S279","v":0},{"$f":"'mod2 6b'!T279","v":0}]
[{"$f":"'mod2 6b'!A280","v":25},{"$f":"'mod2 6b'!B280","v":753},{"$f":"'mod2 6b'!C280","v":"Energia Elétrica"},{"$f":"'mod2 6b'!D280","v":0},{"$f":"'mod2 6b'!E280","v":0},{"$f":"LOOKUP($F$10,'mod2 6b'!$F$10:$Q$10,'mod2 6b'!F280:Q280)","v":0},{"$f":"LOOKUP($G$10,'mod2 6b'!$F$10:$Q$10,'mod2 6b'!F280:Q280)","v":0},{"$f":"'mod2 6b'!R280","v":0},{"$f":"'mod2 6b'!S280","v":0},{"$f":"'mod2 6b'!T280","v":0}]
[{"$f":"'mod2 6b'!A281","v":25},{"$f":"'mod2 6b'!B281","v":753},{"$f":"'mod2 6b'!C281","v":"Petróleo"},{"$f":"'mod2 6b'!D281","v":0},{"$f":"'mod2 6b'!E281","v":0},{"$f":"LOOKUP($F$10,'mod2 6b'!$F$10:$Q$10,'mod2 6b'!F281:Q281)","v":0},{"$f":"LOOKUP($G$10,'mod2 6b'!$F$10:$Q$10,'mod2 6b'!F281:Q281)","v":0},{"$f":"'mod2 6b'!R281","v":0},{"$f":"'mod2 6b'!S281","v":0},{"$f":"'mod2 6b'!T281","v":0}]
[{"$f":"'mod2 6b'!A282","v":25},{"$f":"'mod2 6b'!B282","v":754},{"$f":"'mod2 6b'!C282","v":"Álcool"},{"$f":"'mod2 6b'!D282","v":0},{"$f":"'mod2 6b'!E282","v":0},{"$f":"LOOKUP($F$10,'mod2 6b'!$F$10:$Q$10,'mod2 6b'!F282:Q282)","v":0},{"$f":"LOOKUP($G$10,'mod2 6b'!$F$10:$Q$10,'mod2 6b'!F282:Q282)","v":0},{"$f":"'mod2 6b'!R282","v":0},{"$f":"'mod2 6b'!S282","v":0},{"$f":"'mod2 6b'!T282","v":0}]
[{"$f":"'mod2 6b'!A283","v":25},{"$f":"'mod2 6b'!B283","v":0},{"$f":"'mod2 6b'!C283","v":0},{"$f":"'mod2 6b'!D283","v":0},{"$f":"'mod2 6b'!E283","v":0},{"$f":"LOOKUP($F$10,'mod2 6b'!$F$10:$Q$10,'mod2 6b'!F283:Q283)","v":0},{"$f":"LOOKUP($G$10,'mod2 6b'!$F$10:$Q$10,'mod2 6b'!F283:Q283)","v":0},{"$f":"'mod2 6b'!R283","v":0},{"$f":"'mod2 6b'!S283","v":0},{"$f":"'mod2 6b'!T283","v":0}]
[{"$f":"'mod2 6b'!A284","v":25},{"$f":"'mod2 6b'!B284","v":0},{"$f":"'mod2 6b'!C284","v":0},{"$f":"'mod2 6b'!D284","v":0},{"$f":"'mod2 6b'!E284","v":0},{"$f":"LOOKUP($F$10,'mod2 6b'!$F$10:$Q$10,'mod2 6b'!F284:Q284)","v":0},{"$f":"LOOKUP($G$10,'mod2 6b'!$F$10:$Q$10,'mod2 6b'!F284:Q284)","v":0},{"$f":"'mod2 6b'!R284","v":0},{"$f":"'mod2 6b'!S284","v":0},{"$f":"'mod2 6b'!T284","v":0}]
[{"$f":"'mod2 6b'!A285","v":25},{"$f":"'mod2 6b'!B285","v":0},{"$f":"'mod2 6b'!C285","v":0},{"$f":"'mod2 6b'!D285","v":0},{"$f":"'mod2 6b'!E285","v":0},{"$f":"LOOKUP($F$10,'mod2 6b'!$F$10:$Q$10,'mod2 6b'!F285:Q285)","v":0},{"$f":"LOOKUP($G$10,'mod2 6b'!$F$10:$Q$10,'mod2 6b'!F285:Q285)","v":0},{"$f":"'mod2 6b'!R285","v":0},{"$f":"'mod2 6b'!S285","v":0},{"$f":"'mod2 6b'!T285","v":0}]
[{"$f":"'mod2 6b'!A286","v":25},{"$f":"'mod2 6b'!B286","v":0},{"$f":"'mod2 6b'!C286","v":0},{"$f":"'mod2 6b'!D286","v":0},{"$f":"'mod2 6b'!E286","v":0},{"$f":"LOOKUP($F$10,'mod2 6b'!$F$10:$Q$10,'mod2 6b'!F286:Q286)","v":0},{"$f":"LOOKUP($G$10,'mod2 6b'!$F$10:$Q$10,'mod2 6b'!F286:Q286)","v":0},{"$f":"'mod2 6b'!R286","v":0},{"$f":"'mod2 6b'!S286","v":0},{"$f":"'mod2 6b'!T286","v":0}]
[{"$f":"'mod2 6b'!A287","v":25},{"$f":"'mod2 6b'!B287","v":0},{"$f":"'mod2 6b'!C287","v":0},{"$f":"'mod2 6b'!D287","v":0},{"$f":"'mod2 6b'!E287","v":0},{"$f":"LOOKUP($F$10,'mod2 6b'!$F$10:$Q$10,'mod2 6b'!F287:Q287)","v":0},{"$f":"LOOKUP($G$10,'mod2 6b'!$F$10:$Q$10,'mod2 6b'!F287:Q287)","v":0},{"$f":"'mod2 6b'!R287","v":0},{"$f":"'mod2 6b'!S287","v":0},{"$f":"'mod2 6b'!T287","v":0}]
[{"$f":"'mod2 6b'!A288","v":26},{"$f":"'mod2 6b'!B288","v":0},{"$f":"'mod2 6b'!C288","v":"TRANSPORTE"},{"$f":"'mod2 6b'!D288","v":0},{"$f":"'mod2 6b'!E288","v":0},{"$f":"LOOKUP($F$10,'mod2 6b'!$F$10:$Q$10,'mod2 6b'!F288:Q288)","v":0},{"$f":"LOOKUP($G$10,'mod2 6b'!$F$10:$Q$10,'mod2 6b'!F288:Q288)","v":0},{"$f":"'mod2 6b'!R288","v":0},{"$f":"'mod2 6b'!S288","v":0},{"$f":"'mod2 6b'!T288","v":0}]
[{"$f":"'mod2 6b'!A289","v":26},{"$f":"'mod2 6b'!B289","v":781},{"$f":"'mod2 6b'!C289","v":"Transporte Aéreo"},{"$f":"'mod2 6b'!D289","v":0},{"$f":"'mod2 6b'!E289","v":0},{"$f":"LOOKUP($F$10,'mod2 6b'!$F$10:$Q$10,'mod2 6b'!F289:Q289)","v":0},{"$f":"LOOKUP($G$10,'mod2 6b'!$F$10:$Q$10,'mod2 6b'!F289:Q289)","v":0},{"$f":"'mod2 6b'!R289","v":0},{"$f":"'mod2 6b'!S289","v":0},{"$f":"'mod2 6b'!T289","v":0}]
[{"$f":"'mod2 6b'!A290","v":26},{"$f":"'mod2 6b'!B290","v":782},{"$f":"'mod2 6b'!C290","v":"Transporte Rodoviário"},{"$f":"'mod2 6b'!D290","v":0},{"$f":"'mod2 6b'!E290","v":0},{"$f":"LOOKUP($F$10,'mod2 6b'!$F$10:$Q$10,'mod2 6b'!F290:Q290)","v":0},{"$f":"LOOKUP($G$10,'mod2 6b'!$F$10:$Q$10,'mod2 6b'!F290:Q290)","v":0},{"$f":"'mod2 6b'!R290","v":0},{"$f":"'mod2 6b'!S290","v":0},{"$f":"'mod2 6b'!T290","v":0}]
[{"$f":"'mod2 6b'!A291","v":26},{"$f":"'mod2 6b'!B291","v":783},{"$f":"'mod2 6b'!C291","v":"Transporte Ferroviário"},{"$f":"'mod2 6b'!D291","v":0},{"$f":"'mod2 6b'!E291","v":0},{"$f":"LOOKUP($F$10,'mod2 6b'!$F$10:$Q$10,'mod2 6b'!F291:Q291)","v":0},{"$f":"LOOKUP($G$10,'mod2 6b'!$F$10:$Q$10,'mod2 6b'!F291:Q291)","v":0},{"$f":"'mod2 6b'!R291","v":0},{"$f":"'mod2 6b'!S291","v":0},{"$f":"'mod2 6b'!T291","v":0}]
[{"$f":"'mod2 6b'!A292","v":26},{"$f":"'mod2 6b'!B292","v":784},{"$f":"'mod2 6b'!C292","v":"Transporte Hidroviário"},{"$f":"'mod2 6b'!D292","v":0},{"$f":"'mod2 6b'!E292","v":0},{"$f":"LOOKUP($F$10,'mod2 6b'!$F$10:$Q$10,'mod2 6b'!F292:Q292)","v":0},{"$f":"LOOKUP($G$10,'mod2 6b'!$F$10:$Q$10,'mod2 6b'!F292:Q292)","v":0},{"$f":"'mod2 6b'!R292","v":0},{"$f":"'mod2 6b'!S292","v":0},{"$f":"'mod2 6b'!T292","v":0}]
[{"$f":"'mod2 6b'!A293","v":26},{"$f":"'mod2 6b'!B293","v":785},{"$f":"'mod2 6b'!C293","v":"Transporte Especiais"},{"$f":"'mod2 6b'!D293","v":0},{"$f":"'mod2 6b'!E293","v":0},{"$f":"LOOKUP($F$10,'mod2 6b'!$F$10:$Q$10,'mod2 6b'!F293:Q293)","v":0},{"$f":"LOOKUP($G$10,'mod2 6b'!$F$10:$Q$10,'mod2 6b'!F293:Q293)","v":0},{"$f":"'mod2 6b'!R293","v":0},{"$f":"'mod2 6b'!S293","v":0},{"$f":"'mod2 6b'!T293","v":0}]
[{"$f":"'mod2 6b'!A294","v":26},{"$f":"'mod2 6b'!B294","v":0},{"$f":"'mod2 6b'!C294","v":0},{"$f":"'mod2 6b'!D294","v":0},{"$f":"'mod2 6b'!E294","v":0},{"$f":"LOOKUP($F$10,'mod2 6b'!$F$10:$Q$10,'mod2 6b'!F294:Q294)","v":0},{"$f":"LOOKUP($G$10,'mod2 6b'!$F$10:$Q$10,'mod2 6b'!F294:Q294)","v":0},{"$f":"'mod2 6b'!R294","v":0},{"$f":"'mod2 6b'!S294","v":0},{"$f":"'mod2 6b'!T294","v":0}]
[{"$f":"'mod2 6b'!A295","v":26},{"$f":"'mod2 6b'!B295","v":0},{"$f":"'mod2 6b'!C295","v":0},{"$f":"'mod2 6b'!D295","v":0},{"$f":"'mod2 6b'!E295","v":0},{"$f":"LOOKUP($F$10,'mod2 6b'!$F$10:$Q$10,'mod2 6b'!F295:Q295)","v":0},{"$f":"LOOKUP($G$10,'mod2 6b'!$F$10:$Q$10,'mod2 6b'!F295:Q295)","v":0},{"$f":"'mod2 6b'!R295","v":0},{"$f":"'mod2 6b'!S295","v":0},{"$f":"'mod2 6b'!T295","v":0}]
[{"$f":"'mod2 6b'!A296","v":26},{"$f":"'mod2 6b'!B296","v":0},{"$f":"'mod2 6b'!C296","v":0},{"$f":"'mod2 6b'!D296","v":0},{"$f":"'mod2 6b'!E296","v":0},{"$f":"LOOKUP($F$10,'mod2 6b'!$F$10:$Q$10,'mod2 6b'!F296:Q296)","v":0},{"$f":"LOOKUP($G$10,'mod2 6b'!$F$10:$Q$10,'mod2 6b'!F296:Q296)","v":0},{"$f":"'mod2 6b'!R296","v":0},{"$f":"'mod2 6b'!S296","v":0},{"$f":"'mod2 6b'!T296","v":0}]
[{"$f":"'mod2 6b'!A297","v":26},{"$f":"'mod2 6b'!B297","v":0},{"$f":"'mod2 6b'!C297","v":0},{"$f":"'mod2 6b'!D297","v":0},{"$f":"'mod2 6b'!E297","v":0},{"$f":"LOOKUP($F$10,'mod2 6b'!$F$10:$Q$10,'mod2 6b'!F297:Q297)","v":0},{"$f":"LOOKUP($G$10,'mod2 6b'!$F$10:$Q$10,'mod2 6b'!F297:Q297)","v":0},{"$f":"'mod2 6b'!R297","v":0},{"$f":"'mod2 6b'!S297","v":0},{"$f":"'mod2 6b'!T297","v":0}]
[{"$f":"'mod2 6b'!A298","v":26},{"$f":"'mod2 6b'!B298","v":0},{"$f":"'mod2 6b'!C298","v":0},{"$f":"'mod2 6b'!D298","v":0},{"$f":"'mod2 6b'!E298","v":0},{"$f":"LOOKUP($F$10,'mod2 6b'!$F$10:$Q$10,'mod2 6b'!F298:Q298)","v":0},{"$f":"LOOKUP($G$10,'mod2 6b'!$F$10:$Q$10,'mod2 6b'!F298:Q298)","v":0},{"$f":"'mod2 6b'!R298","v":0},{"$f":"'mod2 6b'!S298","v":0},{"$f":"'mod2 6b'!T298","v":0}]
[{"$f":"'mod2 6b'!A299","v":27},{"$f":"'mod2 6b'!B299","v":0},{"$f":"'mod2 6b'!C299","v":"DESPORTO E LAZER"},{"$f":"'mod2 6b'!D299","v":0},{"$f":"'mod2 6b'!E299","v":0},{"$f":"LOOKUP($F$10,'mod2 6b'!$F$10:$Q$10,'mod2 6b'!F299:Q299)","v":0},{"$f":"LOOKUP($G$10,'mod2 6b'!$F$10:$Q$10,'mod2 6b'!F299:Q299)","v":0},{"$f":"'mod2 6b'!R299","v":0},{"$f":"'mod2 6b'!S299","v":0},{"$f":"'mod2 6b'!T299","v":0}]
[{"$f":"'mod2 6b'!A300","v":27},{"$f":"'mod2 6b'!B300","v":811},{"$f":"'mod2 6b'!C300","v":"Desporto de Rendimento"},{"$f":"'mod2 6b'!D300","v":0},{"$f":"'mod2 6b'!E300","v":0},{"$f":"LOOKUP($F$10,'mod2 6b'!$F$10:$Q$10,'mod2 6b'!F300:Q300)","v":0},{"$f":"LOOKUP($G$10,'mod2 6b'!$F$10:$Q$10,'mod2 6b'!F300:Q300)","v":0},{"$f":"'mod2 6b'!R300","v":0},{"$f":"'mod2 6b'!S300","v":0},{"$f":"'mod2 6b'!T300","v":0}]
[{"$f":"'mod2 6b'!A301","v":27},{"$f":"'mod2 6b'!B301","v":812},{"$f":"'mod2 6b'!C301","v":"Desporto Comunitário"},{"$f":"'mod2 6b'!D301","v":0},{"$f":"'mod2 6b'!E301","v":0},{"$f":"LOOKUP($F$10,'mod2 6b'!$F$10:$Q$10,'mod2 6b'!F301:Q301)","v":0},{"$f":"LOOKUP($G$10,'mod2 6b'!$F$10:$Q$10,'mod2 6b'!F301:Q301)","v":0},{"$f":"'mod2 6b'!R301","v":0},{"$f":"'mod2 6b'!S301","v":0},{"$f":"'mod2 6b'!T301","v":0}]
[{"$f":"'mod2 6b'!A302","v":27},{"$f":"'mod2 6b'!B302","v":813},{"$f":"'mod2 6b'!C302","v":"Lazer"},{"$f":"'mod2 6b'!D302","v":0},{"$f":"'mod2 6b'!E302","v":0},{"$f":"LOOKUP($F$10,'mod2 6b'!$F$10:$Q$10,'mod2 6b'!F302:Q302)","v":0},{"$f":"LOOKUP($G$10,'mod2 6b'!$F$10:$Q$10,'mod2 6b'!F302:Q302)","v":0},{"$f":"'mod2 6b'!R302","v":0},{"$f":"'mod2 6b'!S302","v":0},{"$f":"'mod2 6b'!T302","v":0}]
[{"$f":"'mod2 6b'!A303","v":0},{"$f":"'mod2 6b'!B303","v":0},{"$f":"'mod2 6b'!C303","v":0},{"$f":"'mod2 6b'!D303","v":0},{"$f":"'mod2 6b'!E303","v":0},{"$f":"LOOKUP($F$10,'mod2 6b'!$F$10:$Q$10,'mod2 6b'!F303:Q303)","v":0},{"$f":"LOOKUP($G$10,'mod2 6b'!$F$10:$Q$10,'mod2 6b'!F303:Q303)","v":0},{"$f":"'mod2 6b'!R303","v":0},{"$f":"'mod2 6b'!S303","v":0},{"$f":"'mod2 6b'!T303","v":0}]
[{"$f":"'mod2 6b'!A304","v":0},{"$f":"'mod2 6b'!B304","v":0},{"$f":"'mod2 6b'!C304","v":0},{"$f":"'mod2 6b'!D304","v":0},{"$f":"'mod2 6b'!E304","v":0},{"$f":"LOOKUP($F$10,'mod2 6b'!$F$10:$Q$10,'mod2 6b'!F304:Q304)","v":0},{"$f":"LOOKUP($G$10,'mod2 6b'!$F$10:$Q$10,'mod2 6b'!F304:Q304)","v":0},{"$f":"'mod2 6b'!R304","v":0},{"$f":"'mod2 6b'!S304","v":0},{"$f":"'mod2 6b'!T304","v":0}]
[{"$f":"'mod2 6b'!A305","v":0},{"$f":"'mod2 6b'!B305","v":0},{"$f":"'mod2 6b'!C305","v":0},{"$f":"'mod2 6b'!D305","v":0},{"$f":"'mod2 6b'!E305","v":0},{"$f":"LOOKUP($F$10,'mod2 6b'!$F$10:$Q$10,'mod2 6b'!F305:Q305)","v":0},{"$f":"LOOKUP($G$10,'mod2 6b'!$F$10:$Q$10,'mod2 6b'!F305:Q305)","v":0},{"$f":"'mod2 6b'!R305","v":0},{"$f":"'mod2 6b'!S305","v":0},{"$f":"'mod2 6b'!T305","v":0}]
[{"$f":"'mod2 6b'!A306","v":0},{"$f":"'mod2 6b'!B306","v":0},{"$f":"'mod2 6b'!C306","v":0},{"$f":"'mod2 6b'!D306","v":0},{"$f":"'mod2 6b'!E306","v":0},{"$f":"LOOKUP($F$10,'mod2 6b'!$F$10:$Q$10,'mod2 6b'!F306:Q306)","v":0},{"$f":"LOOKUP($G$10,'mod2 6b'!$F$10:$Q$10,'mod2 6b'!F306:Q306)","v":0},{"$f":"'mod2 6b'!R306","v":0},{"$f":"'mod2 6b'!S306","v":0},{"$f":"'mod2 6b'!T306","v":0}]
[{"$f":"'mod2 6b'!A307","v":0},{"$f":"'mod2 6b'!B307","v":0},{"$f":"'mod2 6b'!C307","v":0},{"$f":"'mod2 6b'!D307","v":0},{"$f":"'mod2 6b'!E307","v":0},{"$f":"LOOKUP($F$10,'mod2 6b'!$F$10:$Q$10,'mod2 6b'!F307:Q307)","v":0},{"$f":"LOOKUP($G$10,'mod2 6b'!$F$10:$Q$10,'mod2 6b'!F307:Q307)","v":0},{"$f":"'mod2 6b'!R307","v":0},{"$f":"'mod2 6b'!S307","v":0},{"$f":"'mod2 6b'!T307","v":0}]
[{"$f":"'mod2 6b'!A308","v":28},{"$f":"'mod2 6b'!B308","v":0},{"$f":"'mod2 6b'!C308","v":"ENCARGOS ESPECIAIS"},{"$f":"'mod2 6b'!D308","v":0},{"$f":"'mod2 6b'!E308","v":0},{"$f":"LOOKUP($F$10,'mod2 6b'!$F$10:$Q$10,'mod2 6b'!F308:Q308)","v":0},{"$f":"LOOKUP($G$10,'mod2 6b'!$F$10:$Q$10,'mod2 6b'!F308:Q308)","v":0},{"$f":"'mod2 6b'!R308","v":0},{"$f":"'mod2 6b'!S308","v":0},{"$f":"'mod2 6b'!T308","v":0}]
[{"$f":"'mod2 6b'!A309","v":28},{"$f":"'mod2 6b'!B309","v":841},{"$f":"'mod2 6b'!C309","v":"Refinanciamento da Dívida Interna"},{"$f":"'mod2 6b'!D309","v":0},{"$f":"'mod2 6b'!E309","v":0},{"$f":"LOOKUP($F$10,'mod2 6b'!$F$10:$Q$10,'mod2 6b'!F309:Q309)","v":0},{"$f":"LOOKUP($G$10,'mod2 6b'!$F$10:$Q$10,'mod2 6b'!F309:Q309)","v":0},{"$f":"'mod2 6b'!R309","v":0},{"$f":"'mod2 6b'!S309","v":0},{"$f":"'mod2 6b'!T309","v":0}]
[{"$f":"'mod2 6b'!A310","v":28},{"$f":"'mod2 6b'!B310","v":842},{"$f":"'mod2 6b'!C310","v":"Refinanciamento da Dívida Externa"},{"$f":"'mod2 6b'!D310","v":0},{"$f":"'mod2 6b'!E310","v":0},{"$f":"LOOKUP($F$10,'mod2 6b'!$F$10:$Q$10,'mod2 6b'!F310:Q310)","v":0},{"$f":"LOOKUP($G$10,'mod2 6b'!$F$10:$Q$10,'mod2 6b'!F310:Q310)","v":0},{"$f":"'mod2 6b'!R310","v":0},{"$f":"'mod2 6b'!S310","v":0},{"$f":"'mod2 6b'!T310","v":0}]
[{"$f":"'mod2 6b'!A311","v":28},{"$f":"'mod2 6b'!B311","v":843},{"$f":"'mod2 6b'!C311","v":"Serviço da Dívida Interna"},{"$f":"'mod2 6b'!D311","v":0},{"$f":"'mod2 6b'!E311","v":0},{"$f":"LOOKUP($F$10,'mod2 6b'!$F$10:$Q$10,'mod2 6b'!F311:Q311)","v":0},{"$f":"LOOKUP($G$10,'mod2 6b'!$F$10:$Q$10,'mod2 6b'!F311:Q311)","v":0},{"$f":"'mod2 6b'!R311","v":0},{"$f":"'mod2 6b'!S311","v":0},{"$f":"'mod2 6b'!T311","v":0}]
[{"$f":"'mod2 6b'!A312","v":28},{"$f":"'mod2 6b'!B312","v":844},{"$f":"'mod2 6b'!C312","v":"Serviço da Dívida Externa"},{"$f":"'mod2 6b'!D312","v":0},{"$f":"'mod2 6b'!E312","v":0},{"$f":"LOOKUP($F$10,'mod2 6b'!$F$10:$Q$10,'mod2 6b'!F312:Q312)","v":0},{"$f":"LOOKUP($G$10,'mod2 6b'!$F$10:$Q$10,'mod2 6b'!F312:Q312)","v":0},{"$f":"'mod2 6b'!R312","v":0},{"$f":"'mod2 6b'!S312","v":0},{"$f":"'mod2 6b'!T312","v":0}]
[{"$f":"'mod2 6b'!A313","v":28},{"$f":"'mod2 6b'!B313","v":845},{"$f":"'mod2 6b'!C313","v":"Transferências"},{"$f":"'mod2 6b'!D313","v":0},{"$f":"'mod2 6b'!E313","v":0},{"$f":"LOOKUP($F$10,'mod2 6b'!$F$10:$Q$10,'mod2 6b'!F313:Q313)","v":0},{"$f":"LOOKUP($G$10,'mod2 6b'!$F$10:$Q$10,'mod2 6b'!F313:Q313)","v":0},{"$f":"'mod2 6b'!R313","v":0},{"$f":"'mod2 6b'!S313","v":0},{"$f":"'mod2 6b'!T313","v":0}]
[{"$f":"'mod2 6b'!A314","v":28},{"$f":"'mod2 6b'!B314","v":846},{"$f":"'mod2 6b'!C314","v":"Outros Encargos Especiais"},{"$f":"'mod2 6b'!D314","v":0},{"$f":"'mod2 6b'!E314","v":0},{"$f":"LOOKUP($F$10,'mod2 6b'!$F$10:$Q$10,'mod2 6b'!F314:Q314)","v":0},{"$f":"LOOKUP($G$10,'mod2 6b'!$F$10:$Q$10,'mod2 6b'!F314:Q314)","v":0},{"$f":"'mod2 6b'!R314","v":0},{"$f":"'mod2 6b'!S314","v":0},{"$f":"'mod2 6b'!T314","v":0}]
[{"$f":"'mod2 6b'!A315","v":0},{"$f":"'mod2 6b'!B315","v":0},{"$f":"'mod2 6b'!C315","v":0},{"$f":"'mod2 6b'!D315","v":0},{"$f":"'mod2 6b'!E315","v":0},{"$f":"LOOKUP($F$10,'mod2 6b'!$F$10:$Q$10,'mod2 6b'!F315:Q315)","v":0},{"$f":"LOOKUP($G$10,'mod2 6b'!$F$10:$Q$10,'mod2 6b'!F315:Q315)","v":0},{"$f":"'mod2 6b'!R315","v":0},{"$f":"'mod2 6b'!S315","v":0},{"$f":"'mod2 6b'!T315","v":0}]
[{"$f":"'mod2 6b'!A316","v":0},{"$f":"'mod2 6b'!B316","v":0},{"$f":"'mod2 6b'!C316","v":0},{"$f":"'mod2 6b'!D316","v":0},{"$f":"'mod2 6b'!E316","v":0},{"$f":"LOOKUP($F$10,'mod2 6b'!$F$10:$Q$10,'mod2 6b'!F316:Q316)","v":0},{"$f":"LOOKUP($G$10,'mod2 6b'!$F$10:$Q$10,'mod2 6b'!F316:Q316)","v":0},{"$f":"'mod2 6b'!R316","v":0},{"$f":"'mod2 6b'!S316","v":0},{"$f":"'mod2 6b'!T316","v":0}]
[{"$f":"'mod2 6b'!A317","v":0},{"$f":"'mod2 6b'!B317","v":0},{"$f":"'mod2 6b'!C317","v":0},{"$f":"'mod2 6b'!D317","v":0},{"$f":"'mod2 6b'!E317","v":0},{"$f":"LOOKUP($F$10,'mod2 6b'!$F$10:$Q$10,'mod2 6b'!F317:Q317)","v":0},{"$f":"LOOKUP($G$10,'mod2 6b'!$F$10:$Q$10,'mod2 6b'!F317:Q317)","v":0},{"$f":"'mod2 6b'!R317","v":0},{"$f":"'mod2 6b'!S317","v":0},{"$f":"'mod2 6b'!T317","v":0}]
[{"$f":"'mod2 6b'!A318","v":0},{"$f":"'mod2 6b'!B318","v":0},{"$f":"'mod2 6b'!C318","v":0},{"$f":"'mod2 6b'!D318","v":0},{"$f":"'mod2 6b'!E318","v":0},{"$f":"LOOKUP($F$10,'mod2 6b'!$F$10:$Q$10,'mod2 6b'!F318:Q318)","v":0},{"$f":"LOOKUP($G$10,'mod2 6b'!$F$10:$Q$10,'mod2 6b'!F318:Q318)","v":0},{"$f":"'mod2 6b'!R318","v":0},{"$f":"'mod2 6b'!S318","v":0},{"$f":"'mod2 6b'!T318","v":0}]
[{"$f":"'mod2 6b'!A319","v":0},{"$f":"'mod2 6b'!B319","v":0},{"$f":"'mod2 6b'!C319","v":0},{"$f":"'mod2 6b'!D319","v":0},{"$f":"'mod2 6b'!E319","v":0},{"$f":"LOOKUP($F$10,'mod2 6b'!$F$10:$Q$10,'mod2 6b'!F319:Q319)","v":0},{"$f":"LOOKUP($G$10,'mod2 6b'!$F$10:$Q$10,'mod2 6b'!F319:Q319)","v":0},{"$f":"'mod2 6b'!R319","v":0},{"$f":"'mod2 6b'!S319","v":0},{"$f":"'mod2 6b'!T319","v":0}]
[null,null,{"$f":"'mod2 6b'!C320","v":"TOTAL"},20123396,20123396,3166854.51,3166854.51,{"$f":"'mod2 6b'!R320","v":7606374.5},{"$f":"'mod2 6b'!S320","v":7606374.5},{"$f":"J107","v":12517021.5}]
[]
[]
[]
[]
[null,null,"Prof.Dr.Isnard de A.Câmara Neto",null,"Jessé César Pinto",null,null,"Josimere dos Santos Costa"]
[null,null,"Diretor Presidente",null,"                          CRC:1SP 297323/O-5",null,null,null,"Controlador Interno"]

{"sheet":"mod 3","index":9,"n_rows":33,"n_cols":17,"rows_kept":33,"cut":false,"hidden":false,"merged":[[22,0,22,1],[23,0,23,1],[24,0,24,1],[25,0,25,1],[31,12,31,14],[26,0,26,1],[27,0,27,6],[31,0,31,1],[31,6,31,8],[9,7,10,7],[9,10,10,10],[9,11,10,11],[21,0,21,1],[14,0,14,1],[15,0,15,1],[11,0,11,1],[12,0,12,1],[13,0,13,1],[16,0,16,1],[20,0,20,1],[19,0,19,1],[17,0,17,1],[18,0,18,1],[9,16,10,16],[9,13,10,13],[9,6,10,6],[0,0,0,16],[1,0,1,16],[2,0,2,16],[9,0,10,1],[9,2,10,2],[9,3,10,3],[9,14,10,14],[9,15,10,15],[9,8,10,8],[9,9,10,9],[9,12,10,12],[9,4,10,4],[9,5,10,5]]}
["RECEITA CORRENTE LÍQUIDA"]
["(Artigo 2º, Inciso IV e 53, Inciso I da LC. 101/00)"]
["ADMINISTRAÇÃO DIRETA, INDIRETA E FUNDACIONAL "]
[]
[{"$f":"'mod1 6b'!A5","v":"MUNICÍPIO DE TAUBATÉ  -  FUNDAÇÃO UNIVERSITÁRIA DE TAUBATÉ"}]
[]
["3º BIMESTRE 2014"]
[]
[null,null,null,null,null,null,null,null,null,null,null,null,null,null,null,null,"Valores expressos em R$"]
["RECEITAS CORRENTES",null,"JULHO","AGOSTO","SETEMBRO","OUTUBRO","NOVEMBRO","DEZEMBRO","JANEIRO","FEVEREIRO","MARÇO","ABRIL","MAIO","MÊS DE REF. JUNHO","TOTAL","Apuração Bimestre Anterior","Previsão atualizadada Exercício"]
[]
["ADMINISTRAÇÃO DIRETA ",null,null,null,null,null,null,null,null,null,null,null,null,null,{"$f":"SUM(C12:N12)","v":0}]
["ADMINISTRAÇÃO INDIRETA ",null,{"$f":"SUM(C14:C16)","v":1237217.6399999999},{"$f":"SUM(D14:D16)","v":1686694.77},1345375.19,1149847.93,2592067.96,2536896.86,1287907.3700000001,1551252.46,493064.69,1197980.45,730985.39,637497.17000000004,{"$f":"SUM(C13:N13)","v":16446787.879999999},24440113.670000002,18723396]
["    Autarquias",null,null,null,null,null,null,null,null,null,null,null,null,null,0]
["    Fundações Públicas",null,1237217.6399999999,1686694.77,1345375.19,1149847.93,2592067.96,2536896.86,1287907.3700000001,1551252.46,493064.69,1197980.45,730985.39,637497.17000000004,{"$f":"SUM(C13:N13)","v":16446787.879999999},24440113.670000002,18723396]
["    Empresas Estatais Dependentes",null,null,null,null,null,null,null,null,null,null,null,null,null,0]
["    Subtotal",null,{"$f":"C12+C13","v":1237217.6399999999},{"$f":"D12+D13","v":1686694.77},1345375.19,1149847.93,2592067.96,2536896.86,1287907.3700000001,1551252.46,493064.69,1197980.45,730985.39,637497.17000000004,16446787.879999999,24440113.670000002,18723396]
["( - ) DEDUÇÕES "]
["    Receitas Transf. Intrag. Adm. Dir/Ind.e Fund.",null,null,null,null,null,null,null,null,null,null,null,null,null,0]
["    Contrib. Serv. Reg.Própr.Previdência",null,null,null,null,null,null,null,null,null,null,null,null,null,0]
["    Compensação Financ.entre Reg. Prev.",null,null,null,null,null,null,null,null,null,null,null,null,null,0]
["    FUNDEF ",null,null,null,null,null,null,null,null,null,null,null,null,null,0]
["    Anulação de Restos a Pagar",null,null,null,null,null,null,null,null,null,null,null,null,null,0]
["    Outras",null,null,null,null,null,null,null,null,null,null,null,null,null,0]
["    ",null,null,null,null,null,null,null,null,null,null,null,null,null,0]
["    Subtotal",null,{"$f":"SUM(C19:C25)","v":0},{"$f":"SUM(D19:D25)","v":0},0,0,0,0,0,0,0,0,0,0,0,0,0]
["RECEITA CORRENTE LÍQUIDA",null,{"$f":"C17-C26","v":1237217.6399999999},{"$f":"D17-D26","v":1686694.77},1345375.19,1149847.93,2592067.96,2536896.86,1287907.3700000001,1551252.46,493064.69,1197980.45,730985.39,637497.17000000004,16446787.879999999,{"$f":"P17-P26","v":24440113.670000002},{"$f":"Q17-Q26","v":18723396}]
[]
[]
[]
[]
["Prof.Dr.Isnard de A. Câmara Neto",null,null,null,null,null,"Jessé César Pinto",null,null,null,null,null,"Josimere dos Santos Costa"]
["            Diretor Presidente",null,null,null,null,null,null,"CRC: 1SP 297323/O-5",null,null,null,null,null,"Controlador Interno"]

{"sheet":"mod 4","index":10,"n_rows":50,"n_cols":8,"rows_kept":50,"cut":false,"hidden":false,"merged":[[18,6,18,7],[16,6,16,7],[19,6,19,7],[15,6,15,7],[0,0,0,7],[1,0,1,7],[2,0,2,7],[9,0,10,1],[9,6,10,7],[9,2,9,3],[9,4,9,5],[11,6,11,7],[12,6,12,7],[13,6,13,7],[14,6,14,7],[17,6,17,7],[48,2,48,3],[48,5,48,7],[36,0,36,1],[37,0,37,1],[43,0,43,1],[42,6,42,7],[39,4,39,5],[43,2,43,3],[43,6,43,7],[41,0,41,1],[42,0,42,1],[42,4,42,5],[43,4,43,5],[42,2,42,3],[41,6,41,7],[39,0,39,1],[40,0,40,1],[39,6,39,7],[40,6,40,7],[41,2,41,3],[38,0,38,1],[39,2,39,3],[40,2,40,3],[40,4,40,5],[38,2,38,3],[38,4,38,5],[37,6,37,7],[35,6,35,7],[33,6,33,7],[34,0,34,1],[35,0,35,1],[36,4,36,5],[37,4,37,5],[33,4,33,5],[34,4,34,5],[35,4,35,5],[33,0,33,1],[35,2,35,3],[36,2,36,3],[37,2,37,3],[34,2,34,3],[33,2,33,3],[32,0,32,1],[31,2,31,3],[36,6,36,7],[21,7,22,7],[41,4,41,5],[21,0,22,0],[38,6,38,7],[32,4,32,5],[32,6,32,7],[21,1,21,2],[21,3,21,4],[21,5,21,6],[31,6,31,7],[32,2,32,3],[31,4,31,5],[34,6,34,7]]}
["DEMONSTRATIVO DAS RECEITAS E DESPESAS PREVIDENCIÁRIAS"]
["(Artigos 53, Inciso II e 50, Inciso IV da LC. 101/00)"]
["ADMINISTRAÇÃO DIRETA, INDIRETA E FUNDACIONAL "]
[]
[{"$f":"'mod1 6b'!A5","v":"MUNICÍPIO DE TAUBATÉ  -  FUNDAÇÃO UNIVERSITÁRIA DE TAUBATÉ"}]
[]
["3º BIMESTRE 2014"]
[]
[null,null,null,null,null,null,null,"Valores expressos em R$"]
["I –RECEITAS PREVIDENCIÁRIAS",null,"Previsão Anual",null,"Receitas Realizadas",null,"Saldo a Realizar"]
[null,null,"Inicial","Atualizada","No Bimestre","Até o Bimestre"]
["Contribuições Patronais",null,null,null,null,null,{"$f":"D12-F12","v":0}]
["Contribuições dos Servidores Ativos",null,null,null,null,null,0]
["Contribuições dos Servidores Inativos",null,null,null,null,null,0]
["Contribuições dos Pensionistas",null,null,null,null,null,0]
["Receitas Patrimoniais",null,null,null,null,null,0]
["Compensações Previdenciárias",null,null,null,null,null,0]
["Alienações de Bens",null,null,null,null,null,0]
["Outras",null,null,null,null,null,0]
["Total",null,{"$f":"SUM(C12:C19)","v":0},{"$f":"SUM(D12:D19)","v":0},{"$f":"SUM(E12:E19)","v":0},{"$f":"SUM(F12:F19)","v":0},0]
[]
["II –DESPESAS PREVIDENCIÁRIAS","Dotação Anual",null,"Empenhadas",null,"Liquidadas",null,"Saldo a Empenhar"]
[null,"Inicial","Atualizada","No  Bimestre","Até o Bimestre","No  Bimestre","Até o Bimestre"]
["Inativos ",null,null,null,null,null,null,{"$f":"C24-E24","v":0}]
["Pensionistas",null,null,null,null,null,null,{"$f":"C25-E25","v":0}]
["Outros Benefícios",null,null,null,null,null,null,{"$f":"C26-E26","v":0}]
["Outras Despesas",null,null,null,null,null,null,{"$f":"C27-E27","v":0}]
["Total",{"$f":"SUM(B24:B27)","v":0},0,0,0,0,0,{"$f":"C28-E28","v":0}]
[]
["III - RESULTADO",{"$f":"C20-B28","v":0},{"$f":"D20-C28","v":0},{"$f":"E20-D28","v":0},{"$f":"F20-E28","v":0},{"$f":"E20-F28","v":0},{"$f":"F20-G28","v":0}]
[]
["IV –DISPONIBILIDADES FINANCEIRAS",null,"R$",null,null,null,"R$"]
[]
["Receitas",null,{"$f":"C35+C36","v":0},null,"Despesas  ",null,{"$f":"SUM(G35:G37)","v":0}]
["  Orçamentárias",null,null,null,"  Orçamentárias pagas "]
["  Extra-orçamentárias",null,null,null,"  Extra-orçamentárias"]
[null,null,null,null,"  Inscrição Restos a pagar*"]
[]
["Saldo do exercício anterior",null,{"$f":"C40+C41+C42","v":0},null,"Saldo Atual",null,{"$f":"SUM(G40:G42)","v":0}]
["  Caixa",null,null,null,"  Caixa"]
["  Bancos Conta Movimento",null,null,null,"  Bancos Conta Movimento"]
["  Aplicações Financeiras",null,null,null,"  Aplicações Financeiras"]
[]
["Total Geral",null,{"$f":"C34+C39","v":0},null,null,null,{"$f":"G34+G39","v":0}]
[" * Relativo ao último bimestre"]
[]
[]
[]
["      Prof.Dr.Isnard de A.Câmara Neto",null,"Jessé César Pinto",null,null,"Josimere dos Santos Costa"]
["Diretor Presidente",null,"                           CRC:1SP297323/O-5",null,null,null,"Controlador Interno"]

{"sheet":"mod 5","index":11,"n_rows":93,"n_cols":8,"rows_kept":93,"cut":false,"hidden":false,"merged":[[53,6,53,7],[91,2,91,4],[91,6,91,7],[47,6,47,7],[48,6,48,7],[50,6,50,7],[52,6,52,7],[50,4,50,5],[52,4,52,5],[53,4,53,5],[48,4,48,5],[47,4,47,5],[25,7,26,7],[29,0,29,1],[30,0,30,1],[31,0,31,1],[32,0,32,1],[27,0,27,1],[28,0,28,1],[25,0,26,1],[0,0,0,7],[1,0,1,7],[2,0,2,7],[9,2,9,4],[9,5,9,6],[9,0,10,1],[9,7,10,7],[17,0,17,1],[44,4,44,5],[44,6,44,7],[11,0,11,1],[25,2,25,4],[25,5,25,6],[23,0,23,1],[12,0,12,1],[13,0,13,1],[14,0,14,1],[16,0,16,1],[15,0,15,1],[18,0,18,1],[19,0,19,1],[22,0,22,1],[20,0,20,1],[45,6,45,7],[45,4,45,5],[46,6,46,7],[43,1,43,3],[33,0,33,1],[46,4,46,5],[38,0,38,1],[40,0,40,1],[37,0,37,1],[43,4,43,7],[39,0,39,1],[34,0,34,1],[35,0,35,1],[36,0,36,1]]}
["RESULTADOS NOMINAL E PRIMÁRIO"]
["(Art.  53, Inciso III da LC. 101/00)"]
["ADMINISTRAÇÃO DIRETA, INDIRETA E FUNDACIONAL "]
[]
[]
[{"$f":"'mod1 6b'!A5","v":"MUNICÍPIO DE TAUBATÉ  -  FUNDAÇÃO UNIVERSITÁRIA DE TAUBATÉ"}]
["3º BIMESTRE DE 2014"]
[]
["RESULTADO PRIMÁRIO",null,null,null,null,null,null,"Valores expressos em R$"]
["RECEITAS FISCAIS",null,"Previsão Atualizada",null,null,"Realização",null,"Período Exercício Anterior"]
[null,null,"Anual","Do Bimestre","Até o Bimestre","No Bimestre","Até o Bimestre"]
["Receitas Correntes",null,{"$f":"'mod1 1b'!C11","v":18723396},3120566.02,{"$f":"'mod1 1b'!F11+0.02","v":9361698.0199999996},3120566,{"$f":"'mod1 1b'!G11","v":5898687.5300000012},15505016.699999999]
["Receitas de Capital",null,{"$f":"'mod1 1b'!C28","v":0},{"$f":"'mod1 1b'!D28","v":0},{"$f":"'mod1 1b'!F28","v":0},{"$f":"'mod1 1b'!E28","v":0},{"$f":"'mod1 1b'!G28","v":0}]
["     Subtotal:",null,{"$f":"C12+C13","v":18723396},3120566.02,{"$f":"E12+E13","v":9361698.0199999996},{"$f":"F12+F13","v":3120566},{"$f":"G12+G13","v":5898687.5300000012},{"$f":"H12","v":15505016.699999999}]
["(-) Deduções"]
["     Receitas de Operações de Crédito ",null,{"$f":"'mod1 1b'!C29","v":0},{"$f":"'mod1 1b'!D29","v":0},{"$f":"'mod1 1b'!F29","v":0},{"$f":"'mod1 1b'!E29","v":0},{"$f":"'mod1 1b'!G29","v":0}]
[]
[]
["     Rendas de aplicações Financeiras"]
["    Amortização de Empréstimos",null,{"$f":"'mod1 1b'!C33","v":0},{"$f":"'mod1 1b'!D33","v":0},{"$f":"'mod1 1b'!F33","v":0},{"$f":"'mod1 1b'!E33","v":0},{"$f":"'mod1 1b'!G33","v":0}]
["    Receitas de alienações de ativos"]
[]
["     Subtotal",null,{"$f":"C16+C19+C20+C21","v":0},0,0,0,0,0]
["I - RECEITAS FISCAIS LÍQUIDAS",null,{"$f":"C14-C23","v":18723396},3120566.02,9361698.0199999996,3120566,5898687.5300000012,15505016.699999999]
[]
["DESPESAS FISCAIS",null,"Dotação Atualizada",null,null,"Despesas Liquidadas",null,"Período Exerc. Ant."]
[null,null,"Anual","Do Bimestre","Até o Bimestre","No Bimestre","Até o Bimestre"]
["Despesas Correntes",null,{"$f":"'mod1 1b'!C39","v":20083396},3347232.67,10041698.01,{"$f":"'mod1 1b'!E39","v":3164776.51},{"$f":"'mod1 1b'!G39","v":7599806.5},14557121.289999999]
["(-)  Juros e Encargos da Dívida",null,{"$f":"'mod1 1b'!C41+'mod1 1b'!C42","v":0},0,0,{"$f":"'mod1 1b'!E41+'mod1 1b'!E42","v":0},{"$f":"'mod1 1b'!G41+'mod1 1b'!G42","v":0}]
["      Subtotal",null,{"$f":"C28-C29","v":20083396},3347232.67,{"$f":"E28-E29","v":10041698.01},{"$f":"F28-F29","v":3164776.51},{"$f":"G28-G29","v":7599806.5},{"$f":"H28","v":14557121.289999999}]
["Despesas de Capital",null,{"$f":"'mod1 1b'!B44","v":40000},4490,4490,{"$f":"'mod1 1b'!E44","v":2078},{"$f":"'mod1 1b'!F44","v":6568},48559]
["(-) Deduções",null,0,0,0,{"$f":"SUM(F33:F36)","v":2078},{"$f":"SUM(G33:G36)","v":6568},{"$f":"H34+H33","v":48559}]
["     Amortização de Dívida",null,0,0,0,{"$f":"'mod1 1b'!E47","v":0},0,0]
["     INVESTIMENTO",null,40000,4490,4490,2078,6568,48559]
["     Aquisição de Título de Capital já Integralizado"]
[]
["      Subtotal",null,0,0,0,{"$f":"F32","v":2078},{"$f":"G32","v":6568},48559]
["II - RESERVA DE CONTINGÊNCIA",null,{"$f":"+'mod1 1b'!C51","v":0},0,0]
["III - DESPESAS FISCAIS LÍQUIDAS",null,{"$f":"C30+C37","v":20083396},3347232.67,10041698.01,3166854.51,7606374.5,{"$f":"H30+H37","v":14605680.289999999}]
["IV - SALDOS DE EXERCÍCIOS ANTERIORES"]
["IV -  RESULTADO PRIMÁRIO (I - III+II)",null,{"$f":"C24-C39+C38","v":-1360000},{"$f":"D24-D39+D38","v":-226666.64999999991},{"$f":"E24-E39+E38","v":-679999.99000000022},{"$f":"F24-F39","v":-46288.509999999776},{"$f":"G24+G40-G39","v":-1707686.9699999988},{"$f":"H24+H40-H39","v":899336.41000000015}]
[]
[]
["RESULTADO NOMINAL","SALDO",null,null,"RESULTADO NOMINAL"]
["ESPECIFICAÇÃO","Em 31/12 Exerc. Anterior (A)"," Bimestre Anterior (B)","Bimestre Atual (C)","No Bimestre (C-B)",null,"Janeiro até o Bimestre (C-A)"]
["I.   Dívida Consolidada",57605315.270000003,55247400.799999997,56380201.350000001]
["II.  Deduções:(*)",{"$f":"IF(B48+B49-B50<0,0,B48+B49-B50)","v":1810214.1600000001},{"$f":"IF(C48+C49-C50<0,0,C48+C49-C50)","v":1671087.8699999999},{"$f":"IF(D48+D49-D50<0,0,D48+D49-D50)","v":2740346.27}]
["        Ativo Disponível",495634.8,344210.18,108335.84]
["        Haveres Financeiros",1314579.3600000001,1326877.69,2632010.4300000002]
["        (-) Restos a Pagar Processados"]
["III. Dívida Consolidada Líquida (I-II)",{"$f":"IF(B47>B46,0,B46-B47)","v":55795101.109999999},{"$f":"IF(C47>C46,0,C46-C47)","v":53576312.93},{"$f":"IF(D47>D46,0,D46-D47)","v":53639855.079999998}]
["IV. Receita de Privatizações"]
["V.  Passivos Reconhecidos"]
["Dívida Fiscal Líquida (III + IV - V)",{"$f":"IF(B51=0,0,IF(B53>B52,0,(B51+B52-B53)))","v":55795101.109999999},{"$f":"IF(C51=0,0,IF(C53>C52,0,(C51+C52-C53)))","v":53576312.93},{"$f":"IF(D51=0,0,IF(D53>D52,0,(D51+D52-D53)))","v":53639855.079999998},{"$f":"D54-C54","v":63542.14999999851},null,{"$f":"D54-B54","v":-2155246.0300000012}]
["(*) Se o saldo for negativo (Restos a Pagar maior que Ativo Disponível + Haveres Financeiros) o sistema lançará o valor zero, pois não deve ser informado o valor negativo."]
["Justificativas (art. 9º, cc inciso I, §2º, art. 53 da LRF)"]
["textos"]
[]
[]
[]
[]
[]
[]
[]
[]
[]
[]
[]
[]
[]
[]
[]
[" "]
[" "]
[" "]
[" "]
[" "]
[" "]
[" "]
[" "]
[" "]
[" "]
[" "]
[" "]
[" "]
[" "]
[]
[]
[]
[]
[]
["Prof.Dr.Isnard de A.Câmara Neto",null,"Jessé César Pinto",null,null,null,"Josimere dos Santos Costa"]
["          Diretor Presidente",null,null,"CRC:1SP 297323/O-5",null,null,"                 Controlador Interno"]

{"sheet":"mod 6","index":12,"n_rows":55,"n_cols":10,"rows_kept":55,"cut":false,"hidden":false,"merged":[[9,9,11,9],[9,0,11,0],[9,2,9,3],[9,4,9,7],[10,4,10,5],[10,6,10,7],[9,8,11,8],[53,3,53,4],[53,7,53,8],[0,0,0,8],[1,0,1,8],[2,0,2,8],[9,1,11,1],[10,2,11,2],[10,3,11,3],[53,0,53,1]]}
["DEMONSTRATIVO DOS RESTOS A PAGAR"]
["(Artigo 53, Inciso V, da LC. 101/00)"]
["ADMINISTRAÇÃO DIRETA, INDIRETA E FUNDACIONAL"]
[]
[{"$f":"'mod1 6b'!A5","v":"MUNICÍPIO DE TAUBATÉ  -  FUNDAÇÃO UNIVERSITÁRIA DE TAUBATÉ"}]
[]
["3º BIMESTRE DE 2014"]
[]
[]
["PODER / ÓRGÃO / ENTIDADES","Saldo de Exercícios Anteriores","Inscrições",null,"Baixas",null,null,null,"Montante a Pagar","Disponibilidade Financeira"]
[null,null,"Processados","Não Processados","Cancelamentos",null,"Pagamentos"]
[null,null,null,null,"No Bimestre","Até o Bimestre","No Bimestre","Até o Bimestre"]
["PODER LEGISLATIVO"]
["   Câmara Municipal",null,null,null,null,null,null,null,{"$f":"B14+C14+D14-F14-H14","v":0}]
["PODER EXECUTIVO",0,{"$f":"C16+C17","v":0},0,0,0,34218.75,1361238.64,{"$f":"B15+C15+D15-F15-H15","v":-1361238.64},{"$f":"J16+J17","v":108335.84}]
["   Prefeitura Municipal",null,null,null,null,null,null,null,0]
["   Órgãos/Entidades",{"$f":"SUBTOTAL(9,B19:B48)","v":57605315.270000003},{"$f":"SUBTOTAL(9,C19:C48)","v":0},0,0,0,34218.75,1361238.64,56244076.630000003,{"$f":"SUBTOTAL(9,J19:J48)","v":108335.84}]
["órgãos",null,null,null,null,null,null,null,0]
["    Autarquia “X”",null,null,null,null,null,null,null,0]
["Fundação Universitária",57605315.270000003,0,0,0,0,34218.75,{"$f":"1327019.89+G20","v":1361238.64},{"$f":"B20+C20+D20-F20-H20","v":56244076.630000003},108335.84]
["    Empresa Púb. Dependente “Z”",null,null,null,null,null,null,null,0]
[null,null,null,null,null,null,null,null,0]
[null,null,null,null,null,null,null,null,0]
[null,null,null,null,null,null,null,null,0]
[null,null,null,null,null,null,null,null,0]
[null,null,null,null,null,null,null,null,0]
[null,null,null,null,null,null,null,null,0]
[null,null,null,null,null,null,null,null,0]
[null,null,null,null,null,null,null,null,0]
[null,null,null,null,null,null,null,null,0]
[null,null,null,null,null,null,null,null,0]
[null,null,null,null,null,null,null,null,0]
["           ",null,null,null,null,null,null,null,0]
["           ",null,null,null,null,null,null,null,0]
["           ",null,null,null,null,null,null,null,0]
["           ",null,null,null,null,null,null,null,0]
["           ",null,null,null,null,null,null,null,0]
["           ",null,null,null,null,null,null,null,0]
["           ",null,null,null,null,null,null,null,0]
["           ",null,null,null,null,null,null,null,0]
["           ",null,null,null,null,null,null,null,0]
["           ",null,null,null,null,null,null,null,0]
["           ",null,null,null,null,null,null,null,0]
["           ",null,null,null,null,null,null,null,0]
["           ",null,null,null,null,null,null,null,0]
["           ",null,null,null,null,null,null,null,0]
["           ",null,null,null,null,null,null,null,0]
["           ",null,null,null,null,null,null,null,0]
["TOTAL:",0,{"$f":"C14+C15","v":0},0,0,0,34218.75,1361238.64,-1361238.64,{"$f":"J14+J15","v":108335.84}]
[]
[]
[]
[]
["Prof.Dr.Isnard de A.Câmara Neto",null,null,"Jessé César Pinto",null,null,null,"Josimere dos Santos Costa"]
["              Diretor Presidente",null,null,"                            CRC:1SP 297323/O-5",null,null,null,"                       Controlador Interno"]

{"sheet":"mod 7","index":13,"n_rows":85,"n_cols":8,"rows_kept":85,"cut":false,"hidden":false,"merged":[[78,0,78,7],[83,2,83,3],[83,5,83,7],[0,0,1,7],[2,0,2,7],[3,0,3,7],[10,6,12,6],[10,7,12,7],[10,0,12,0],[10,1,10,2],[10,4,10,5],[11,5,12,5],[11,1,12,1],[11,2,12,2],[10,3,12,3],[11,4,12,4]]}
["COMPARATIVO DAS RECEITAS DE OPERAÇÕES DE CRÉDITO E                                               DESPESAS DE CAPITAL"]
[]
["(Artigos 53, §1º, Inciso I, e 38, §1º,  da LC. 101/00)"]
["ADMINISTRAÇÃO DIRETA, INDIRETA E FUNDACIONAL"]
[]
[]
[{"$f":"'mod1 6b'!A5","v":"MUNICÍPIO DE TAUBATÉ  -  FUNDAÇÃO UNIVERSITÁRIA DE TAUBATÉ"}]
[]
["ANO DE 2014"]
["                                                                ",null,"  ",null,null,null,null,"Valores expressos em R$"]
["PODER/ÓRGÃO/ENTIDADES","Operações de Crédito               (exceto ARO)",null,"Despesas de Capital Liquidadas (1)","Deduções das Despesas de Capital",null,"Despesas de Capital Líquidas (1) -[(2)+(3)]","Operações de Crédito do Exercício (exceto ARO)"]
[null,"Previsão Inicial","Previsão atualizada",null,"Inciso I, § 3º, artigo 32, LRF (2)","Inciso II, § 3º, artigo 32, LRF (3)"]
[]
["órgão"]
["Prefeitura Municipal",null,null,null,null,null,{"$f":"D15-E15-F15","v":0}]
["Autarquia “X”",null,null,null,null,null,{"$f":"D16-E16-F16","v":0}]
["Fundação Pública \"Y\"",null,null,null,null,null,0]
["Empresa Pública Dependente “Z”",null,null,null,null,null,0]
["  ",null,null,null,null,null,0]
["  ",null,null,null,null,null,0]
["  ",null,null,null,null,null,0]
["  ",null,null,null,null,null,0]
["  ",null,null,null,null,null,0]
["  ",null,null,null,null,null,0]
["  ",null,null,null,null,null,0]
["  ",null,null,null,null,null,0]
["  ",null,null,null,null,null,0]
["  ",null,null,null,null,null,0]
["  ",null,null,null,null,null,0]
["  ",null,null,null,null,null,0]
["  ",null,null,null,null,null,0]
["  ",null,null,null,null,null,0]
["  ",null,null,null,null,null,0]
["  ",null,null,null,null,null,0]
["  ",null,null,null,null,null,0]
["  ",null,null,null,null,null,0]
["  ",null,null,null,null,null,0]
["  ",null,null,null,null,null,0]
["  ",null,null,null,null,null,0]
["  ",null,null,null,null,null,0]
["  ",null,null,null,null,null,0]
["  ",null,null,null,null,null,0]
["  ",null,null,null,null,null,0]
["  ",null,null,null,null,null,0]
["  ",null,null,null,null,null,0]
["TOTAIS",{"$f":"SUBTOTAL(9,B15:B45)","v":0},{"$f":"SUBTOTAL(9,C15:C45)","v":0},0,0,0,0,0]
["Justificativas abaixo"]
["Apresentar medidas/justificativas  caso o montante das operações de crédito tenha  ultrapassado as despesas de capital líquidas. "]
[]
[]
[]
[]
[]
[]
[]
[]
[]
[]
[]
[]
[]
[]
[]
[]
[]
[]
[]
[]
[]
[]
[]
[]
[]
[]
[]
[]
[]
["  "]
[]
[]
[]
[]
[]
["Prof.Dr.Isnard de Albuquerque C Neto",null,"Fabio Augusto Ribeiro",null,null,"Josimere dos Santos Costa"]
["Diretor Presidente",null,"        Diretor Técnico Financeiro",null,null,null,"Controlador Interno"]

{"sheet":"mod 8","index":14,"n_rows":59,"n_cols":4,"rows_kept":59,"cut":false,"hidden":false,"merged":[[57,1,57,2],[0,0,2,3],[3,0,3,3],[4,0,4,3],[52,0,52,1],[56,1,56,2]]}
["DEMONSTRATIVO DAS PROJEÇÕES ATUARIAIS DO REGIME DE  PREVIDENCIA PRÓPRIA"]
[]
[]
["(Artigo 53, §1º, Inciso II da LC 101/00)"]
["ADMINISTRAÇÃO DIRETA, INDIRETA E FUNDACIONAL"]
[null," "]
[]
[{"$f":"'mod1 6b'!A5","v":"MUNICÍPIO DE TAUBATÉ  -  FUNDAÇÃO UNIVERSITÁRIA DE TAUBATÉ"}]
[]
["FUNDO/ENTIDADE:"]
[]
["ANO DE 2014"]
[]
[null,null,null,"Valores expressos em R$"]
["ANO","RECEITAS","DESPESAS","RESULTADO"]
[{"$f":"COM!AQ19+1","v":2013},null,null,{"$f":"B16-C16","v":0}]
[{"$f":"A16+1","v":2014},null,null,{"$f":"B17-C17","v":0}]
[{"$f":"A17+1","v":2015},null,null,0]
[2016,null,null,0]
[2017,null,null,0]
[2018,null,null,0]
[2019,null,null,0]
[2020,null,null,0]
[2021,null,null,0]
[2022,null,null,0]
[2023,null,null,0]
[2024,null,null,0]
[2025,null,null,0]
[2026,null,null,0]
[2027,null,null,0]
[2028,null,null,0]
[2029,null,null,0]
[2030,null,null,0]
[2031,null,null,0]
[2032,null,null,0]
[2033,null,null,0]
[2034,null,null,0]
[2035,null,null,0]
[2036,null,null,0]
[2037,null,null,0]
[2038,null,null,0]
[2039,null,null,0]
[2040,null,null,0]
[2041,null,null,0]
[2042,null,null,0]
[2043,null,null,0]
[2044,null,null,0]
[2045,null,null,0]
[2046,null,null,0]
[2047,null,null,0]
[]
[]
["Nome do Atuário Responsável / Registro nº:"]
[]
[]
[]
["___________________","________________________________",null,"_____________________"]
["Prof.Dr.Isnard de A.Câmara Neto","Fabio Augusto Ribeiro ",null,"Josimere dos Santos Costa"]
["Diretor Presidente","                                        Diretor Técnico Financeiro",null,"Controlador Interno"]

{"sheet":"mod 9","index":15,"n_rows":105,"n_cols":8,"rows_kept":105,"cut":false,"hidden":false,"merged":[[16,6,16,7],[13,6,13,7],[14,4,14,5],[14,6,14,7],[11,4,11,5],[11,6,11,7],[12,4,12,5],[12,6,12,7],[13,4,13,5],[103,2,103,3],[31,6,32,6],[31,3,31,5],[31,2,32,2],[18,4,18,5],[19,4,19,5],[19,6,19,7],[17,4,17,5],[17,6,17,7],[103,5,103,7],[24,4,24,5],[24,6,24,7],[26,4,26,5],[26,6,26,7],[25,4,25,5],[25,6,25,7],[20,6,20,7],[21,4,21,5],[21,6,21,7],[22,6,22,7],[23,4,23,5],[0,0,1,7],[2,0,2,7],[3,0,3,7],[100,0,100,7],[31,7,32,7],[31,0,32,0],[31,1,32,1],[22,4,22,5],[10,4,10,5],[10,6,10,7],[15,4,15,5],[15,6,15,7],[16,4,16,5],[18,6,18,7],[23,6,23,7],[20,4,20,5]]}
["                      DEMONSTRATIVO DA VARIAÇÃO PATRIMONIAL E APLICAÇÃO DE RECURSOS DECORRENTES DA ALIENAÇÃO DE ATIVOS"]
[]
["(Artigo 53, §1º, Inciso III, da LC 101/00)"]
["ADMINISTRAÇÃO DIRETA, INDIRETA E FUNDACIONAL "]
[]
[{"$f":"'mod1 6b'!A5","v":"MUNICÍPIO DE TAUBATÉ  -  FUNDAÇÃO UNIVERSITÁRIA DE TAUBATÉ"}]
[]
["ANO DE 2014"]
[]
[]
["I - VARIAÇÃO PATRIMONIAL"]
[null,null,null,null,null,null,"Valores expressos em R$"]
["1. Resultado da Execução do Orçamento",null,null,null,"ACRÉSCIMOS",null,"REDUÇÕES "]
["     Superávit"]
["     Déficit",null,null,null,null,null,0]
["2. Ativo Permanente",null,null,null,{"$f":"SUM(E17:F22)","v":0},null,{"$f":"SUM(G17:H22)","v":0}]
["    Bens Móveis",null,null,null,0]
["    Bens Imóveis",null,null,null,0,null,0]
["    Obras e Instalações"]
["    Títulos e Valores"]
["    Dívida Ativa"]
["    Outros Créditos"]
["3. Passivo Permanente",null,null,null,{"$f":"E24+E25","v":0},null,{"$f":"G24+G25","v":0}]
["    Empréstimos"]
["    Outras Dívidas (Previdência Própria , INSS, FGTS)",null,null,null,0,null,0]
["4. TOTAIS",null,null,null,{"$f":"E14+E16-E23","v":0},null,{"$f":"G15+G16-G23","v":0}]
["5. RESULTADO PATRIMONIAL",null,null,null,{"$f":"IF(E26>=G26,\"VARIAÇÃO POSITIVA =\",\"VARIAÇÃO NEGATIVA = \")","v":"VARIAÇÃO POSITIVA ="},null,{"$f":"IF(E26>=G26,E26-G26,G26-E26)","v":0}]
[]
[]
["II - APLICAÇÃO DE RECURSOS DA ALIENAÇÃO DE ATIVOS"]
[]
["PODERES/ÓRGÃO:","Saldo do Exercício Anterior (1)","Receita Realizada (2)","Aplicação dos Recursos",null,null,"Saldo  a aplicar (1)+(2)-(3)","Saldo C/C vinculada à aplicação"]
[null,null,null,"Despesa Empenhada","Despesa Liquidada","Despesa Paga (3)"]
["ADMINISTRAÇÃO DIRETA",{"$f":"B35+B36","v":0},{"$f":"C35+C36","v":0},{"$f":"D35+D36","v":0},{"$f":"E35+E36","v":0},{"$f":"F35+F36","v":0},{"$f":"B34+C34-F34","v":0}]
["Câmara Municipal",null,null,null,null,null,{"$f":"B35+C35-F35","v":0}]
["Prefeitura Municipal",null,null,null,null,null,0]
["ADMINISTRAÇÃO INDIRETA ",{"$f":"SUBTOTAL(9,B39:B68)","v":0},{"$f":"SUBTOTAL(9,C39:C68)","v":0},0,0,0,0,0]
["órgão"]
["Autarquia “X”",null,null,null,null,null,0]
["Fundação “Y”",null,null,null,null,null,0]
["Empresa Pública Dependente “Z”",null,null,null,null,null,0]
[" ",null,null,null,null,null,0]
[" ",null,null,null,null,null,0]
[null,null,null,null,null,null,0]
[null,null,null,null,null,null,0]
[null,null,null,null,null,null,0]
[null,null,null,null,null,null,0]
[null,null,null,null,null,null,0]
[null,null,null,null,null,null,0]
[null,null,null,null,null,null,0]
[null,null,null,null,null,null,0]
[null,null,null,null,null,null,0]
[null,null,null,null,null,null,0]
[null,null,null,null,null,null,0]
[null,null,null,null,null,null,0]
[null,null,null,null,null,null,0]
[null,null,null,null,null,null,0]
[null,null,null,null,null,null,0]
[null,null,null,null,null,null,0]
[null,null,null,null,null,null,0]
[null,null,null,null,null,null,0]
[null,null,null,null,null,null,0]
[null,null,null,null,null,null,0]
[null,null,null,null,null,null,0]
[null,null,null,null,null,null,0]
[null,null,null,null,null,null,0]
[null,null,null,null,null,null,0]
[null,null,null,null,null,null,0]
["TOTAL:",{"$f":"B34+B37","v":0},{"$f":"C34+C37","v":0},{"$f":"D34+D37","v":0},{"$f":"E34+E37","v":0},{"$f":"F34+F37","v":0},0,{"$f":"H34+H37","v":0}]
["texto"]
["Detalhar a origem e a aplicação dos recursos obtidos com a alienação de ativos para cada Órgão de cada Poder:"]
[" "," "]
[" "," "]
[" "," "]
[" "," "]
[" "," "]
[" "," "]
[" "," "]
[" "," "]
[" "," "]
[" "," "]
[" "," "]
[" "," "]
[" "," "]
[" "," "]
[" "," "]
[" "," "]
[" "," "]
[" "," "]
[" "," "]
[" "," "]
[" "," "]
[" "," "]
[" "," "]
[" "," "]
[" "," "]
[" "," "]
[" "," "]
[]
[]
[]
[]
[]
["Prof.Dr.Isnarde de A.Câmara Neto",null,"Fabio Augusto Ribeiro ",null,null,"Josimere dos Santos Costa"]
["Diretor Presidente",null,"                         Diretor Técnico Financeiro",null,null,null,"Controlador Interno"]

{"sheet":"mod10 3q","index":16,"n_rows":65498,"n_cols":22,"rows_kept":65498,"cut":false,"hidden":false,"merged":[[38,20,38,21],[37,18,37,19],[38,18,38,19],[39,18,39,19],[65497,20,65497,21],[28,20,28,21],[29,20,29,21],[26,20,26,21],[27,20,27,21],[30,20,30,21],[31,20,31,21],[32,20,32,21],[33,20,33,21],[34,20,34,21],[43,18,43,21],[30,18,30,19],[31,18,31,19],[32,18,32,19],[33,18,33,19],[34,18,34,19],[35,18,35,19],[36,18,36,19],[39,20,39,21],[35,20,35,21],[36,20,36,21],[37,20,37,21],[27,14,27,15],[26,16,26,17],[30,14,30,15],[28,16,28,17],[29,16,29,17],[25,14,25,15],[26,14,26,15],[37,16,37,17],[25,20,25,21],[19,16,19,18],[31,16,31,17],[27,16,27,17],[18,16,18,18],[30,16,30,17],[23,20,24,21],[19,13,19,14],[23,13,23,17],[16,19,17,20],[16,16,17,18],[26,18,26,19],[25,18,25,19],[27,18,27,19],[28,18,28,19],[29,18,29,19],[25,16,25,17],[10,20,10,21],[14,20,14,21],[14,16,14,19],[15,16,15,18],[19,19,19,20],[22,11,22,21],[23,12,24,12],[11,20,11,21],[13,20,13,21],[10,16,10,19],[11,16,11,19],[13,16,13,19],[18,19,18,20],[16,21,17,21],[23,18,24,19],[18,13,18,14],[23,11,24,11],[24,14,24,15],[24,16,24,17],[13,13,13,14],[10,13,10,14],[14,11,14,12],[17,13,17,14],[15,13,15,14],[11,13,11,14],[14,13,14,14],[16,13,16,14],[0,0,0,9],[1,0,1,9],[9,2,9,3],[11,11,11,12],[10,0,10,1],[10,2,10,3],[10,4,10,5],[9,8,9,9],[17,11,17,12],[15,11,15,12],[16,11,16,12],[9,6,9,7],[13,11,13,12],[10,8,10,9],[10,6,10,7],[9,4,9,5],[70,0,70,1],[70,3,70,5],[43,11,43,12],[38,14,38,15],[70,7,70,9],[34,16,34,17],[35,16,35,17],[29,14,29,15],[28,14,28,15],[32,14,32,15],[34,14,34,15],[31,14,31,15],[39,14,39,15],[35,14,35,15],[36,14,36,15],[37,14,37,15],[32,16,32,17],[33,16,33,17],[39,16,39,17],[36,16,36,17],[43,14,43,16],[38,16,38,17],[33,14,33,15]]}
["RELATÓRIO DE GESTÃO FISCAL"]
["(Artigos 54 e 55 da LC 101/00)"]
[]
[]
[{"$f":"'mod1 6b'!A5","v":"MUNICÍPIO DE TAUBATÉ  -  FUNDAÇÃO UNIVERSITÁRIA DE TAUBATÉ"}]
[{"$f":"\"PODER \"&COM!AC15","v":"PODER EXECUTIVO MUNICIPAL"}]
["1º QUADRIMESTRE 2014"]
[]
["I – COMPARATIVOS: ",null,null,null,null,null,null,null,null,"Valores expressos em R$",null,"III – DEMONSTRATIVOS:"]
[null,null,"Exercício Anterior",null,"1º Quadrimestre",null,"2º Quadrimestre",null,"3º Quadrimestre"]
["Receita Corrente Líquida    ",null,26064831.149999999,null,4530204.97,null,0,null,0,null,null,"Disponibilidades financ.em 31/12:",null,"R$",null,null,"Inscrição de Restos a Pagar:",null,null,null,"R$"]
[null,null,"R$","%","R$","%","R$","%","R$","%",null,"    Caixa",null,0,null,null,"     Processados",null,null,null,{"$f":"'mod 6'!C49","v":0}]
[null,null,null,null,3,4,7,8,11,12]
["Despesas Totais com Pessoal ",null,14710470.5,{"$f":"IF(C$11>0,IF(C14>0,C14/C$11*100,\"\"),\"\")","v":56.438004203223088},1867119.61,{"$f":"IF(E$11>0,IF(E14>0,E14/E$11*100,\"\"),\"\")","v":41.214903572012112},0,{"$f":"IF(G$11>0,IF(G14>0,G14/G$11*100,\"\"),\"\")","v":""},0,{"$f":"IF(I$11>0,IF(I14>0,I14/I$11*100,\"\"),\"\")","v":""},null,"    Bancos – C/Movimento",null,0,null,null,"     Não Processados",null,null,null,{"$f":"'mod 6'!D49","v":0}]
["Limite Prudencial 95% (par.ún.art.22 LRF)",null,null,null,{"$f":"IF(ISNUMBER(F14),0.95*0.54*E11,\"\")","v":2323995.1496099997},{"$f":"IF(ISNUMBER(E15),E15/E$11*100,\"\")","v":51.300000000000004},{"$f":"IF(ISNUMBER(H14),0.95*0.54*G11,\"\")","v":""},{"$f":"IF(ISNUMBER(G15),G15/G$11*100,\"\")","v":""},{"$f":"IF(ISNUMBER(J14),0.95*0.54*I11,\"\")","v":""},{"$f":"IF(ISNUMBER(I15),I15/I$11*100,\"\")","v":""},null,"    Bancos – C/Vinculadas",null,null,null,null,"Total da Inscrição:",null,null,null,{"$f":"IF(ISNUMBER(U12),U12+U14,\"\")","v":0}]
["Limite Legal (art. 20 LRF)",null,{"$f":"IF(ISNUMBER(C11),C$11*0.54,\"\")","v":14075008.821},{"$f":"IF(ISNUMBER(C16),C16/C11*100,\"\")","v":54},{"$f":"IF(ISNUMBER(E11),E$11*0.54,\"\")","v":2446310.6838000002},{"$f":"IF(ISNUMBER(E16),E16/E$11*100,\"\")","v":54},{"$f":"IF(ISNUMBER(G11),G$11*0.54,\"\")","v":0},{"$f":"IF(ISNUMBER(G16),G16/G$11*100,\"\")","v":{"$error":"#DIV/0!"}},{"$f":"IF(ISNUMBER(I11),I$11*0.54,\"\")","v":0},{"$f":"IF(ISNUMBER(I16),I16/I$11*100,\"\")","v":{"$error":"#DIV/0!"}},null,"    Aplicações Financeiras"]
["Excesso a Regularizar",null,{"$f":"IF(ISNUMBER(D14),IF(C14>C16,C14-C16,0),\"\")","v":635461.67899999954},{"$f":"IF(ISNUMBER(C17),C17/C11*100,\"\")","v":2.4380042032230835},{"$f":"IF(ISNUMBER(F14),IF(E14>E16,E14-E16,0),\"\")","v":0},{"$f":"IF(ISNUMBER(E17),E17/E$11*100,\"\")","v":0},{"$f":"IF(ISNUMBER(H14),IF(G14>G16,G14-G16,0),\"\")","v":""},{"$f":"IF(ISNUMBER(G17),G17/G$11*100,\"\")","v":""},{"$f":"IF(ISNUMBER(J14),IF(I14>I16,I14-I16,0),\"\")","v":""},{"$f":"IF(ISNUMBER(I17),I17/I$11*100,\"\")","v":""},null,"Subtotal",null,{"$f":"IF(ISNUMBER(N12),SUM(N12:O16),\"\")","v":0},null,null,"Serviços de Terceiros                       (art. 72 LC 101/00)",null,null,"R$",null,"% RCL"]
[null,null,null,null,null,null,null,null,null,null,null,"(-) Deduções:"]
["Despesa Líq. Inativos e Pensionistas",null,null,null,null,null,null,null,null,null,null,"Valores compromissados a pagar até 31/12 ",null,null,null,null,"Exercício anterior",null,null,null,null,{"$f":"IF(ISNUMBER($C$11),IF(ISNUMBER(T19),T19/$C$11*100,\"\"),\"\")","v":""}]
["Total da Despesa Líquida",null,27188559.57,{"$f":"IF(C$11>0,IF(C20>0,C20/C$11*100,\"\"),\"\")","v":104.31128217763268},4439519.99,{"$f":"IF(E$11>0,IF(E20>0,E20/E$11*100,\"\"),\"\")","v":97.998214637074142},0,{"$f":"IF(G$11>0,IF(G20>0,G20/G$11*100,\"\"),\"\")","v":""},0,{"$f":"IF(I$11>0,IF(I20>0,I20/I$11*100,\"\"),\"\")","v":""},null,"Total das Disponibilidades:",null,{"$f":"IF(ISNUMBER(N17),N17-N19,\"\")","v":0},null,null,"Exercício atual",null,null,null,null,{"$f":"IF(ISNUMBER($I$11),IF(ISNUMBER(T20),T20/$I$11*100,\"\"),\"\")","v":""}]
["Limite Legal (§1º,art.2ºLei Federal 9.717/98) ",null,3804252.51,{"$f":"IF(ISNUMBER(C21),C21/C11*100,\"\")","v":14.595346841523661},1381462.11,{"$f":"IF(ISNUMBER(E21),E21/E11*100,\"\")","v":30.49447252714484},{"$f":"IF(ISNUMBER(G11),G$11*0.12,\"\")","v":0},{"$f":"IF(ISNUMBER(G21),G21/G11*100,\"\")","v":{"$error":"#DIV/0!"}},{"$f":"IF(ISNUMBER(I11),I$11*0.12,\"\")","v":0},{"$f":"IF(ISNUMBER(I21),I21/I11*100,\"\")","v":{"$error":"#DIV/0!"}}]
["Excesso a Regularizar"]
[null,null," "," "," "," "," "," "," "," ",null,"Operações de Crédito por Antecipação de Receita Orçamentária  - ARO"]
["Dívida Consolidada Líquida",null,null,null,null,null,null,null,null,null,null,"Data  da Contratação","Valor Contratado R$","Data da Liquidação",null,null,null,null,"Liquidado no Exercício - R$",null,"Saldo  a Pagar"]
["Saldo devedor",null,55795101.109999999,{"$f":"IF(C$11>0,IF(ISNUMBER(C25),C25/C$11*100,\"\"),\"\")","v":214.06277596392562},53576312.93,{"$f":"IF(E$11>0,IF(ISNUMBER(E25),E25/E$11*100,\"\"),\"\")","v":1182.6465531867536},0,{"$f":"IF(G$11>0,IF(ISNUMBER(G25),G25/G$11*100,\"\"),\"\")","v":""},0,{"$f":"IF(I$11>0,IF(ISNUMBER(I25),I25/I$11*100,\"\"),\"\")","v":""},null,null,null,"Principal","Juros",null,"Encargos"]
["Limite Legal (arts.3º e 4º Res.nº 40 Senado)",null,38042525.060000002,{"$f":"IF(ISNUMBER(C11),120,\"\")","v":120},16681445.279999999,{"$f":"IF(ISNUMBER($D25),IF($D25>120,$D25-(($D25-120)/15),120),\"\")","v":207.79192423299725},{"$f":"IF(ISNUMBER(H26),H26*G11/100,\"\")","v":0},{"$f":"IF(ISNUMBER($D25),IF($D25>120,$D25-(($D25-120)/15),120),\"\")","v":207.79192423299725},{"$f":"IF(ISNUMBER(J26),J26*I11/100,\"\")","v":0},{"$f":"IF(ISNUMBER($D25),IF($D25>120,$D25-(($D25-120)/15),120),\"\")","v":207.79192423299725},null,"____/___/____",null,"____/___/____","____/___/____",null,"____/___/____"]
["Excesso a Regularizar",null,8458524.8000000007,{"$f":"IF(ISNUMBER(C27),C27/C$11*100,\"\")","v":32.451868770306618},19183365.670000002,{"$f":"IF(ISNUMBER(E27),E27/E$11*100,\"\")","v":423.4546956933828},{"$f":"IF(ISNUMBER(H25),IF(G25>G26,G25-G26,0),\"\")","v":""},{"$f":"IF(ISNUMBER(G27),G27/G$11*100,\"\")","v":""},{"$f":"IF(ISNUMBER(J25),IF(I25>I26,I25-I26,0),\"\")","v":""},{"$f":"IF(ISNUMBER(I27),I27/I$11*100,\"\")","v":""},null,"____/___/____",null,"____/___/____","____/___/____",null,"____/___/____"]
[null,null,null,null,null,null,null,null,null,null,null,"____/___/____",null,"____/___/____","____/___/____",null,"____/___/____"]
["Concessões de Garantias",null,null,null,null,null,null,null,null,null,null,"____/___/____",null,"____/___/____","____/___/____",null,"____/___/____"]
["Montante",null,null,{"$f":"IF(C$11>0,IF(C30>0,C30/C$11*100,\"\"),\"\")","v":""},null,{"$f":"IF(E$11>0,IF(E30>0,E30/E$11*100,\"\"),\"\")","v":""},null,{"$f":"IF(G$11>0,IF(G30>0,G30/G$11*100,\"\"),\"\")","v":""},null,{"$f":"IF(I$11>0,IF(I30>0,I30/I$11*100,\"\"),\"\")","v":""},null,"____/___/____",null,"____/___/____","____/___/____",null,"____/___/____"]
["Limite Legal (art. 9º Res.nº 43 Senado)",null,{"$f":"IF(ISNUMBER(C11),C$11*0.22,\"\")","v":5734262.8530000001},{"$f":"IF(ISNUMBER(C31),C31/C$11*100,\"\")","v":22.000000000000004},{"$f":"IF(ISNUMBER(E11),E$11*0.22,\"\")","v":996645.0933999999},{"$f":"IF(ISNUMBER(E31),E31/E$11*100,\"\")","v":22},{"$f":"IF(ISNUMBER(G11),G$11*0.22,\"\")","v":0},{"$f":"IF(ISNUMBER(G31),G31/G$11*100,\"\")","v":{"$error":"#DIV/0!"}},{"$f":"IF(ISNUMBER(I11),I$11*0.22,\"\")","v":0},{"$f":"IF(ISNUMBER(I31),I31/I$11*100,\"\")","v":{"$error":"#DIV/0!"}},null,"____/___/____",null,"____/___/____","____/___/____",null,"____/___/____"]
["Excesso a Regularizar",null,{"$f":"IF(ISNUMBER(D30),IF(C30>C31,C30-C31,0),\"\")","v":""},{"$f":"IF(ISNUMBER(C32),C32/C$11*100,\"\")","v":""},{"$f":"IF(ISNUMBER(F30),IF(E30>E31,E30-E31,0),\"\")","v":""},{"$f":"IF(ISNUMBER(E32),E32/E$11*100,\"\")","v":""},{"$f":"IF(ISNUMBER(H30),IF(G30>G31,G30-G31,0),\"\")","v":""},{"$f":"IF(ISNUMBER(G32),G32/G$11*100,\"\")","v":""},{"$f":"IF(ISNUMBER(J30),IF(I30>I31,I30-I31,0),\"\")","v":""},{"$f":"IF(ISNUMBER(I32),I32/I$11*100,\"\")","v":""},null,"____/___/____",null,"____/___/____","____/___/____",null,"____/___/____"]
[null,null,null,null,null,null,null,null,null,null,null,"____/___/____",null,"____/___/____","____/___/____",null,"____/___/____"]
["Operações de Crédito (exceto ARO)",null,null,null,null,null,null,null,null,null,null,"____/___/____",null,"____/___/____","____/___/____",null,"____/___/____"]
["Realizadas no período",null,null,{"$f":"IF(C$11>0,IF(C35>0,C35/C$11*100,\"\"),\"\")","v":""},null,{"$f":"IF(E$11>0,IF(E35>0,E35/E$11*100,\"\"),\"\")","v":""},null,{"$f":"IF(G$11>0,IF(G35>0,G35/G$11*100,\"\"),\"\")","v":""},null,{"$f":"IF(I$11>0,IF(I35>0,I35/I$11*100,\"\"),\"\")","v":""},null,"____/___/____",null,"____/___/____","____/___/____",null,"____/___/____"]
["Limite legal (inc. I, art. 7º Res.nº 43 Senado)",null,{"$f":"IF(ISNUMBER(C11),C$11*0.16,\"\")","v":4170372.9839999997},{"$f":"IF(ISNUMBER(C36),C36/C$11*100,\"\")","v":16},{"$f":"IF(ISNUMBER(E11),E$11*0.16,\"\")","v":724832.79519999993},{"$f":"IF(ISNUMBER(E36),E36/E$11*100,\"\")","v":16},{"$f":"IF(ISNUMBER(G11),G$11*0.16,\"\")","v":0},{"$f":"IF(ISNUMBER(G36),G36/G$11*100,\"\")","v":{"$error":"#DIV/0!"}},{"$f":"IF(ISNUMBER(I11),I$11*0.16,\"\")","v":0},{"$f":"IF(ISNUMBER(I36),I36/I$11*100,\"\")","v":{"$error":"#DIV/0!"}},null,"____/___/____",null,"____/___/____","____/___/____",null,"____/___/____"]
["Excesso a regularizar",null,{"$f":"IF(ISNUMBER(D35),IF(C35>C36,C35-C36,0),\"\")","v":""},{"$f":"IF(ISNUMBER(C37),C37/C$11*100,\"\")","v":""},{"$f":"IF(ISNUMBER(F35),IF(E35>E36,E35-E36,0),\"\")","v":""},{"$f":"IF(ISNUMBER(E37),E37/E$11*100,\"\")","v":""},{"$f":"IF(ISNUMBER(H35),IF(G35>G36,G35-G36,0),\"\")","v":""},{"$f":"IF(ISNUMBER(G37),G37/G$11*100,\"\")","v":""},{"$f":"IF(ISNUMBER(J35),IF(I35>I36,I35-I36,0),\"\")","v":""},{"$f":"IF(ISNUMBER(I37),I37/I$11*100,\"\")","v":""},null,"____/___/____",null,"____/___/____","____/___/____",null,"____/___/____"]
[null,null,null,null,null,null,null,null,null,null,null,"____/___/____",null,"____/___/____","____/___/____",null,"____/___/____"]
["Antecipação de Rec. Orçamentárias",null,null,null,null,null,null,null,null,null,null,"____/___/____",null,"____/___/____","____/___/____",null,"____/___/____"]
["Saldo devedor",null,null,{"$f":"IF(C$11>0,IF(C40>0,C40/C$11*100,\"\"),\"\")","v":""},null,{"$f":"IF(E$11>0,IF(E40>0,E40/E$11*100,\"\"),\"\")","v":""},null,{"$f":"IF(G$11>0,IF(G40>0,G40/G$11*100,\"\"),\"\")","v":""},null,{"$f":"IF(I$11>0,IF(I40>0,I40/I$11*100,\"\"),\"\")","v":""},null,"____/___/____",null,"____/___/____","____/___/____",null,"____/___/____"]
["Limite legal (art. 10 Res.nº 43 Senado)",null,{"$f":"IF(ISNUMBER(C11),C$11*0.07,\"\")","v":1824538.1805},{"$f":"IF(ISNUMBER(C41),C41/C$11*100,\"\")","v":7.0000000000000009},{"$f":"IF(ISNUMBER(E11),E$11*0.07,\"\")","v":317114.34789999999},{"$f":"IF(ISNUMBER(E41),E41/E$11*100,\"\")","v":7.0000000000000009},{"$f":"IF(ISNUMBER(G11),G$11*0.07,\"\")","v":0},{"$f":"IF(ISNUMBER(G41),G41/G$11*100,\"\")","v":{"$error":"#DIV/0!"}},{"$f":"IF(ISNUMBER(I11),I$11*0.07,\"\")","v":0},{"$f":"IF(ISNUMBER(I41),I41/I$11*100,\"\")","v":{"$error":"#DIV/0!"}}]
["Excesso a regularizar",null,{"$f":"IF(ISNUMBER(D40),IF(C40>C41,C40-C41,0),\"\")","v":""},{"$f":"IF(ISNUMBER(C42),C42/C$11*100,\"\")","v":""},{"$f":"IF(ISNUMBER(F40),IF(E40>E41,E40-E41,0),\"\")","v":""},{"$f":"IF(ISNUMBER(E42),E42/E$11*100,\"\")","v":""},{"$f":"IF(ISNUMBER(H40),IF(G40>G41,G40-G41,0),\"\")","v":""},{"$f":"IF(ISNUMBER(G42),G42/G$11*100,\"\")","v":""},{"$f":"IF(ISNUMBER(J40),IF(I40>I41,I40-I41,0),\"\")","v":""},{"$f":"IF(ISNUMBER(I42),I42/I$11*100,\"\")","v":""},null,"                                       Taubaté, 23 de maio de 2014"]
[]
["II –INDICAÇÃO DAS MEDIDAS ADOTADAS OU A ADOTAR  (caso ultrapasse os limites acima):",null,null,null,null,null,null,null,null,null,null,"Prof.Dr.Isnard de A.Câmara Neto",null,null,"Maria Antonia Cristina Carvalho",null,null,null,"Josimere dos Santos Costa"]
["textos"," "," "," "," "," "," "," "," "," ",null,null,null,null,null,"CRC:1SP 186687/O-8"]
[null,null,null,null,null,null,null,null,null,null,null,"                         Diretor Presidente",null,null,null,"CRC: 1SP 186687/O-8",null,null,null,"            Controlador Interno"]
[]
[]
[]
[]
[]
[]
[]
[]
[]
[]
[]
[]
[]
[]
[]
[]
[]
[]
[]
[null,null,null,null,null,null,null,null,null,null,null,"                  Diretor Presidente",null,null,"                            CRC:1SP 186687/O-8",null,null,null,null,"Controlador Interno"]
[]
["        Taubaté, 23 de maio de 2014"]
[]
[]
["      Prof.Dr.Isnard de A.Câmara Neto",null,null,"Maria Antonia Cristina Carvalho",null,null,null,"Josimere dos Santos Costa"]
["                      Diretor Presidente",null,null,null,"CRC:1SP 186687/O-8",null,null,null,"Controlador Interno"]
[]
[]
[]
[]
[]
[]
[]
[]
[]
[]
[]
[]
[]
[]
[]
[]
[]
[]
[]
[]
[]
[]
[]
[]
[]
[]
[]
[]
[]
[]
[]
[]
[]
[]
[]
[]
[]
[]
[]
[]
[]
[]
[]
[]
[]
[]
[]
[]
[]
[]
[]
[]
[]
[]
[]
[]
[]
[]
[]
[]
[]
[]
[]
[]
[]
[]
[]
[]
[]
[]
[]
[]
[]
[]
[]
[]
[]
[]
[]
[]
[]
[]
[]
[]
[]
[]
[]
[]
[]
[]
[]
[]
[]
[]
[]
[]
[]
[]
[]
[]
[]
[]
[]
[]
[]
[]
[]
[]
[]
[]
[]
[]
[]
[]
[]
[]
[]
[]
[]
[]
[]
[]
[]
[]
[]
[]
[]
[]
[]
[]
[]
[]
[]
[]
[]
[]
[]
[]
[]
[]
[]
[]
[]
[]
[]
[]
[]
[]
[]
[]
[]
[]
[]
[]
[]
[]
[]
[]
[]
[]
[]
[]
[]
[]
[]
[]
[]
[]
[]
[]
[]
[]
[]
[]
[]
[]
[]
[]
[]
[]
[]
[]
[]
[]
[]
[]
[]
[]
[]
[]
[]
[]
[]
[]
[]
[]
[]
[]
[]
[]
[]
[]
[]
[]
[]
[]
[]
[]
[]
[]
[]
[]
[]
[]
[]
[]
[]
[]
[]
[]
[]
[]
[]
[]
[]
[]
[]
[]
[]
[]
[]
[]
[]
[]
[]
[]
[]
[]
[]
[]
[]
[]
[]
[]
[]
[]
[]
[]
[]
[]
[]
[]
[]
[]
[]
[]
[]
[]
[]
[]
[]
[]
[]
[]
[]
[]
[]
[]
[]
[]
[]
[]
[]
[]
[]
[]
[]
[]
[]
[]
[]
[]
[]
[]
[]
[]
[]
[]
[]
[]
[]
[]
[]
[]
[]
[]
[]
[]
[]
[]
[]
[]
[]
[]
[]
[]
[]
[]
[]
[]
[]
[]
[]
[]
[]
[]
[]
[]
[]
[]
[]
[]
[]
[]
[]
[]
[]
[]
[]
[]
[]
[]
[]
[]
[]
[]
[]
[]
[]
[]
[]
[]
[]
[]
[]
[]
[]
[]
[]
[]
[]
[]
[]
[]
[]
[]
[]
[]
[]
[]
[]
[]
[]
[]
[]
[]
[]
[]
[]
[]
[]
[]
[]
[]
[]
[]
[]
[]
[]
[]
[]
[]
[]
[]
[]
[]
[]
[]
[]
[]
[]
[]
[]
[]
[]
[]
[]
[]
[]
[]
[]
[]
[]
[]
[]
[]
[]
[]
[]
[]
[]
[]
[]
[]
[]
[]
[]
[]
[]
[]
[]
[]
[]
[]
[]
[]
[]
[]
[]
[]
[]
[]
[]
[]
[]
[]
[]
[]
[]
[]
[]
[]
[]
[]
[]
[]
[]
[]
[]
[]
[]
[]
[]
[]
[]
[]
[]
[]
[]
[]
[]
[]
[]
[]
[]
[]
[]
[]
[]
[]
[]
[]
[]
[]
[]
[]
[]
[]
[]
[]
[]
[]
[]
[]
[]
[]
[]
[]
[]
[]
[]
[]
[]
[]
[]
[]
[]
[]
[]
[]
[]
[]
[]
[]
[]
[]
[]
[]
[]
[]
[]
[]
[]
[]
[]
[]
[]
[]
[]
[]
[]
[]
[]
[]
[]
[]
[]
[]
[]
[]
[]
[]
[]
[]
[]
[]
[]
[]
[]
[]
[]
[]
[]
[]
[]
[]
[]
[]
[]
[]
[]
[]
[]
[]
[]
[]
[]
[]
[]
[]
[]
[]
[]
[]
[]
[]
[]
[]
[]
[]
[]
[]
[]
[]
[]
[]
[]
[]
[]
[]
[]
[]
[]
[]
[]
[]
[]
[]
[]
[]
[]
[]
[]
[]
[]
[]
[]
[]
[]
[]
[]
[]
[]
[]
[]
[]
[]
[]
[]
[]
[]
[]
[]
[]
[]
[]
[]
[]
[]
[]
[]
[]
[]
[]
[]
[]
[]
[]
[]
[]
[]
[]
[]
[]
[]
[]
[]
[]
[]
[]
[]
[]
[]
[]
[]
[]
[]
[]
[]
[]
[]
[]
[]
[]
[]
[]
[]
[]
[]
[]
[]
[]
[]
[]
[]
[]
[]
[]
[]
[]
[]
[]
[]
[]
[]
[]
[]
[]
[]
[]
[]
[]
[]
[]
[]
[]
[]
[]
[]
[]
[]
[]
[]
[]
[]
[]
[]
[]
[]
[]
[]
[]
[]
[]
[]
[]
[]
[]
[]
[]
[]
[]
[]
[]
[]
[]
[]
[]
[]
[]
[]
[]
[]
[]
[]
[]
[]
[]
[]
[]
[]
[]
[]
[]
[]
[]
[]
[]
[]
[]
[]
[]
[]
[]
[]
[]
[]
[]
[]
[]
[]
[]
[]
[]
[]
[]
[]
[]
[]
[]
[]
[]
[]
[]
[]
[]
[]
[]
[]
[]
[]
[]
[]
[]
[]
[]
[]
[]
[]
[]
[]
[]
[]
[]
[]
[]
[]
[]
[]
[]
[]
[]
[]
[]
[]
[]
[]
[]
[]
[]
[]
[]
[]
[]
[]
[]
[]
[]
[]
[]
[]
[]
[]
[]
[]
[]
[]
[]
[]
[]
[]
[]
[]
[]
[]
[]
[]
[]
[]
[]
[]
[]
[]
[]
[]
[]
[]
[]
[]
[]
[]
[]
[]
[]
[]
[]
[]
[]
[]
[]
[]
[]
[]
[]
[]
[]
[]
[]
[]
[]
[]
[]
[]
[]
[]
[]
[]
[]
[]
[]
[]
[]
[]
[]
[]
[]
[]
[]
[]
[]
[]
[]
[]
[]
[]
[]
[]
[]
[]
[]
[]
[]
[]
[]
[]
[]
[]
[]
[]
[]
[]
[]
[]
[]
[]
[]
[]
[]
[]
[]
[]
[]
[]
[]
[]
[]
[]
[]
[]
[]
[]
[]
[]
[]
[]
[]
[]
[]
[]
[]
[]
[]
[]
[]
[]
[]
[]
[]
[]
[]
[]
[]
[]
[]
[]
[]
[]
[]
[]
[]
[]
[]
[]
[]
[]
[]
[]
[]
[]
[]
[]
[]
[]
[]
[]
[]
[]
[]
[]
[]
[]
[]
[]
[]
[]
[]
[]
[]
[]
[]
[]
[]
[]
[]
[]
[]
[]
[]
[]
[]
[]
[]
[]
[]
[]
[]
[]
[]
[]
[]
[]
[]
[]
[]
[]
[]
[]
[]
[]
[]
[]
[]
[]
[]
[]
[]
[]
[]
[]
[]
[]
[]
[]
[]
[]
[]
[]
[]
[]
[]
[]
[]
[]
[]
[]
[]
[]
[]
[]
[]
[]
[]
[]
[]
[]
[]
[]
[]
[]
[]
[]
[]
[]
[]
[]
[]
[]
[]
[]
[]
[]
[]
[]
[]
[]
[]
[]
[]
[]
[]
[]
[]
[]
[]
[]
[]
[]
[]
[]
[]
[]
[]
[]
[]
[]
[]
[]
[]
[]
[]
[]
[]
[]
[]
[]
[]
[]
[]
[]
[]
[]
[]
[]
[]
[]
[]
[]
[]
[]
[]
[]
[]
[]
[]
[]
[]
[]
[]
[]
[]
[]
[]
[]
[]
[]
[]
[]
[]
[]
[]
[]
[]
[]
[]
[]
[]
[]
[]
[]
[]
[]
[]
[]
[]
[]
[]
[]
[]
[]
[]
[]
[]
[]
[]
[]
[]
[]
[]
[]
[]
[]
[]
[]
[]
[]
[]
[]
[]
[]
[]
[]
[]
[]
[]
[]
[]
[]
[]
[]
[]
[]
[]
[]
[]
[]
[]
[]
[]
[]
[]
[]
[]
[]
[]
[]
[]
[]
[]
[]
[]
[]
[]
[]
[]
[]
[]
[]
[]
[]
[]
[]
[]
[]
[]
[]
[]
[]
[]
[]
[]
[]
[]
[]
[]
[]
[]
[]
[]
[]
[]
[]
[]
[]
[]
[]
[]
[]
[]
[]
[]
[]
[]
[]
[]
[]
[]
[]
[]
[]
[]
[]
[]
[]
[]
[]
[]
[]
[]
[]
[]
[]
[]
[]
[]
[]
[]
[]
[]
[]
[]
[]
[]
[]
[]
[]
[]
[]
[]
[]
[]
[]
[]
[]
[]
[]
[]
[]
[]
[]
[]
[]
[]
[]
[]
[]
[]
[]
[]
[]
[]
[]
[]
[]
[]
[]
[]
[]
[]
[]
[]
[]
[]
[]
[]
[]
[]
[]
[]
[]
[]
[]
[]
[]
[]
[]
[]
[]
[]
[]
[]
[]
[]
[]
[]
[]
[]
[]
[]
[]
[]
[]
[]
[]
[]
[]
[]
[]
[]
[]
[]
[]
[]
[]
[]
[]
[]
[]
[]
[]
[]
[]
[]
[]
[]
[]
[]
[]
[]
[]
[]
[]
[]
[]
[]
[]
[]
[]
[]
[]
[]
[]
[]
[]
[]
[]
[]
[]
[]
[]
[]
[]
[]
[]
[]
[]
[]
[]
[]
[]
[]
[]
[]
[]
[]
[]
[]
[]
[]
[]
[]
[]
[]
[]
[]
[]
[]
[]
[]
[]
[]
[]
[]
[]
[]
[]
[]
[]
[]
[]
[]
[]
[]
[]
[]
[]
[]
[]
[]
[]
[]
[]
[]
[]
[]
[]
[]
[]
[]
[]
[]
[]
[]
[]
[]
[]
[]
[]
[]
[]
[]
[]
[]
[]
[]
[]
[]
[]
[]
[]
[]
[]
[]
[]
[]
[]
[]
[]
[]
[]
[]
[]
[]
[]
[]
[]
[]
[]
[]
[]
[]
[]
[]
[]
[]
[]
[]
[]
[]
[]
[]
[]
[]
[]
[]
[]
[]
[]
[]
[]
[]
[]
[]
[]
[]
[]
[]
[]
[]
[]
[]
[]
[]
[]
[]
[]
[]
[]
[]
[]
[]
[]
[]
[]
[]
[]
[]
[]
[]
[]
[]
[]
[]
[]
[]
[]
[]
[]
[]
[]
[]
[]
[]
[]
[]
[]
[]
[]
[]
[]
[]
[]
[]
[]
[]
[]
[]
[]
[]
[]
[]
[]
[]
[]
[]
[]
[]
[]
[]
[]
[]
[]
[]
[]
[]
[]
[]
[]
[]
[]
[]
[]
[]
[]
[]
[]
[]
[]
[]
[]
[]
[]
[]
[]
[]
[]
[]
[]
[]
[]
[]
[]
[]
[]
[]
[]
[]
[]
[]
[]
[]
[]
[]
[]
[]
[]
[]
[]
[]
[]
[]
[]
[]
[]
[]
[]
[]
[]
[]
[]
[]
[]
[]
[]
[]
[]
[]
[]
[]
[]
[]
[]
[]
[]
[]
[]
[]
[]
[]
[]
[]
[]
[]
[]
[]
[]
[]
[]
[]
[]
[]
[]
[]
[]
[]
[]
[]
[]
[]
[]
[]
[]
[]
[]
[]
[]
[]
[]
[]
[]
[]
[]
[]
[]
[]
[]
[]
[]
[]
[]
[]
[]
[]
[]
[]
[]
[]
[]
[]
[]
[]
[]
[]
[]
[]
[]
[]
[]
[]
[]
[]
[]
[]
[]
[]
[]
[]
[]
[]
[]
[]
[]
[]
[]
[]
[]
[]
[]
[]
[]
[]
[]
[]
[]
[]
[]
[]
[]
[]
[]
[]
[]
[]
[]
[]
[]
[]
[]
[]
[]
[]
[]
[]
[]
[]
[]
[]
[]
[]
[]
[]
[]
[]
[]
[]
[]
[]
[]
[]
[]
[]
[]
[]
[]
[]
[]
[]
[]
[]
[]
[]
[]
[]
[]
[]
[]
[]
[]
[]
[]
[]
[]
[]
[]
[]
[]
[]
[]
[]
[]
[]
[]
[]
[]
[]
[]
[]
[]
[]
[]
[]
[]
[]
[]
[]
[]
[]
[]
[]
[]
[]
[]
[]
[]
[]
[]
[]
[]
[]
[]
[]
[]
[]
[]
[]
[]
[]
[]
[]
[]
[]
[]
[]
[]
[]
[]
[]
[]
[]
[]
[]
[]
[]
[]
[]
[]
[]
[]
[]
[]
[]
[]
[]
[]
[]
[]
[]
[]
[]
[]
[]
[]
[]
[]
[]
[]
[]
[]
[]
[]
[]
[]
[]
[]
[]
[]
[]
[]
[]
[]
[]
[]
[]
[]
[]
[]
[]
[]
[]
[]
[]
[]
[]
[]
[]
[]
[]
[]
[]
[]
[]
[]
[]
[]
[]
[]
[]
[]
[]
[]
[]
[]
[]
[]
[]
[]
[]
[]
[]
[]
[]
[]
[]
[]
[]
[]
[]
[]
[]
[]
[]
[]
[]
[]
[]
[]
[]
[]
[]
[]
[]
[]
[]
[]
[]
[]
[]
[]
[]
[]
[]
[]
[]
[]
[]
[]
[]
[]
[]
[]
[]
[]
[]
[]
[]
[]
[]
[]
[]
[]
[]
[]
[]
[]
[]
[]
[]
[]
[]
[]
[]
[]
[]
[]
[]
[]
[]
[]
[]
[]
[]
[]
[]
[]
[]
[]
[]
[]
[]
[]
[]
[]
[]
[]
[]
[]
[]
[]
[]
[]
[]
[]
[]
[]
[]
[]
[]
[]
[]
[]
[]
[]
[]
[]
[]
[]
[]
[]
[]
[]
[]
[]
[]
[]
[]
[]
[]
[]
[]
[]
[]
[]
[]
[]
[]
[]
[]
[]
[]
[]
[]
[]
[]
[]
[]
[]
[]
[]
[]
[]
[]
[]
[]
[]
[]
[]
[]
[]
[]
[]
[]
[]
[]
[]
[]
[]
[]
[]
[]
[]
[]
[]
[]
[]
[]
[]
[]
[]
[]
[]
[]
[]
[]
[]
[]
[]
[]
[]
[]
[]
[]
[]
[]
[]
[]
[]
[]
[]
[]
[]
[]
[]
[]
[]
[]
[]
[]
[]
[]
[]
[]
[]
[]
[]
[]
[]
[]
[]
[]
[]
[]
[]
[]
[]
[]
[]
[]
[]
[]
[]
[]
[]
[]
[]
[]
[]
[]
[]
[]
[]
[]
[]
[]
[]
[]
[]
[]
[]
[]
[]
[]
[]
[]
[]
[]
[]
[]
[]
[]
[]
[]
[]
[]
[]
[]
[]
[]
[]
[]
[]
[]
[]
[]
[]
[]
[]
[]
[]
[]
[]
[]
[]
[]
[]
[]
[]
[]
[]
[]
[]
[]
[]
[]
[]
[]
[]
[]
[]
[]
[]
[]
[]
[]
[]
[]
[]
[]
[]
[]
[]
[]
[]
[]
[]
[]
[]
[]
[]
[]
[]
[]
[]
[]
[]
[]
[]
[]
[]
[]
[]
[]
[]
[]
[]
[]
[]
[]
[]
[]
[]
[]
[]
[]
[]
[]
[]
[]
[]
[]
[]
[]
[]
[]
[]
[]
[]
[]
[]
[]
[]
[]
[]
[]
[]
[]
[]
[]
[]
[]
[]
[]
[]
[]
[]
[]
[]
[]
[]
[]
[]
[]
[]
[]
[]
[]
[]
[]
[]
[]
[]
[]
[]
[]
[]
[]
[]
[]
[]
[]
[]
[]
[]
[]
[]
[]
[]
[]
[]
[]
[]
[]
[]
[]
[]
[]
[]
[]
[]
[]
[]
[]
[]
[]
[]
[]
[]
[]
[]
[]
[]
[]
[]
[]
[]
[]
[]
[]
[]
[]
[]
[]
[]
[]
[]
[]
[]
[]
[]
[]
[]
[]
[]
[]
[]
[]
[]
[]
[]
[]
[]
[]
[]
[]
[]
[]
[]
[]
[]
[]
[]
[]
[]
[]
[]
[]
[]
[]
[]
[]
[]
[]
[]
[]
[]
[]
[]
[]
[]
[]
[]
[]
[]
[]
[]
[]
[]
[]
[]
[]
[]
[]
[]
[]
[]
[]
[]
[]
[]
[]
[]
[]
[]
[]
[]
[]
[]
[]
[]
[]
[]
[]
[]
[]
[]
[]
[]
[]
[]
[]
[]
[]
[]
[]
[]
[]
[]
[]
[]
[]
[]
[]
[]
[]
[]
[]
[]
[]
[]
[]
[]
[]
[]
[]
[]
[]
[]
[]
[]
[]
[]
[]
[]
[]
[]
[]
[]
[]
[]
[]
[]
[]
[]
[]
[]
[]
[]
[]
[]
[]
[]
[]
[]
[]
[]
[]
[]
[]
[]
[]
[]
[]
[]
[]
[]
[]
[]
[]
[]
[]
[]
[]
[]
[]
[]
[]
[]
[]
[]
[]
[]
[]
[]
[]
[]
[]
[]
[]
[]
[]
[]
[]
[]
[]
[]
[]
[]
[]
[]
[]
[]
[]
[]
[]
[]
[]
[]
[]
[]
[]
[]
[]
[]
[]
[]
[]
[]
[]
[]
[]
[]
[]
[]
[]
[]
[]
[]
[]
[]
[]
[]
[]
[]
[]
[]
[]
[]
[]
[]
[]
[]
[]
[]
[]
[]
[]
[]
[]
[]
[]
[]
[]
[]
[]
[]
[]
[]
[]
[]
[]
[]
[]
[]
[]
[]
[]
[]
[]
[]
[]
[]
[]
[]
[]
[]
[]
[]
[]
[]
[]
[]
[]
[]
[]
[]
[]
[]
[]
[]
[]
[]
[]
[]
[]
[]
[]
[]
[]
[]
[]
[]
[]
[]
[]
[]
[]
[]
[]
[]
[]
[]
[]
[]
[]
[]
[]
[]
[]
[]
[]
[]
[]
[]
[]
[]
[]
[]
[]
[]
[]
[]
[]
[]
[]
[]
[]
[]
[]
[]
[]
[]
[]
[]
[]
[]
[]
[]
[]
[]
[]
[]
[]
[]
[]
[]
[]
[]
[]
[]
[]
[]
[]
[]
[]
[]
[]
[]
[]
[]
[]
[]
[]
[]
[]
[]
[]
[]
[]
[]
[]
[]
[]
[]
[]
[]
[]
[]
[]
[]
[]
[]
[]
[]
[]
[]
[]
[]
[]
[]
[]
[]
[]
[]
[]
[]
[]
[]
[]
[]
[]
[]
[]
[]
[]
[]
[]
[]
[]
[]
[]
[]
[]
[]
[]
[]
[]
[]
[]
[]
[]
[]
[]
[]
[]
[]
[]
[]
[]
[]
[]
[]
[]
[]
[]
[]
[]
[]
[]
[]
[]
[]
[]
[]
[]
[]
[]
[]
[]
[]
[]
[]
[]
[]
[]
[]
[]
[]
[]
[]
[]
[]
[]
[]
[]
[]
[]
[]
[]
[]
[]
[]
[]
[]
[]
[]
[]
[]
[]
[]
[]
[]
[]
[]
[]
[]
[]
[]
[]
[]
[]
[]
[]
[]
[]
[]
[]
[]
[]
[]
[]
[]
[]
[]
[]
[]
[]
[]
[]
[]
[]
[]
[]
[]
[]
[]
[]
[]
[]
[]
[]
[]
[]
[]
[]
[]
[]
[]
[]
[]
[]
[]
[]
[]
[]
[]
[]
[]
[]
[]
[]
[]
[]
[]
[]
[]
[]
[]
[]
[]
[]
[]
[]
[]
[]
[]
[]
[]
[]
[]
[]
[]
[]
[]
[]
[]
[]
[]
[]
[]
[]
[]
[]
[]
[]
[]
[]
[]
[]
[]
[]
[]
[]
[]
[]
[]
[]
[]
[]
[]
[]
[]
[]
[]
[]
[]
[]
[]
[]
[]
[]
[]
[]
[]
[]
[]
[]
[]
[]
[]
[]
[]
[]
[]
[]
[]
[]
[]
[]
[]
[]
[]
[]
[]
[]
[]
[]
[]
[]
[]
[]
[]
[]
[]
[]
[]
[]
[]
[]
[]
[]
[]
[]
[]
[]
[]
[]
[]
[]
[]
[]
[]
[]
[]
[]
[]
[]
[]
[]
[]
[]
[]
[]
[]
[]
[]
[]
[]
[]
[]
[]
[]
[]
[]
[]
[]
[]
[]
[]
[]
[]
[]
[]
[]
[]
[]
[]
[]
[]
[]
[]
[]
[]
[]
[]
[]
[]
[]
[]
[]
[]
[]
[]
[]
[]
[]
[]
[]
[]
[]
[]
[]
[]
[]
[]
[]
[]
[]
[]
[]
[]
[]
[]
[]
[]
[]
[]
[]
[]
[]
[]
[]
[]
[]
[]
[]
[]
[]
[]
[]
[]
[]
[]
[]
[]
[]
[]
[]
[]
[]
[]
[]
[]
[]
[]
[]
[]
[]
[]
[]
[]
[]
[]
[]
[]
[]
[]
[]
[]
[]
[]
[]
[]
[]
[]
[]
[]
[]
[]
[]
[]
[]
[]
[]
[]
[]
[]
[]
[]
[]
[]
[]
[]
[]
[]
[]
[]
[]
[]
[]
[]
[]
[]
[]
[]
[]
[]
[]
[]
[]
[]
[]
[]
[]
[]
[]
[]
[]
[]
[]
[]
[]
[]
[]
[]
[]
[]
[]
[]
[]
[]
[]
[]
[]
[]
[]
[]
[]
[]
[]
[]
[]
[]
[]
[]
[]
[]
[]
[]
[]
[]
[]
[]
[]
[]
[]
[]
[]
[]
[]
[]
[]
[]
[]
[]
[]
[]
[]
[]
[]
[]
[]
[]
[]
[]
[]
[]
[]
[]
[]
[]
[]
[]
[]
[]
[]
[]
[]
[]
[]
[]
[]
[]
[]
[]
[]
[]
[]
[]
[]
[]
[]
[]
[]
[]
[]
[]
[]
[]
[]
[]
[]
[]
[]
[]
[]
[]
[]
[]
[]
[]
[]
[]
[]
[]
[]
[]
[]
[]
[]
[]
[]
[]
[]
[]
[]
[]
[]
[]
[]
[]
[]
[]
[]
[]
[]
[]
[]
[]
[]
[]
[]
[]
[]
[]
[]
[]
[]
[]
[]
[]
[]
[]
[]
[]
[]
[]
[]
[]
[]
[]
[]
[]
[]
[]
[]
[]
[]
[]
[]
[]
[]
[]
[]
[]
[]
[]
[]
[]
[]
[]
[]
[]
[]
[]
[]
[]
[]
[]
[]
[]
[]
[]
[]
[]
[]
[]
[]
[]
[]
[]
[]
[]
[]
[]
[]
[]
[]
[]
[]
[]
[]
[]
[]
[]
[]
[]
[]
[]
[]
[]
[]
[]
[]
[]
[]
[]
[]
[]
[]
[]
[]
[]
[]
[]
[]
[]
[]
[]
[]
[]
[]
[]
[]
[]
[]
[]
[]
[]
[]
[]
[]
[]
[]
[]
[]
[]
[]
[]
[]
[]
[]
[]
[]
[]
[]
[]
[]
[]
[]
[]
[]
[]
[]
[]
[]
[]
[]
[]
[]
[]
[]
[]
[]
[]
[]
[]
[]
[]
[]
[]
[]
[]
[]
[]
[]
[]
[]
[]
[]
[]
[]
[]
[]
[]
[]
[]
[]
[]
[]
[]
[]
[]
[]
[]
[]
[]
[]
[]
[]
[]
[]
[]
[]
[]
[]
[]
[]
[]
[]
[]
[]
[]
[]
[]
[]
[]
[]
[]
[]
[]
[]
[]
[]
[]
[]
[]
[]
[]
[]
[]
[]
[]
[]
[]
[]
[]
[]
[]
[]
[]
[]
[]
[]
[]
[]
[]
[]
[]
[]
[]
[]
[]
[]
[]
[]
[]
[]
[]
[]
[]
[]
[]
[]
[]
[]
[]
[]
[]
[]
[]
[]
[]
[]
[]
[]
[]
[]
[]
[]
[]
[]
[]
[]
[]
[]
[]
[]
[]
[]
[]
[]
[]
[]
[]
[]
[]
[]
[]
[]
[]
[]
[]
[]
[]
[]
[]
[]
[]
[]
[]
[]
[]
[]
[]
[]
[]
[]
[]
[]
[]
[]
[]
[]
[]
[]
[]
[]
[]
[]
[]
[]
[]
[]
[]
[]
[]
[]
[]
[]
[]
[]
[]
[]
[]
[]
[]
[]
[]
[]
[]
[]
[]
[]
[]
[]
[]
[]
[]
[]
[]
[]
[]
[]
[]
[]
[]
[]
[]
[]
[]
[]
[]
[]
[]
[]
[]
[]
[]
[]
[]
[]
[]
[]
[]
[]
[]
[]
[]
[]
[]
[]
[]
[]
[]
[]
[]
[]
[]
[]
[]
[]
[]
[]
[]
[]
[]
[]
[]
[]
[]
[]
[]
[]
[]
[]
[]
[]
[]
[]
[]
[]
[]
[]
[]
[]
[]
[]
[]
[]
[]
[]
[]
[]
[]
[]
[]
[]
[]
[]
[]
[]
[]
[]
[]
[]
[]
[]
[]
[]
[]
[]
[]
[]
[]
[]
[]
[]
[]
[]
[]
[]
[]
[]
[]
[]
[]
[]
[]
[]
[]
[]
[]
[]
[]
[]
[]
[]
[]
[]
[]
[]
[]
[]
[]
[]
[]
[]
[]
[]
[]
[]
[]
[]
[]
[]
[]
[]
[]
[]
[]
[]
[]
[]
[]
[]
[]
[]
[]
[]
[]
[]
[]
[]
[]
[]
[]
[]
[]
[]
[]
[]
[]
[]
[]
[]
[]
[]
[]
[]
[]
[]
[]
[]
[]
[]
[]
[]
[]
[]
[]
[]
[]
[]
[]
[]
[]
[]
[]
[]
[]
[]
[]
[]
[]
[]
[]
[]
[]
[]
[]
[]
[]
[]
[]
[]
[]
[]
[]
[]
[]
[]
[]
[]
[]
[]
[]
[]
[]
[]
[]
[]
[]
[]
[]
[]
[]
[]
[]
[]
[]
[]
[]
[]
[]
[]
[]
[]
[]
[]
[]
[]
[]
[]
[]
[]
[]
[]
[]
[]
[]
[]
[]
[]
[]
[]
[]
[]
[]
[]
[]
[]
[]
[]
[]
[]
[]
[]
[]
[]
[]
[]
[]
[]
[]
[]
[]
[]
[]
[]
[]
[]
[]
[]
[]
[]
[]
[]
[]
[]
[]
[]
[]
[]
[]
[]
[]
[]
[]
[]
[]
[]
[]
[]
[]
[]
[]
[]
[]
[]
[]
[]
[]
[]
[]
[]
[]
[]
[]
[]
[]
[]
[]
[]
[]
[]
[]
[]
[]
[]
[]
[]
[]
[]
[]
[]
[]
[]
[]
[]
[]
[]
[]
[]
[]
[]
[]
[]
[]
[]
[]
[]
[]
[]
[]
[]
[]
[]
[]
[]
[]
[]
[]
[]
[]
[]
[]
[]
[]
[]
[]
[]
[]
[]
[]
[]
[]
[]
[]
[]
[]
[]
[]
[]
[]
[]
[]
[]
[]
[]
[]
[]
[]
[]
[]
[]
[]
[]
[]
[]
[]
[]
[]
[]
[]
[]
[]
[]
[]
[]
[]
[]
[]
[]
[]
[]
[]
[]
[]
[]
[]
[]
[]
[]
[]
[]
[]
[]
[]
[]
[]
[]
[]
[]
[]
[]
[]
[]
[]
[]
[]
[]
[]
[]
[]
[]
[]
[]
[]
[]
[]
[]
[]
[]
[]
[]
[]
[]
[]
[]
[]
[]
[]
[]
[]
[]
[]
[]
[]
[]
[]
[]
[]
[]
[]
[]
[]
[]
[]
[]
[]
[]
[]
[]
[]
[]
[]
[]
[]
[]
[]
[]
[]
[]
[]
[]
[]
[]
[]
[]
[]
[]
[]
[]
[]
[]
[]
[]
[]
[]
[]
[]
[]
[]
[]
[]
[]
[]
[]
[]
[]
[]
[]
[]
[]
[]
[]
[]
[]
[]
[]
[]
[]
[]
[]
[]
[]
[]
[]
[]
[]
[]
[]
[]
[]
[]
[]
[]
[]
[]
[]
[]
[]
[]
[]
[]
[]
[]
[]
[]
[]
[]
[]
[]
[]
[]
[]
[]
[]
[]
[]
[]
[]
[]
[]
[]
[]
[]
[]
[]
[]
[]
[]
[]
[]
[]
[]
[]
[]
[]
[]
[]
[]
[]
[]
[]
[]
[]
[]
[]
[]
[]
[]
[]
[]
[]
[]
[]
[]
[]
[]
[]
[]
[]
[]
[]
[]
[]
[]
[]
[]
[]
[]
[]
[]
[]
[]
[]
[]
[]
[]
[]
[]
[]
[]
[]
[]
[]
[]
[]
[]
[]
[]
[]
[]
[]
[]
[]
[]
[]
[]
[]
[]
[]
[]
[]
[]
[]
[]
[]
[]
[]
[]
[]
[]
[]
[]
[]
[]
[]
[]
[]
[]
[]
[]
[]
[]
[]
[]
[]
[]
[]
[]
[]
[]
[]
[]
[]
[]
[]
[]
[]
[]
[]
[]
[]
[]
[]
[]
[]
[]
[]
[]
[]
[]
[]
[]
[]
[]
[]
[]
[]
[]
[]
[]
[]
[]
[]
[]
[]
[]
[]
[]
[]
[]
[]
[]
[]
[]
[]
[]
[]
[]
[]
[]
[]
[]
[]
[]
[]
[]
[]
[]
[]
[]
[]
[]
[]
[]
[]
[]
[]
[]
[]
[]
[]
[]
[]
[]
[]
[]
[]
[]
[]
[]
[]
[]
[]
[]
[]
[]
[]
[]
[]
[]
[]
[]
[]
[]
[]
[]
[]
[]
[]
[]
[]
[]
[]
[]
[]
[]
[]
[]
[]
[]
[]
[]
[]
[]
[]
[]
[]
[]
[]
[]
[]
[]
[]
[]
[]
[]
[]
[]
[]
[]
[]
[]
[]
[]
[]
[]
[]
[]
[]
[]
[]
[]
[]
[]
[]
[]
[]
[]
[]
[]
[]
[]
[]
[]
[]
[]
[]
[]
[]
[]
[]
[]
[]
[]
[]
[]
[]
[]
[]
[]
[]
[]
[]
[]
[]
[]
[]
[]
[]
[]
[]
[]
[]
[]
[]
[]
[]
[]
[]
[]
[]
[]
[]
[]
[]
[]
[]
[]
[]
[]
[]
[]
[]
[]
[]
[]
[]
[]
[]
[]
[]
[]
[]
[]
[]
[]
[]
[]
[]
[]
[]
[]
[]
[]
[]
[]
[]
[]
[]
[]
[]
[]
[]
[]
[]
[]
[]
[]
[]
[]
[]
[]
[]
[]
[]
[]
[]
[]
[]
[]
[]
[]
[]
[]
[]
[]
[]
[]
[]
[]
[]
[]
[]
[]
[]
[]
[]
[]
[]
[]
[]
[]
[]
[]
[]
[]
[]
[]
[]
[]
[]
[]
[]
[]
[]
[]
[]
[]
[]
[]
[]
[]
[]
[]
[]
[]
[]
[]
[]
[]
[]
[]
[]
[]
[]
[]
[]
[]
[]
[]
[]
[]
[]
[]
[]
[]
[]
[]
[]
[]
[]
[]
[]
[]
[]
[]
[]
[]
[]
[]
[]
[]
[]
[]
[]
[]
[]
[]
[]
[]
[]
[]
[]
[]
[]
[]
[]
[]
[]
[]
[]
[]
[]
[]
[]
[]
[]
[]
[]
[]
[]
[]
[]
[]
[]
[]
[]
[]
[]
[]
[]
[]
[]
[]
[]
[]
[]
[]
[]
[]
[]
[]
[]
[]
[]
[]
[]
[]
[]
[]
[]
[]
[]
[]
[]
[]
[]
[]
[]
[]
[]
[]
[]
[]
[]
[]
[]
[]
[]
[]
[]
[]
[]
[]
[]
[]
[]
[]
[]
[]
[]
[]
[]
[]
[]
[]
[]
[]
[]
[]
[]
[]
[]
[]
[]
[]
[]
[]
[]
[]
[]
[]
[]
[]
[]
[]
[]
[]
[]
[]
[]
[]
[]
[]
[]
[]
[]
[]
[]
[]
[]
[]
[]
[]
[]
[]
[]
[]
[]
[]
[]
[]
[]
[]
[]
[]
[]
[]
[]
[]
[]
[]
[]
[]
[]
[]
[]
[]
[]
[]
[]
[]
[]
[]
[]
[]
[]
[]
[]
[]
[]
[]
[]
[]
[]
[]
[]
[]
[]
[]
[]
[]
[]
[]
[]
[]
[]
[]
[]
[]
[]
[]
[]
[]
[]
[]
[]
[]
[]
[]
[]
[]
[]
[]
[]
[]
[]
[]
[]
[]
[]
[]
[]
[]
[]
[]
[]
[]
[]
[]
[]
[]
[]
[]
[]
[]
[]
[]
[]
[]
[]
[]
[]
[]
[]
[]
[]
[]
[]
[]
[]
[]
[]
[]
[]
[]
[]
[]
[]
[]
[]
[]
[]
[]
[]
[]
[]
[]
[]
[]
[]
[]
[]
[]
[]
[]
[]
[]
[]
[]
[]
[]
[]
[]
[]
[]
[]
[]
[]
[]
[]
[]
[]
[]
[]
[]
[]
[]
[]
[]
[]
[]
[]
[]
[]
[]
[]
[]
[]
[]
[]
[]
[]
[]
[]
[]
[]
[]
[]
[]
[]
[]
[]
[]
[]
[]
[]
[]
[]
[]
[]
[]
[]
[]
[]
[]
[]
[]
[]
[]
[]
[]
[]
[]
[]
[]
[]
[]
[]
[]
[]
[]
[]
[]
[]
[]
[]
[]
[]
[]
[]
[]
[]
[]
[]
[]
[]
[]
[]
[]
[]
[]
[]
[]
[]
[]
[]
[]
[]
[]
[]
[]
[]
[]
[]
[]
[]
[]
[]
[]
[]
[]
[]
[]
[]
[]
[]
[]
[]
[]
[]
[]
[]
[]
[]
[]
[]
[]
[]
[]
[]
[]
[]
[]
[]
[]
[]
[]
[]
[]
[]
[]
[]
[]
[]
[]
[]
[]
[]
[]
[]
[]
[]
[]
[]
[]
[]
[]
[]
[]
[]
[]
[]
[]
[]
[]
[]
[]
[]
[]
[]
[]
[]
[]
[]
[]
[]
[]
[]
[]
[]
[]
[]
[]
[]
[]
[]
[]
[]
[]
[]
[]
[]
[]
[]
[]
[]
[]
[]
[]
[]
[]
[]
[]
[]
[]
[]
[]
[]
[]
[]
[]
[]
[]
[]
[]
[]
[]
[]
[]
[]
[]
[]
[]
[]
[]
[]
[]
[]
[]
[]
[]
[]
[]
[]
[]
[]
[]
[]
[]
[]
[]
[]
[]
[]
[]
[]
[]
[]
[]
[]
[]
[]
[]
[]
[]
[]
[]
[]
[]
[]
[]
[]
[]
[]
[]
[]
[]
[]
[]
[]
[]
[]
[]
[]
[]
[]
[]
[]
[]
[]
[]
[]
[]
[]
[]
[]
[]
[]
[]
[]
[]
[]
[]
[]
[]
[]
[]
[]
[]
[]
[]
[]
[]
[]
[]
[]
[]
[]
[]
[]
[]
[]
[]
[]
[]
[]
[]
[]
[]
[]
[]
[]
[]
[]
[]
[]
[]
[]
[]
[]
[]
[]
[]
[]
[]
[]
[]
[]
[]
[]
[]
[]
[]
[]
[]
[]
[]
[]
[]
[]
[]
[]
[]
[]
[]
[]
[]
[]
[]
[]
[]
[]
[]
[]
[]
[]
[]
[]
[]
[]
[]
[]
[]
[]
[]
[]
[]
[]
[]
[]
[]
[]
[]
[]
[]
[]
[]
[]
[]
[]
[]
[]
[]
[]
[]
[]
[]
[]
[]
[]
[]
[]
[]
[]
[]
[]
[]
[]
[]
[]
[]
[]
[]
[]
[]
[]
[]
[]
[]
[]
[]
[]
[]
[]
[]
[]
[]
[]
[]
[]
[]
[]
[]
[]
[]
[]
[]
[]
[]
[]
[]
[]
[]
[]
[]
[]
[]
[]
[]
[]
[]
[]
[]
[]
[]
[]
[]
[]
[]
[]
[]
[]
[]
[]
[]
[]
[]
[]
[]
[]
[]
[]
[]
[]
[]
[]
[]
[]
[]
[]
[]
[]
[]
[]
[]
[]
[]
[]
[]
[]
[]
[]
[]
[]
[]
[]
[]
[]
[]
[]
[]
[]
[]
[]
[]
[]
[]
[]
[]
[]
[]
[]
[]
[]
[]
[]
[]
[]
[]
[]
[]
[]
[]
[]
[]
[]
[]
[]
[]
[]
[]
[]
[]
[]
[]
[]
[]
[]
[]
[]
[]
[]
[]
[]
[]
[]
[]
[]
[]
[]
[]
[]
[]
[]
[]
[]
[]
[]
[]
[]
[]
[]
[]
[]
[]
[]
[]
[]
[]
[]
[]
[]
[]
[]
[]
[]
[]
[]
[]
[]
[]
[]
[]
[]
[]
[]
[]
[]
[]
[]
[]
[]
[]
[]
[]
[]
[]
[]
[]
[]
[]
[]
[]
[]
[]
[]
[]
[]
[]
[]
[]
[]
[]
[]
[]
[]
[]
[]
[]
[]
[]
[]
[]
[]
[]
[]
[]
[]
[]
[]
[]
[]
[]
[]
[]
[]
[]
[]
[]
[]
[]
[]
[]
[]
[]
[]
[]
[]
[]
[]
[]
[]
[]
[]
[]
[]
[]
[]
[]
[]
[]
[]
[]
[]
[]
[]
[]
[]
[]
[]
[]
[]
[]
[]
[]
[]
[]
[]
[]
[]
[]
[]
[]
[]
[]
[]
[]
[]
[]
[]
[]
[]
[]
[]
[]
[]
[]
[]
[]
[]
[]
[]
[]
[]
[]
[]
[]
[]
[]
[]
[]
[]
[]
[]
[]
[]
[]
[]
[]
[]
[]
[]
[]
[]
[]
[]
[]
[]
[]
[]
[]
[]
[]
[]
[]
[]
[]
[]
[]
[]
[]
[]
[]
[]
[]
[]
[]
[]
[]
[]
[]
[]
[]
[]
[]
[]
[]
[]
[]
[]
[]
[]
[]
[]
[]
[]
[]
[]
[]
[]
[]
[]
[]
[]
[]
[]
[]
[]
[]
[]
[]
[]
[]
[]
[]
[]
[]
[]
[]
[]
[]
[]
[]
[]
[]
[]
[]
[]
[]
[]
[]
[]
[]
[]
[]
[]
[]
[]
[]
[]
[]
[]
[]
[]
[]
[]
[]
[]
[]
[]
[]
[]
[]
[]
[]
[]
[]
[]
[]
[]
[]
[]
[]
[]
[]
[]
[]
[]
[]
[]
[]
[]
[]
[]
[]
[]
[]
[]
[]
[]
[]
[]
[]
[]
[]
[]
[]
[]
[]
[]
[]
[]
[]
[]
[]
[]
[]
[]
[]
[]
[]
[]
[]
[]
[]
[]
[]
[]
[]
[]
[]
[]
[]
[]
[]
[]
[]
[]
[]
[]
[]
[]
[]
[]
[]
[]
[]
[]
[]
[]
[]
[]
[]
[]
[]
[]
[]
[]
[]
[]
[]
[]
[]
[]
[]
[]
[]
[]
[]
[]
[]
[]
[]
[]
[]
[]
[]
[]
[]
[]
[]
[]
[]
[]
[]
[]
[]
[]
[]
[]
[]
[]
[]
[]
[]
[]
[]
[]
[]
[]
[]
[]
[]
[]
[]
[]
[]
[]
[]
[]
[]
[]
[]
[]
[]
[]
[]
[]
[]
[]
[]
[]
[]
[]
[]
[]
[]
[]
[]
[]
[]
[]
[]
[]
[]
[]
[]
[]
[]
[]
[]
[]
[]
[]
[]
[]
[]
[]
[]
[]
[]
[]
[]
[]
[]
[]
[]
[]
[]
[]
[]
[]
[]
[]
[]
[]
[]
[]
[]
[]
[]
[]
[]
[]
[]
[]
[]
[]
[]
[]
[]
[]
[]
[]
[]
[]
[]
[]
[]
[]
[]
[]
[]
[]
[]
[]
[]
[]
[]
[]
[]
[]
[]
[]
[]
[]
[]
[]
[]
[]
[]
[]
[]
[]
[]
[]
[]
[]
[]
[]
[]
[]
[]
[]
[]
[]
[]
[]
[]
[]
[]
[]
[]
[]
[]
[]
[]
[]
[]
[]
[]
[]
[]
[]
[]
[]
[]
[]
[]
[]
[]
[]
[]
[]
[]
[]
[]
[]
[]
[]
[]
[]
[]
[]
[]
[]
[]
[]
[]
[]
[]
[]
[]
[]
[]
[]
[]
[]
[]
[]
[]
[]
[]
[]
[]
[]
[]
[]
[]
[]
[]
[]
[]
[]
[]
[]
[]
[]
[]
[]
[]
[]
[]
[]
[]
[]
[]
[]
[]
[]
[]
[]
[]
[]
[]
[]
[]
[]
[]
[]
[]
[]
[]
[]
[]
[]
[]
[]
[]
[]
[]
[]
[]
[]
[]
[]
[]
[]
[]
[]
[]
[]
[]
[]
[]
[]
[]
[]
[]
[]
[]
[]
[]
[]
[]
[]
[]
[]
[]
[]
[]
[]
[]
[]
[]
[]
[]
[]
[]
[]
[]
[]
[]
[]
[]
[]
[]
[]
[]
[]
[]
[]
[]
[]
[]
[]
[]
[]
[]
[]
[]
[]
[]
[]
[]
[]
[]
[]
[]
[]
[]
[]
[]
[]
[]
[]
[]
[]
[]
[]
[]
[]
[]
[]
[]
[]
[]
[]
[]
[]
[]
[]
[]
[]
[]
[]
[]
[]
[]
[]
[]
[]
[]
[]
[]
[]
[]
[]
[]
[]
[]
[]
[]
[]
[]
[]
[]
[]
[]
[]
[]
[]
[]
[]
[]
[]
[]
[]
[]
[]
[]
[]
[]
[]
[]
[]
[]
[]
[]
[]
[]
[]
[]
[]
[]
[]
[]
[]
[]
[]
[]
[]
[]
[]
[]
[]
[]
[]
[]
[]
[]
[]
[]
[]
[]
[]
[]
[]
[]
[]
[]
[]
[]
[]
[]
[]
[]
[]
[]
[]
[]
[]
[]
[]
[]
[]
[]
[]
[]
[]
[]
[]
[]
[]
[]
[]
[]
[]
[]
[]
[]
[]
[]
[]
[]
[]
[]
[]
[]
[]
[]
[]
[]
[]
[]
[]
[]
[]
[]
[]
[]
[]
[]
[]
[]
[]
[]
[]
[]
[]
[]
[]
[]
[]
[]
[]
[]
[]
[]
[]
[]
[]
[]
[]
[]
[]
[]
[]
[]
[]
[]
[]
[]
[]
[]
[]
[]
[]
[]
[]
[]
[]
[]
[]
[]
[]
[]
[]
[]
[]
[]
[]
[]
[]
[]
[]
[]
[]
[]
[]
[]
[]
[]
[]
[]
[]
[]
[]
[]
[]
[]
[]
[]
[]
[]
[]
[]
[]
[]
[]
[]
[]
[]
[]
[]
[]
[]
[]
[]
[]
[]
[]
[]
[]
[]
[]
[]
[]
[]
[]
[]
[]
[]
[]
[]
[]
[]
[]
[]
[]
[]
[]
[]
[]
[]
[]
[]
[]
[]
[]
[]
[]
[]
[]
[]
[]
[]
[]
[]
[]
[]
[]
[]
[]
[]
[]
[]
[]
[]
[]
[]
[]
[]
[]
[]
[]
[]
[]
[]
[]
[]
[]
[]
[]
[]
[]
[]
[]
[]
[]
[]
[]
[]
[]
[]
[]
[]
[]
[]
[]
[]
[]
[]
[]
[]
[]
[]
[]
[]
[]
[]
[]
[]
[]
[]
[]
[]
[]
[]
[]
[]
[]
[]
[]
[]
[]
[]
[]
[]
[]
[]
[]
[]
[]
[]
[]
[]
[]
[]
[]
[]
[]
[]
[]
[]
[]
[]
[]
[]
[]
[]
[]
[]
[]
[]
[]
[]
[]
[]
[]
[]
[]
[]
[]
[]
[]
[]
[]
[]
[]
[]
[]
[]
[]
[]
[]
[]
[]
[]
[]
[]
[]
[]
[]
[]
[]
[]
[]
[]
[]
[]
[]
[]
[]
[]
[]
[]
[]
[]
[]
[]
[]
[]
[]
[]
[]
[]
[]
[]
[]
[]
[]
[]
[]
[]
[]
[]
[]
[]
[]
[]
[]
[]
[]
[]
[]
[]
[]
[]
[]
[]
[]
[]
[]
[]
[]
[]
[]
[]
[]
[]
[]
[]
[]
[]
[]
[]
[]
[]
[]
[]
[]
[]
[]
[]
[]
[]
[]
[]
[]
[]
[]
[]
[]
[]
[]
[]
[]
[]
[]
[]
[]
[]
[]
[]
[]
[]
[]
[]
[]
[]
[]
[]
[]
[]
[]
[]
[]
[]
[]
[]
[]
[]
[]
[]
[]
[]
[]
[]
[]
[]
[]
[]
[]
[]
[]
[]
[]
[]
[]
[]
[]
[]
[]
[]
[]
[]
[]
[]
[]
[]
[]
[]
[]
[]
[]
[]
[]
[]
[]
[]
[]
[]
[]
[]
[]
[]
[]
[]
[]
[]
[]
[]
[]
[]
[]
[]
[]
[]
[]
[]
[]
[]
[]
[]
[]
[]
[]
[]
[]
[]
[]
[]
[]
[]
[]
[]
[]
[]
[]
[]
[]
[]
[]
[]
[]
[]
[]
[]
[]
[]
[]
[]
[]
[]
[]
[]
[]
[]
[]
[]
[]
[]
[]
[]
[]
[]
[]
[]
[]
[]
[]
[]
[]
[]
[]
[]
[]
[]
[]
[]
[]
[]
[]
[]
[]
[]
[]
[]
[]
[]
[]
[]
[]
[]
[]
[]
[]
[]
[]
[]
[]
[]
[]
[]
[]
[]
[]
[]
[]
[]
[]
[]
[]
[]
[]
[]
[]
[]
[]
[]
[]
[]
[]
[]
[]
[]
[]
[]
[]
[]
[]
[]
[]
[]
[]
[]
[]
[]
[]
[]
[]
[]
[]
[]
[]
[]
[]
[]
[]
[]
[]
[]
[]
[]
[]
[]
[]
[]
[]
[]
[]
[]
[]
[]
[]
[]
[]
[]
[]
[]
[]
[]
[]
[]
[]
[]
[]
[]
[]
[]
[]
[]
[]
[]
[]
[]
[]
[]
[]
[]
[]
[]
[]
[]
[]
[]
[]
[]
[]
[]
[]
[]
[]
[]
[]
[]
[]
[]
[]
[]
[]
[]
[]
[]
[]
[]
[]
[]
[]
[]
[]
[]
[]
[]
[]
[]
[]
[]
[]
[]
[]
[]
[]
[]
[]
[]
[]
[]
[]
[]
[]
[]
[]
[]
[]
[]
[]
[]
[]
[]
[]
[]
[]
[]
[]
[]
[]
[]
[]
[]
[]
[]
[]
[]
[]
[]
[]
[]
[]
[]
[]
[]
[]
[]
[]
[]
[]
[]
[]
[]
[]
[]
[]
[]
[]
[]
[]
[]
[]
[]
[]
[]
[]
[]
[]
[]
[]
[]
[]
[]
[]
[]
[]
[]
[]
[]
[]
[]
[]
[]
[]
[]
[]
[]
[]
[]
[]
[]
[]
[]
[]
[]
[]
[]
[]
[]
[]
[]
[]
[]
[]
[]
[]
[]
[]
[]
[]
[]
[]
[]
[]
[]
[]
[]
[]
[]
[]
[]
[]
[]
[]
[]
[]
[]
[]
[]
[]
[]
[]
[]
[]
[]
[]
[]
[]
[]
[]
[]
[]
[]
[]
[]
[]
[]
[]
[]
[]
[]
[]
[]
[]
[]
[]
[]
[]
[]
[]
[]
[]
[]
[]
[]
[]
[]
[]
[]
[]
[]
[]
[]
[]
[]
[]
[]
[]
[]
[]
[]
[]
[]
[]
[]
[]
[]
[]
[]
[]
[]
[]
[]
[]
[]
[]
[]
[]
[]
[]
[]
[]
[]
[]
[]
[]
[]
[]
[]
[]
[]
[]
[]
[]
[]
[]
[]
[]
[]
[]
[]
[]
[]
[]
[]
[]
[]
[]
[]
[]
[]
[]
[]
[]
[]
[]
[]
[]
[]
[]
[]
[]
[]
[]
[]
[]
[]
[]
[]
[]
[]
[]
[]
[]
[]
[]
[]
[]
[]
[]
[]
[]
[]
[]
[]
[]
[]
[]
[]
[]
[]
[]
[]
[]
[]
[]
[]
[]
[]
[]
[]
[]
[]
[]
[]
[]
[]
[]
[]
[]
[]
[]
[]
[]
[]
[]
[]
[]
[]
[]
[]
[]
[]
[]
[]
[]
[]
[]
[]
[]
[]
[]
[]
[]
[]
[]
[]
[]
[]
[]
[]
[]
[]
[]
[]
[]
[]
[]
[]
[]
[]
[]
[]
[]
[]
[]
[]
[]
[]
[]
[]
[]
[]
[]
[]
[]
[]
[]
[]
[]
[]
[]
[]
[]
[]
[]
[]
[]
[]
[]
[]
[]
[]
[]
[]
[]
[]
[]
[]
[]
[]
[]
[]
[]
[]
[]
[]
[]
[]
[]
[]
[]
[]
[]
[]
[]
[]
[]
[]
[]
[]
[]
[]
[]
[]
[]
[]
[]
[]
[]
[]
[]
[]
[]
[]
[]
[]
[]
[]
[]
[]
[]
[]
[]
[]
[]
[]
[]
[]
[]
[]
[]
[]
[]
[]
[]
[]
[]
[]
[]
[]
[]
[]
[]
[]
[]
[]
[]
[]
[]
[]
[]
[]
[]
[]
[]
[]
[]
[]
[]
[]
[]
[]
[]
[]
[]
[]
[]
[]
[]
[]
[]
[]
[]
[]
[]
[]
[]
[]
[]
[]
[]
[]
[]
[]
[]
[]
[]
[]
[]
[]
[]
[]
[]
[]
[]
[]
[]
[]
[]
[]
[]
[]
[]
[]
[]
[]
[]
[]
[]
[]
[]
[]
[]
[]
[]
[]
[]
[]
[]
[]
[]
[]
[]
[]
[]
[]
[]
[]
[]
[]
[]
[]
[]
[]
[]
[]
[]
[]
[]
[]
[]
[]
[]
[]
[]
[]
[]
[]
[]
[]
[]
[]
[]
[]
[]
[]
[]
[]
[]
[]
[]
[]
[]
[]
[]
[]
[]
[]
[]
[]
[]
[]
[]
[]
[]
[]
[]
[]
[]
[]
[]
[]
[]
[]
[]
[]
[]
[]
[]
[]
[]
[]
[]
[]
[]
[]
[]
[]
[]
[]
[]
[]
[]
[]
[]
[]
[]
[]
[]
[]
[]
[]
[]
[]
[]
[]
[]
[]
[]
[]
[]
[]
[]
[]
[]
[]
[]
[]
[]
[]
[]
[]
[]
[]
[]
[]
[]
[]
[]
[]
[]
[]
[]
[]
[]
[]
[]
[]
[]
[]
[]
[]
[]
[]
[]
[]
[]
[]
[]
[]
[]
[]
[]
[]
[]
[]
[]
[]
[]
[]
[]
[]
[]
[]
[]
[]
[]
[]
[]
[]
[]
[]
[]
[]
[]
[]
[]
[]
[]
[]
[]
[]
[]
[]
[]
[]
[]
[]
[]
[]
[]
[]
[]
[]
[]
[]
[]
[]
[]
[]
[]
[]
[]
[]
[]
[]
[]
[]
[]
[]
[]
[]
[]
[]
[]
[]
[]
[]
[]
[]
[]
[]
[]
[]
[]
[]
[]
[]
[]
[]
[]
[]
[]
[]
[]
[]
[]
[]
[]
[]
[]
[]
[]
[]
[]
[]
[]
[]
[]
[]
[]
[]
[]
[]
[]
[]
[]
[]
[]
[]
[]
[]
[]
[]
[]
[]
[]
[]
[]
[]
[]
[]
[]
[]
[]
[]
[]
[]
[]
[]
[]
[]
[]
[]
[]
[]
[]
[]
[]
[]
[]
[]
[]
[]
[]
[]
[]
[]
[]
[]
[]
[]
[]
[]
[]
[]
[]
[]
[]
[]
[]
[]
[]
[]
[]
[]
[]
[]
[]
[]
[]
[]
[]
[]
[]
[]
[]
[]
[]
[]
[]
[]
[]
[]
[]
[]
[]
[]
[]
[]
[]
[]
[]
[]
[]
[]
[]
[]
[]
[]
[]
[]
[]
[]
[]
[]
[]
[]
[]
[]
[]
[]
[]
[]
[]
[]
[]
[]
[]
[]
[]
[]
[]
[]
[]
[]
[]
[]
[]
[]
[]
[]
[]
[]
[]
[]
[]
[]
[]
[]
[]
[]
[]
[]
[]
[]
[]
[]
[]
[]
[]
[]
[]
[]
[]
[]
[]
[]
[]
[]
[]
[]
[]
[]
[]
[]
[]
[]
[]
[]
[]
[]
[]
[]
[]
[]
[]
[]
[]
[]
[]
[]
[]
[]
[]
[]
[]
[]
[]
[]
[]
[]
[]
[]
[]
[]
[]
[]
[]
[]
[]
[]
[]
[]
[]
[]
[]
[]
[]
[]
[]
[]
[]
[]
[]
[]
[]
[]
[]
[]
[]
[]
[]
[]
[]
[]
[]
[]
[]
[]
[]
[]
[]
[]
[]
[]
[]
[]
[]
[]
[]
[]
[]
[]
[]
[]
[]
[]
[]
[]
[]
[]
[]
[]
[]
[]
[]
[]
[]
[]
[]
[]
[]
[]
[]
[]
[]
[]
[]
[]
[]
[]
[]
[]
[]
[]
[]
[]
[]
[]
[]
[]
[]
[]
[]
[]
[]
[]
[]
[]
[]
[]
[]
[]
[]
[]
[]
[]
[]
[]
[]
[]
[]
[]
[]
[]
[]
[]
[]
[]
[]
[]
[]
[]
[]
[]
[]
[]
[]
[]
[]
[]
[]
[]
[]
[]
[]
[]
[]
[]
[]
[]
[]
[]
[]
[]
[]
[]
[]
[]
[]
[]
[]
[]
[]
[]
[]
[]
[]
[]
[]
[]
[]
[]
[]
[]
[]
[]
[]
[]
[]
[]
[]
[]
[]
[]
[]
[]
[]
[]
[]
[]
[]
[]
[]
[]
[]
[]
[]
[]
[]
[]
[]
[]
[]
[]
[]
[]
[]
[]
[]
[]
[]
[]
[]
[]
[]
[]
[]
[]
[]
[]
[]
[]
[]
[]
[]
[]
[]
[]
[]
[]
[]
[]
[]
[]
[]
[]
[]
[]
[]
[]
[]
[]
[]
[]
[]
[]
[]
[]
[]
[]
[]
[]
[]
[]
[]
[]
[]
[]
[]
[]
[]
[]
[]
[]
[]
[]
[]
[]
[]
[]
[]
[]
[]
[]
[]
[]
[]
[]
[]
[]
[]
[]
[]
[]
[]
[]
[]
[]
[]
[]
[]
[]
[]
[]
[]
[]
[]
[]
[]
[]
[]
[]
[]
[]
[]
[]
[]
[]
[]
[]
[]
[]
[]
[]
[]
[]
[]
[]
[]
[]
[]
[]
[]
[]
[]
[]
[]
[]
[]
[]
[]
[]
[]
[]
[]
[]
[]
[]
[]
[]
[]
[]
[]
[]
[]
[]
[]
[]
[]
[]
[]
[]
[]
[]
[]
[]
[]
[]
[]
[]
[]
[]
[]
[]
[]
[]
[]
[]
[]
[]
[]
[]
[]
[]
[]
[]
[]
[]
[]
[]
[]
[]
[]
[]
[]
[]
[]
[]
[]
[]
[]
[]
[]
[]
[]
[]
[]
[]
[]
[]
[]
[]
[]
[]
[]
[]
[]
[]
[]
[]
[]
[]
[]
[]
[]
[]
[]
[]
[]
[]
[]
[]
[]
[]
[]
[]
[]
[]
[]
[]
[]
[]
[]
[]
[]
[]
[]
[]
[]
[]
[]
[]
[]
[]
[]
[]
[]
[]
[]
[]
[]
[]
[]
[]
[]
[]
[]
[]
[]
[]
[]
[]
[]
[]
[]
[]
[]
[]
[]
[]
[]
[]
[]
[]
[]
[]
[]
[]
[]
[]
[]
[]
[]
[]
[]
[]
[]
[]
[]
[]
[]
[]
[]
[]
[]
[]
[]
[]
[]
[]
[]
[]
[]
[]
[]
[]
[]
[]
[]
[]
[]
[]
[]
[]
[]
[]
[]
[]
[]
[]
[]
[]
[]
[]
[]
[]
[]
[]
[]
[]
[]
[]
[]
[]
[]
[]
[]
[]
[]
[]
[]
[]
[]
[]
[]
[]
[]
[]
[]
[]
[]
[]
[]
[]
[]
[]
[]
[]
[]
[]
[]
[]
[]
[]
[]
[]
[]
[]
[]
[]
[]
[]
[]
[]
[]
[]
[]
[]
[]
[]
[]
[]
[]
[]
[]
[]
[]
[]
[]
[]
[]
[]
[]
[]
[]
[]
[]
[]
[]
[]
[]
[]
[]
[]
[]
[]
[]
[]
[]
[]
[]
[]
[]
[]
[]
[]
[]
[]
[]
[]
[]
[]
[]
[]
[]
[]
[]
[]
[]
[]
[]
[]
[]
[]
[]
[]
[]
[]
[]
[]
[]
[]
[]
[]
[]
[]
[]
[]
[]
[]
[]
[]
[]
[]
[]
[]
[]
[]
[]
[]
[]
[]
[]
[]
[]
[]
[]
[]
[]
[]
[]
[]
[]
[]
[]
[]
[]
[]
[]
[]
[]
[]
[]
[]
[]
[]
[]
[]
[]
[]
[]
[]
[]
[]
[]
[]
[]
[]
[]
[]
[]
[]
[]
[]
[]
[]
[]
[]
[]
[]
[]
[]
[]
[]
[]
[]
[]
[]
[]
[]
[]
[]
[]
[]
[]
[]
[]
[]
[]
[]
[]
[]
[]
[]
[]
[]
[]
[]
[]
[]
[]
[]
[]
[]
[]
[]
[]
[]
[]
[]
[]
[]
[]
[]
[]
[]
[]
[]
[]
[]
[]
[]
[]
[]
[]
[]
[]
[]
[]
[]
[]
[]
[]
[]
[]
[]
[]
[]
[]
[]
[]
[]
[]
[]
[]
[]
[]
[]
[]
[]
[]
[]
[]
[]
[]
[]
[]
[]
[]
[]
[]
[]
[]
[]
[]
[]
[]
[]
[]
[]
[]
[]
[]
[]
[]
[]
[]
[]
[]
[]
[]
[]
[]
[]
[]
[]
[]
[]
[]
[]
[]
[]
[]
[]
[]
[]
[]
[]
[]
[]
[]
[]
[]
[]
[]
[]
[]
[]
[]
[]
[]
[]
[]
[]
[]
[]
[]
[]
[]
[]
[]
[]
[]
[]
[]
[]
[]
[]
[]
[]
[]
[]
[]
[]
[]
[]
[]
[]
[]
[]
[]
[]
[]
[]
[]
[]
[]
[]
[]
[]
[]
[]
[]
[]
[]
[]
[]
[]
[]
[]
[]
[]
[]
[]
[]
[]
[]
[]
[]
[]
[]
[]
[]
[]
[]
[]
[]
[]
[]
[]
[]
[]
[]
[]
[]
[]
[]
[]
[]
[]
[]
[]
[]
[]
[]
[]
[]
[]
[]
[]
[]
[]
[]
[]
[]
[]
[]
[]
[]
[]
[]
[]
[]
[]
[]
[]
[]
[]
[]
[]
[]
[]
[]
[]
[]
[]
[]
[]
[]
[]
[]
[]
[]
[]
[]
[]
[]
[]
[]
[]
[]
[]
[]
[]
[]
[]
[]
[]
[]
[]
[]
[]
[]
[]
[]
[]
[]
[]
[]
[]
[]
[]
[]
[]
[]
[]
[]
[]
[]
[]
[]
[]
[]
[]
[]
[]
[]
[]
[]
[]
[]
[]
[]
[]
[]
[]
[]
[]
[]
[]
[]
[]
[]
[]
[]
[]
[]
[]
[]
[]
[]
[]
[]
[]
[]
[]
[]
[]
[]
[]
[]
[]
[]
[]
[]
[]
[]
[]
[]
[]
[]
[]
[]
[]
[]
[]
[]
[]
[]
[]
[]
[]
[]
[]
[]
[]
[]
[]
[]
[]
[]
[]
[]
[]
[]
[]
[]
[]
[]
[]
[]
[]
[]
[]
[]
[]
[]
[]
[]
[]
[]
[]
[]
[]
[]
[]
[]
[]
[]
[]
[]
[]
[]
[]
[]
[]
[]
[]
[]
[]
[]
[]
[]
[]
[]
[]
[]
[]
[]
[]
[]
[]
[]
[]
[]
[]
[]
[]
[]
[]
[]
[]
[]
[]
[]
[]
[]
[]
[]
[]
[]
[]
[]
[]
[]
[]
[]
[]
[]
[]
[]
[]
[]
[]
[]
[]
[]
[]
[]
[]
[]
[]
[]
[]
[]
[]
[]
[]
[]
[]
[]
[]
[]
[]
[]
[]
[]
[]
[]
[]
[]
[]
[]
[]
[]
[]
[]
[]
[]
[]
[]
[]
[]
[]
[]
[]
[]
[]
[]
[]
[]
[]
[]
[]
[]
[]
[]
[]
[]
[]
[]
[]
[]
[]
[]
[]
[]
[]
[]
[]
[]
[]
[]
[]
[]
[]
[]
[]
[]
[]
[]
[]
[]
[]
[]
[]
[]
[]
[]
[]
[]
[]
[]
[]
[]
[]
[]
[]
[]
[]
[]
[]
[]
[]
[]
[]
[]
[]
[]
[]
[]
[]
[]
[]
[]
[]
[]
[]
[]
[]
[]
[]
[]
[]
[]
[]
[]
[]
[]
[]
[]
[]
[]
[]
[]
[]
[]
[]
[]
[]
[]
[]
[]
[]
[]
[]
[]
[]
[]
[]
[]
[]
[]
[]
[]
[]
[]
[]
[]
[]
[]
[]
[]
[]
[]
[]
[]
[]
[]
[]
[]
[]
[]
[]
[]
[]
[]
[]
[]
[]
[]
[]
[]
[]
[]
[]
[]
[]
[]
[]
[]
[]
[]
[]
[]
[]
[]
[]
[]
[]
[]
[]
[]
[]
[]
[]
[]
[]
[]
[]
[]
[]
[]
[]
[]
[]
[]
[]
[]
[]
[]
[]
[]
[]
[]
[]
[]
[]
[]
[]
[]
[]
[]
[]
[]
[]
[]
[]
[]
[]
[]
[]
[]
[]
[]
[]
[]
[]
[]
[]
[]
[]
[]
[]
[]
[]
[]
[]
[]
[]
[]
[]
[]
[]
[]
[]
[]
[]
[]
[]
[]
[]
[]
[]
[]
[]
[]
[]
[]
[]
[]
[]
[]
[]
[]
[]
[]
[]
[]
[]
[]
[]
[]
[]
[]
[]
[]
[]
[]
[]
[]
[]
[]
[]
[]
[]
[]
[]
[]
[]
[]
[]
[]
[]
[]
[]
[]
[]
[]
[]
[]
[]
[]
[]
[]
[]
[]
[]
[]
[]
[]
[]
[]
[]
[]
[]
[]
[]
[]
[]
[]
[]
[]
[]
[]
[]
[]
[]
[]
[]
[]
[]
[]
[]
[]
[]
[]
[]
[]
[]
[]
[]
[]
[]
[]
[]
[]
[]
[]
[]
[]
[]
[]
[]
[]
[]
[]
[]
[]
[]
[]
[]
[]
[]
[]
[]
[]
[]
[]
[]
[]
[]
[]
[]
[]
[]
[]
[]
[]
[]
[]
[]
[]
[]
[]
[]
[]
[]
[]
[]
[]
[]
[]
[]
[]
[]
[]
[]
[]
[]
[]
[]
[]
[]
[]
[]
[]
[]
[]
[]
[]
[]
[]
[]
[]
[]
[]
[]
[]
[]
[]
[]
[]
[]
[]
[]
[]
[]
[]
[]
[]
[]
[]
[]
[]
[]
[]
[]
[]
[]
[]
[]
[]
[]
[]
[]
[]
[]
[]
[]
[]
[]
[]
[]
[]
[]
[]
[]
[]
[]
[]
[]
[]
[]
[]
[]
[]
[]
[]
[]
[]
[]
[]
[]
[]
[]
[]
[]
[]
[]
[]
[]
[]
[]
[]
[]
[]
[]
[]
[]
[]
[]
[]
[]
[]
[]
[]
[]
[]
[]
[]
[]
[]
[]
[]
[]
[]
[]
[]
[]
[]
[]
[]
[]
[]
[]
[]
[]
[]
[]
[]
[]
[]
[]
[]
[]
[]
[]
[]
[]
[]
[]
[]
[]
[]
[]
[]
[]
[]
[]
[]
[]
[]
[]
[]
[]
[]
[]
[]
[]
[]
[]
[]
[]
[]
[]
[]
[]
[]
[]
[]
[]
[]
[]
[]
[]
[]
[]
[]
[]
[]
[]
[]
[]
[]
[]
[]
[]
[]
[]
[]
[]
[]
[]
[]
[]
[]
[]
[]
[]
[]
[]
[]
[]
[]
[]
[]
[]
[]
[]
[]
[]
[]
[]
[]
[]
[]
[]
[]
[]
[]
[]
[]
[]
[]
[]
[]
[]
[]
[]
[]
[]
[]
[]
[]
[]
[]
[]
[]
[]
[]
[]
[]
[]
[]
[]
[]
[]
[]
[]
[]
[]
[]
[]
[]
[]
[]
[]
[]
[]
[]
[]
[]
[]
[]
[]
[]
[]
[]
[]
[]
[]
[]
[]
[]
[]
[]
[]
[]
[]
[]
[]
[]
[]
[]
[]
[]
[]
[]
[]
[]
[]
[]
[]
[]
[]
[]
[]
[]
[]
[]
[]
[]
[]
[]
[]
[]
[]
[]
[]
[]
[]
[]
[]
[]
[]
[]
[]
[]
[]
[]
[]
[]
[]
[]
[]
[]
[]
[]
[]
[]
[]
[]
[]
[]
[]
[]
[]
[]
[]
[]
[]
[]
[]
[]
[]
[]
[]
[]
[]
[]
[]
[]
[]
[]
[]
[]
[]
[]
[]
[]
[]
[]
[]
[]
[]
[]
[]
[]
[]
[]
[]
[]
[]
[]
[]
[]
[]
[]
[]
[]
[]
[]
[]
[]
[]
[]
[]
[]
[]
[]
[]
[]
[]
[]
[]
[]
[]
[]
[]
[]
[]
[]
[]
[]
[]
[]
[]
[]
[]
[]
[]
[]
[]
[]
[]
[]
[]
[]
[]
[]
[]
[]
[]
[]
[]
[]
[]
[]
[]
[]
[]
[]
[]
[]
[]
[]
[]
[]
[]
[]
[]
[]
[]
[]
[]
[]
[]
[]
[]
[]
[]
[]
[]
[]
[]
[]
[]
[]
[]
[]
[]
[]
[]
[]
[]
[]
[]
[]
[]
[]
[]
[]
[]
[]
[]
[]
[]
[]
[]
[]
[]
[]
[]
[]
[]
[]
[]
[]
[]
[]
[]
[]
[]
[]
[]
[]
[]
[]
[]
[]
[]
[]
[]
[]
[]
[]
[]
[]
[]
[]
[]
[]
[]
[]
[]
[]
[]
[]
[]
[]
[]
[]
[]
[]
[]
[]
[]
[]
[]
[]
[]
[]
[]
[]
[]
[]
[]
[]
[]
[]
[]
[]
[]
[]
[]
[]
[]
[]
[]
[]
[]
[]
[]
[]
[]
[]
[]
[]
[]
[]
[]
[]
[]
[]
[]
[]
[]
[]
[]
[]
[]
[]
[]
[]
[]
[]
[]
[]
[]
[]
[]
[]
[]
[]
[]
[]
[]
[]
[]
[]
[]
[]
[]
[]
[]
[]
[]
[]
[]
[]
[]
[]
[]
[]
[]
[]
[]
[]
[]
[]
[]
[]
[]
[]
[]
[]
[]
[]
[]
[]
[]
[]
[]
[]
[]
[]
[]
[]
[]
[]
[]
[]
[]
[]
[]
[]
[]
[]
[]
[]
[]
[]
[]
[]
[]
[]
[]
[]
[]
[]
[]
[]
[]
[]
[]
[]
[]
[]
[]
[]
[]
[]
[]
[]
[]
[]
[]
[]
[]
[]
[]
[]
[]
[]
[]
[]
[]
[]
[]
[]
[]
[]
[]
[]
[]
[]
[]
[]
[]
[]
[]
[]
[]
[]
[]
[]
[]
[]
[]
[]
[]
[]
[]
[]
[]
[]
[]
[]
[]
[]
[]
[]
[]
[]
[]
[]
[]
[]
[]
[]
[]
[]
[]
[]
[]
[]
[]
[]
[]
[]
[]
[]
[]
[]
[]
[]
[]
[]
[]
[]
[]
[]
[]
[]
[]
[]
[]
[]
[]
[]
[]
[]
[]
[]
[]
[]
[]
[]
[]
[]
[]
[]
[]
[]
[]
[]
[]
[]
[]
[]
[]
[]
[]
[]
[]
[]
[]
[]
[]
[]
[]
[]
[]
[]
[]
[]
[]
[]
[]
[]
[]
[]
[]
[]
[]
[]
[]
[]
[]
[]
[]
[]
[]
[]
[]
[]
[]
[]
[]
[]
[]
[]
[]
[]
[]
[]
[]
[]
[]
[]
[]
[]
[]
[]
[]
[]
[]
[]
[]
[]
[]
[]
[]
[]
[]
[]
[]
[]
[]
[]
[]
[]
[]
[]
[]
[]
[]
[]
[]
[]
[]
[]
[]
[]
[]
[]
[]
[]
[]
[]
[]
[]
[]
[]
[]
[]
[]
[]
[]
[]
[]
[]
[]
[]
[]
[]
[]
[]
[]
[]
[]
[]
[]
[]
[]
[]
[]
[]
[]
[]
[]
[]
[]
[]
[]
[]
[]
[]
[]
[]
[]
[]
[]
[]
[]
[]
[]
[]
[]
[]
[]
[]
[]
[]
[]
[]
[]
[]
[]
[]
[]
[]
[]
[]
[]
[]
[]
[]
[]
[]
[]
[]
[]
[]
[]
[]
[]
[]
[]
[]
[]
[]
[]
[]
[]
[]
[]
[]
[]
[]
[]
[]
[]
[]
[]
[]
[]
[]
[]
[]
[]
[]
[]
[]
[]
[]
[]
[]
[]
[]
[]
[]
[]
[]
[]
[]
[]
[]
[]
[]
[]
[]
[]
[]
[]
[]
[]
[]
[]
[]
[]
[]
[]
[]
[]
[]
[]
[]
[]
[]
[]
[]
[]
[]
[]
[]
[]
[]
[]
[]
[]
[]
[]
[]
[]
[]
[]
[]
[]
[]
[]
[]
[]
[]
[]
[]
[]
[]
[]
[]
[]
[]
[]
[]
[]
[]
[]
[]
[]
[]
[]
[]
[]
[]
[]
[]
[]
[]
[]
[]
[]
[]
[]
[]
[]
[]
[]
[]
[]
[]
[]
[]
[]
[]
[]
[]
[]
[]
[]
[]
[]
[]
[]
[]
[]
[]
[]
[]
[]
[]
[]
[]
[]
[]
[]
[]
[]
[]
[]
[]
[]
[]
[]
[]
[]
[]
[]
[]
[]
[]
[]
[]
[]
[]
[]
[]
[]
[]
[]
[]
[]
[]
[]
[]
[]
[]
[]
[]
[]
[]
[]
[]
[]
[]
[]
[]
[]
[]
[]
[]
[]
[]
[]
[]
[]
[]
[]
[]
[]
[]
[]
[]
[]
[]
[]
[]
[]
[]
[]
[]
[]
[]
[]
[]
[]
[]
[]
[]
[]
[]
[]
[]
[]
[]
[]
[]
[]
[]
[]
[]
[]
[]
[]
[]
[]
[]
[]
[]
[]
[]
[]
[]
[]
[]
[]
[]
[]
[]
[]
[]
[]
[]
[]
[]
[]
[]
[]
[]
[]
[]
[]
[]
[]
[]
[]
[]
[]
[]
[]
[]
[]
[]
[]
[]
[]
[]
[]
[]
[]
[]
[]
[]
[]
[]
[]
[]
[]
[]
[]
[]
[]
[]
[]
[]
[]
[]
[]
[]
[]
[]
[]
[]
[]
[]
[]
[]
[]
[]
[]
[]
[]
[]
[]
[]
[]
[]
[]
[]
[]
[]
[]
[]
[]
[]
[]
[]
[]
[]
[]
[]
[]
[]
[]
[]
[]
[]
[]
[]
[]
[]
[]
[]
[]
[]
[]
[]
[]
[]
[]
[]
[]
[]
[]
[]
[]
[]
[]
[]
[]
[]
[]
[]
[]
[]
[]
[]
[]
[]
[]
[]
[]
[]
[]
[]
[]
[]
[]
[]
[]
[]
[]
[]
[]
[]
[]
[]
[]
[]
[]
[]
[]
[]
[]
[]
[]
[]
[]
[]
[]
[]
[]
[]
[]
[]
[]
[]
[]
[]
[]
[]
[]
[]
[]
[]
[]
[]
[]
[]
[]
[]
[]
[]
[]
[]
[]
[]
[]
[]
[]
[]
[]
[]
[]
[]
[]
[]
[]
[]
[]
[]
[]
[]
[]
[]
[]
[]
[]
[]
[]
[]
[]
[]
[]
[]
[]
[]
[]
[]
[]
[]
[]
[]
[]
[]
[]
[]
[]
[]
[]
[]
[]
[]
[]
[]
[]
[]
[]
[]
[]
[]
[]
[]
[]
[]
[]
[]
[]
[]
[]
[]
[]
[]
[]
[]
[]
[]
[]
[]
[]
[]
[]
[]
[]
[]
[]
[]
[]
[]
[]
[]
[]
[]
[]
[]
[]
[]
[]
[]
[]
[]
[]
[]
[]
[]
[]
[]
[]
[]
[]
[]
[]
[]
[]
[]
[]
[]
[]
[]
[]
[]
[]
[]
[]
[]
[]
[]
[]
[]
[]
[]
[]
[]
[]
[]
[]
[]
[]
[]
[]
[]
[]
[]
[]
[]
[]
[]
[]
[]
[]
[]
[]
[]
[]
[]
[]
[]
[]
[]
[]
[]
[]
[]
[]
[]
[]
[]
[]
[]
[]
[]
[]
[]
[]
[]
[]
[]
[]
[]
[]
[]
[]
[]
[]
[]
[]
[]
[]
[]
[]
[]
[]
[]
[]
[]
[]
[]
[]
[]
[]
[]
[]
[]
[]
[]
[]
[]
[]
[]
[]
[]
[]
[]
[]
[]
[]
[]
[]
[]
[]
[]
[]
[]
[]
[]
[]
[]
[]
[]
[]
[]
[]
[]
[]
[]
[]
[]
[]
[]
[]
[]
[]
[]
[]
[]
[]
[]
[]
[]
[]
[]
[]
[]
[]
[]
[]
[]
[]
[]
[]
[]
[]
[]
[]
[]
[]
[]
[]
[]
[]
[]
[]
[]
[]
[]
[]
[]
[]
[]
[]
[]
[]
[]
[]
[]
[]
[]
[]
[]
[]
[]
[]
[]
[]
[]
[]
[]
[]
[]
[]
[]
[]
[]
[]
[]
[]
[]
[]
[]
[]
[]
[]
[]
[]
[]
[]
[]
[]
[]
[]
[]
[]
[]
[]
[]
[]
[]
[]
[]
[]
[]
[]
[]
[]
[]
[]
[]
[]
[]
[]
[]
[]
[]
[]
[]
[]
[]
[]
[]
[]
[]
[]
[]
[]
[]
[]
[]
[]
[]
[]
[]
[]
[]
[]
[]
[]
[]
[]
[]
[]
[]
[]
[]
[]
[]
[]
[]
[]
[]
[]
[]
[]
[]
[]
[]
[]
[]
[]
[]
[]
[]
[]
[]
[]
[]
[]
[]
[]
[]
[]
[]
[]
[]
[]
[]
[]
[]
[]
[]
[]
[]
[]
[]
[]
[]
[]
[]
[]
[]
[]
[]
[]
[]
[]
[]
[]
[]
[]
[]
[]
[]
[]
[]
[]
[]
[]
[]
[]
[]
[]
[]
[]
[]
[]
[]
[]
[]
[]
[]
[]
[]
[]
[]
[]
[]
[]
[]
[]
[]
[]
[]
[]
[]
[]
[]
[]
[]
[]
[]
[]
[]
[]
[]
[]
[]
[]
[]
[]
[]
[]
[]
[]
[]
[]
[]
[]
[]
[]
[]
[]
[]
[]
[]
[]
[]
[]
[]
[]
[]
[]
[]
[]
[]
[]
[]
[]
[]
[]
[]
[]
[]
[]
[]
[]
[]
[]
[]
[]
[]
[]
[]
[]
[]
[]
[]
[]
[]
[]
[]
[]
[]
[]
[]
[]
[]
[]
[]
[]
[]
[]
[]
[]
[]
[]
[]
[]
[]
[]
[]
[]
[]
[]
[]
[]
[]
[]
[]
[]
[]
[]
[]
[]
[]
[]
[]
[]
[]
[]
[]
[]
[]
[]
[]
[]
[]
[]
[]
[]
[]
[]
[]
[]
[]
[]
[]
[]
[]
[]
[]
[]
[]
[]
[]
[]
[]
[]
[]
[]
[]
[]
[]
[]
[]
[]
[]
[]
[]
[]
[]
[]
[]
[]
[]
[]
[]
[]
[]
[]
[]
[]
[]
[]
[]
[]
[]
[]
[]
[]
[]
[]
[]
[]
[]
[]
[]
[]
[]
[]
[]
[]
[]
[]
[]
[]
[]
[]
[]
[]
[]
[]
[]
[]
[]
[]
[]
[]
[]
[]
[]
[]
[]
[]
[]
[]
[]
[]
[]
[]
[]
[]
[]
[]
[]
[]
[]
[]
[]
[]
[]
[]
[]
[]
[]
[]
[]
[]
[]
[]
[]
[]
[]
[]
[]
[]
[]
[]
[]
[]
[]
[]
[]
[]
[]
[]
[]
[]
[]
[]
[]
[]
[]
[]
[]
[]
[]
[]
[]
[]
[]
[]
[]
[]
[]
[]
[]
[]
[]
[]
[]
[]
[]
[]
[]
[]
[]
[]
[]
[]
[]
[]
[]
[]
[]
[]
[]
[]
[]
[]
[]
[]
[]
[]
[]
[]
[]
[]
[]
[]
[]
[]
[]
[]
[]
[]
[]
[]
[]
[]
[]
[]
[]
[]
[]
[]
[]
[]
[]
[]
[]
[]
[]
[]
[]
[]
[]
[]
[]
[]
[]
[]
[]
[]
[]
[]
[]
[]
[]
[]
[]
[]
[]
[]
[]
[]
[]
[]
[]
[]
[]
[]
[]
[]
[]
[]
[]
[]
[]
[]
[]
[]
[]
[]
[]
[]
[]
[]
[]
[]
[]
[]
[]
[]
[]
[]
[]
[]
[]
[]
[]
[]
[]
[]
[]
[]
[]
[]
[]
[]
[]
[]
[]
[]
[]
[]
[]
[]
[]
[]
[]
[]
[]
[]
[]
[]
[]
[]
[]
[]
[]
[]
[]
[]
[]
[]
[]
[]
[]
[]
[]
[]
[]
[]
[]
[]
[]
[]
[]
[]
[]
[]
[]
[]
[]
[]
[]
[]
[]
[]
[]
[]
[]
[]
[]
[]
[]
[]
[]
[]
[]
[]
[]
[]
[]
[]
[]
[]
[]
[]
[]
[]
[]
[]
[]
[]
[]
[]
[]
[]
[]
[]
[]
[]
[]
[]
[]
[]
[]
[]
[]
[]
[]
[]
[]
[]
[]
[]
[]
[]
[]
[]
[]
[]
[]
[]
[]
[]
[]
[]
[]
[]
[]
[]
[]
[]
[]
[]
[]
[]
[]
[]
[]
[]
[]
[]
[]
[]
[]
[]
[]
[]
[]
[]
[]
[]
[]
[]
[]
[]
[]
[]
[]
[]
[]
[]
[]
[]
[]
[]
[]
[]
[]
[]
[]
[]
[]
[]
[]
[]
[]
[]
[]
[]
[]
[]
[]
[]
[]
[]
[]
[]
[]
[]
[]
[]
[]
[]
[]
[]
[]
[]
[]
[]
[]
[]
[]
[]
[]
[]
[]
[]
[]
[]
[]
[]
[]
[]
[]
[]
[]
[]
[]
[]
[]
[]
[]
[]
[]
[]
[]
[]
[]
[]
[]
[]
[]
[]
[]
[]
[]
[]
[]
[]
[]
[]
[]
[]
[]
[]
[]
[]
[]
[]
[]
[]
[]
[]
[]
[]
[]
[]
[]
[]
[]
[]
[]
[]
[]
[]
[]
[]
[]
[]
[]
[]
[]
[]
[]
[]
[]
[]
[]
[]
[]
[]
[]
[]
[]
[]
[]
[]
[]
[]
[]
[]
[]
[]
[]
[]
[]
[]
[]
[]
[]
[]
[]
[]
[]
[]
[]
[]
[]
[]
[]
[]
[]
[]
[]
[]
[]
[]
[]
[]
[]
[]
[]
[]
[]
[]
[]
[]
[]
[]
[]
[]
[]
[]
[]
[]
[]
[]
[]
[]
[]
[]
[]
[]
[]
[]
[]
[]
[]
[]
[]
[]
[]
[]
[]
[]
[]
[]
[]
[]
[]
[]
[]
[]
[]
[]
[]
[]
[]
[]
[]
[]
[]
[]
[]
[]
[]
[]
[]
[]
[]
[]
[]
[]
[]
[]
[]
[]
[]
[]
[]
[]
[]
[]
[]
[]
[]
[]
[]
[]
[]
[]
[]
[]
[]
[]
[]
[]
[]
[]
[]
[]
[]
[]
[]
[]
[]
[]
[]
[]
[]
[]
[]
[]
[]
[]
[]
[]
[]
[]
[]
[]
[]
[]
[]
[]
[]
[]
[]
[]
[]
[]
[]
[]
[]
[]
[]
[]
[]
[]
[]
[]
[]
[]
[]
[]
[]
[]
[]
[]
[]
[]
[]
[]
[]
[]
[]
[]
[]
[]
[]
[]
[]
[]
[]
[]
[]
[]
[]
[]
[]
[]
[]
[]
[]
[]
[]
[]
[]
[]
[]
[]
[]
[]
[]
[]
[]
[]
[]
[]
[]
[]
[]
[]
[]
[]
[]
[]
[]
[]
[]
[]
[]
[]
[]
[]
[]
[]
[]
[]
[]
[]
[]
[]
[]
[]
[]
[]
[]
[]
[]
[]
[]
[]
[]
[]
[]
[]
[]
[]
[]
[]
[]
[]
[]
[]
[]
[]
[]
[]
[]
[]
[]
[]
[]
[]
[]
[]
[]
[]
[]
[]
[]
[]
[]
[]
[]
[]
[]
[]
[]
[]
[]
[]
[]
[]
[]
[]
[]
[]
[]
[]
[]
[]
[]
[]
[]
[]
[]
[]
[]
[]
[]
[]
[]
[]
[]
[]
[]
[]
[]
[]
[]
[]
[]
[]
[]
[]
[]
[]
[]
[]
[]
[]
[]
[]
[]
[]
[]
[]
[]
[]
[]
[]
[]
[]
[]
[]
[]
[]
[]
[]
[]
[]
[]
[]
[]
[]
[]
[]
[]
[]
[]
[]
[]
[]
[]
[]
[]
[]
[]
[]
[]
[]
[]
[]
[]
[]
[]
[]
[]
[]
[]
[]
[]
[]
[]
[]
[]
[]
[]
[]
[]
[]
[]
[]
[]
[]
[]
[]
[]
[]
[]
[]
[]
[]
[]
[]
[]
[]
[]
[]
[]
[]
[]
[]
[]
[]
[]
[]
[]
[]
[]
[]
[]
[]
[]
[]
[]
[]
[]
[]
[]
[]
[]
[]
[]
[]
[]
[]
[]
[]
[]
[]
[]
[]
[]
[]
[]
[]
[]
[]
[]
[]
[]
[]
[]
[]
[]
[]
[]
[]
[]
[]
[]
[]
[]
[]
[]
[]
[]
[]
[]
[]
[]
[]
[]
[]
[]
[]
[]
[]
[]
[]
[]
[]
[]
[]
[]
[]
[]
[]
[]
[]
[]
[]
[]
[]
[]
[]
[]
[]
[]
[]
[]
[]
[]
[]
[]
[]
[]
[]
[]
[]
[]
[]
[]
[]
[]
[]
[]
[]
[]
[]
[]
[]
[]
[]
[]
[]
[]
[]
[]
[]
[]
[]
[]
[]
[]
[]
[]
[]
[]
[]
[]
[]
[]
[]
[]
[]
[]
[]
[]
[]
[]
[]
[]
[]
[]
[]
[]
[]
[]
[]
[]
[]
[]
[]
[]
[]
[]
[]
[]
[]
[]
[]
[]
[]
[]
[]
[]
[]
[]
[]
[]
[]
[]
[]
[]
[]
[]
[]
[]
[]
[]
[]
[]
[]
[]
[]
[]
[]
[]
[]
[]
[]
[]
[]
[]
[]
[]
[]
[]
[]
[]
[]
[]
[]
[]
[]
[]
[]
[]
[]
[]
[]
[]
[]
[]
[]
[]
[]
[]
[]
[]
[]
[]
[]
[]
[]
[]
[]
[]
[]
[]
[]
[]
[]
[]
[]
[]
[]
[]
[]
[]
[]
[]
[]
[]
[]
[]
[]
[]
[]
[]
[]
[]
[]
[]
[]
[]
[]
[]
[]
[]
[]
[]
[]
[]
[]
[]
[]
[]
[]
[]
[]
[]
[]
[]
[]
[]
[]
[]
[]
[]
[]
[]
[]
[]
[]
[]
[]
[]
[]
[]
[]
[]
[]
[]
[]
[]
[]
[]
[]
[]
[]
[]
[]
[]
[]
[]
[]
[]
[]
[]
[]
[]
[]
[]
[]
[]
[]
[]
[]
[]
[]
[]
[]
[]
[]
[]
[]
[]
[]
[]
[]
[]
[]
[]
[]
[]
[]
[]
[]
[]
[]
[]
[]
[]
[]
[]
[]
[]
[]
[]
[]
[]
[]
[]
[]
[]
[]
[]
[]
[]
[]
[]
[]
[]
[]
[]
[]
[]
[]
[]
[]
[]
[]
[]
[]
[]
[]
[]
[]
[]
[]
[]
[]
[]
[]
[]
[]
[]
[]
[]
[]
[]
[]
[]
[]
[]
[]
[]
[]
[]
[]
[]
[]
[]
[]
[]
[]
[]
[]
[]
[]
[]
[]
[]
[]
[]
[]
[]
[]
[]
[]
[]
[]
[]
[]
[]
[]
[]
[]
[]
[]
[]
[]
[]
[]
[]
[]
[]
[]
[]
[]
[]
[]
[]
[]
[]
[]
[]
[]
[]
[]
[]
[]
[]
[]
[]
[]
[]
[]
[]
[]
[]
[]
[]
[]
[]
[]
[]
[]
[]
[]
[]
[]
[]
[]
[]
[]
[]
[]
[]
[]
[]
[]
[]
[]
[]
[]
[]
[]
[]
[]
[]
[]
[]
[]
[]
[]
[]
[]
[]
[]
[]
[]
[]
[]
[]
[]
[]
[]
[]
[]
[]
[]
[]
[]
[]
[]
[]
[]
[]
[]
[]
[]
[]
[]
[]
[]
[]
[]
[]
[]
[]
[]
[]
[]
[]
[]
[]
[]
[]
[]
[]
[]
[]
[]
[]
[]
[]
[]
[]
[]
[]
[]
[]
[]
[]
[]
[]
[]
[]
[]
[]
[]
[]
[]
[]
[]
[]
[]
[]
[]
[]
[]
[]
[]
[]
[]
[]
[]
[]
[]
[]
[]
[]
[]
[]
[]
[]
[]
[]
[]
[]
[]
[]
[]
[]
[]
[]
[]
[]
[]
[]
[]
[]
[]
[]
[]
[]
[]
[]
[]
[]
[]
[]
[]
[]
[]
[]
[]
[]
[]
[]
[]
[]
[]
[]
[]
[]
[]
[]
[]
[]
[]
[]
[]
[]
[]
[]
[]
[]
[]
[]
[]
[]
[]
[]
[]
[]
[]
[]
[]
[]
[]
[]
[]
[]
[]
[]
[]
[]
[]
[]
[]
[]
[]
[]
[]
[]
[]
[]
[]
[]
[]
[]
[]
[]
[]
[]
[]
[]
[]
[]
[]
[]
[]
[]
[]
[]
[]
[]
[]
[]
[]
[]
[]
[]
[]
[]
[]
[]
[]
[]
[]
[]
[]
[]
[]
[]
[]
[]
[]
[]
[]
[]
[]
[]
[]
[]
[]
[]
[]
[]
[]
[]
[]
[]
[]
[]
[]
[]
[]
[]
[]
[]
[]
[]
[]
[]
[]
[]
[]
[]
[]
[]
[]
[]
[]
[]
[]
[]
[]
[]
[]
[]
[]
[]
[]
[]
[]
[]
[]
[]
[]
[]
[]
[]
[]
[]
[]
[]
[]
[]
[]
[]
[]
[]
[]
[]
[]
[]
[]
[]
[]
[]
[]
[]
[]
[]
[]
[]
[]
[]
[]
[]
[]
[]
[]
[]
[]
[]
[]
[]
[]
[]
[]
[]
[]
[]
[]
[]
[]
[]
[]
[]
[]
[]
[]
[]
[]
[]
[]
[]
[]
[]
[]
[]
[]
[]
[]
[]
[]
[]
[]
[]
[]
[]
[]
[]
[]
[]
[]
[]
[]
[]
[]
[]
[]
[]
[]
[]
[]
[]
[]
[]
[]
[]
[]
[]
[]
[]
[]
[]
[]
[]
[]
[]
[]
[]
[]
[]
[]
[]
[]
[]
[]
[]
[]
[]
[]
[]
[]
[]
[]
[]
[]
[]
[]
[]
[]
[]
[]
[]
[]
[]
[]
[]
[]
[]
[]
[]
[]
[]
[]
[]
[]
[]
[]
[]
[]
[]
[]
[]
[]
[]
[]
[]
[]
[]
[]
[]
[]
[]
[]
[]
[]
[]
[]
[]
[]
[]
[]
[]
[]
[]
[]
[]
[]
[]
[]
[]
[]
[]
[]
[]
[]
[]
[]
[]
[]
[]
[]
[]
[]
[]
[]
[]
[]
[]
[]
[]
[]
[]
[]
[]
[]
[]
[]
[]
[]
[]
[]
[]
[]
[]
[]
[]
[]
[]
[]
[]
[]
[]
[]
[]
[]
[]
[]
[]
[]
[]
[]
[]
[]
[]
[]
[]
[]
[]
[]
[]
[]
[]
[]
[]
[]
[]
[]
[]
[]
[]
[]
[]
[]
[]
[]
[]
[]
[]
[]
[]
[]
[]
[]
[]
[]
[]
[]
[]
[]
[]
[]
[]
[]
[]
[]
[]
[]
[]
[]
[]
[]
[]
[]
[]
[]
[]
[]
[]
[]
[]
[]
[]
[]
[]
[]
[]
[]
[]
[]
[]
[]
[]
[]
[]
[]
[]
[]
[]
[]
[]
[]
[]
[]
[]
[]
[]
[]
[]
[]
[]
[]
[]
[]
[]
[]
[]
[]
[]
[]
[]
[]
[]
[]
[]
[]
[]
[]
[]
[]
[]
[]
[]
[]
[]
[]
[]
[]
[]
[]
[]
[]
[]
[]
[]
[]
[]
[]
[]
[]
[]
[]
[]
[]
[]
[]
[]
[]
[]
[]
[]
[]
[]
[]
[]
[]
[]
[]
[]
[]
[]
[]
[]
[]
[]
[]
[]
[]
[]
[]
[]
[]
[]
[]
[]
[]
[]
[]
[]
[]
[]
[]
[]
[]
[]
[]
[]
[]
[]
[]
[]
[]
[]
[]
[]
[]
[]
[]
[]
[]
[]
[]
[]
[]
[]
[]
[]
[]
[]
[]
[]
[]
[]
[]
[]
[]
[]
[]
[]
[]
[]
[]
[]
[]
[]
[]
[]
[]
[]
[]
[]
[]
[]
[]
[]
[]
[]
[]
[]
[]
[]
[]
[]
[]
[]
[]
[]
[]
[]
[]
[]
[]
[]
[]
[]
[]
[]
[]
[]
[]
[]
[]
[]
[]
[]
[]
[]
[]
[]
[]
[]
[]
[]
[]
[]
[]
[]
[]
[]
[]
[]
[]
[]
[]
[]
[]
[]
[]
[]
[]
[]
[]
[]
[]
[]
[]
[]
[]
[]
[]
[]
[]
[]
[]
[]
[]
[]
[]
[]
[]
[]
[]
[]
[]
[]
[]
[]
[]
[]
[]
[]
[]
[]
[]
[]
[]
[]
[]
[]
[]
[]
[]
[]
[]
[]
[]
[]
[]
[]
[]
[]
[]
[]
[]
[]
[]
[]
[]
[]
[]
[]
[]
[]
[]
[]
[]
[]
[]
[]
[]
[]
[]
[]
[]
[]
[]
[]
[]
[]
[]
[]
[]
[]
[]
[]
[]
[]
[]
[]
[]
[]
[]
[]
[]
[]
[]
[]
[]
[]
[]
[]
[]
[]
[]
[]
[]
[]
[]
[]
[]
[]
[]
[]
[]
[]
[]
[]
[]
[]
[]
[]
[]
[]
[]
[]
[]
[]
[]
[]
[]
[]
[]
[]
[]
[]
[]
[]
[]
[]
[]
[]
[]
[]
[]
[]
[]
[]
[]
[]
[]
[]
[]
[]
[]
[]
[]
[]
[]
[]
[]
[]
[]
[]
[]
[]
[]
[]
[]
[]
[]
[]
[]
[]
[]
[]
[]
[]
[]
[]
[]
[]
[]
[]
[]
[]
[]
[]
[]
[]
[]
[]
[]
[]
[]
[]
[]
[]
[]
[]
[]
[]
[]
[]
[]
[]
[]
[]
[]
[]
[]
[]
[]
[]
[]
[]
[]
[]
[]
[]
[]
[]
[]
[]
[]
[]
[]
[]
[]
[]
[]
[]
[]
[]
[]
[]
[]
[]
[]
[]
[]
[]
[]
[]
[]
[]
[]
[]
[]
[]
[]
[]
[]
[]
[]
[]
[]
[]
[]
[]
[]
[]
[]
[]
[]
[]
[]
[]
[]
[]
[]
[]
[]
[]
[]
[]
[]
[]
[]
[]
[]
[]
[]
[]
[]
[]
[]
[]
[]
[]
[]
[]
[]
[]
[]
[]
[]
[]
[]
[]
[]
[]
[]
[]
[]
[]
[]
[]
[]
[]
[]
[]
[]
[]
[]
[]
[]
[]
[]
[]
[]
[]
[]
[]
[]
[]
[]
[]
[]
[]
[]
[]
[]
[]
[]
[]
[]
[]
[]
[]
[]
[]
[]
[]
[]
[]
[]
[]
[]
[]
[]
[]
[]
[]
[]
[]
[]
[]
[]
[]
[]
[]
[]
[]
[]
[]
[]
[]
[]
[]
[]
[]
[]
[]
[]
[]
[]
[]
[]
[]
[]
[]
[]
[]
[]
[]
[]
[]
[]
[]
[]
[]
[]
[]
[]
[]
[]
[]
[]
[]
[]
[]
[]
[]
[]
[]
[]
[]
[]
[]
[]
[]
[]
[]
[]
[]
[]
[]
[]
[]
[]
[]
[]
[]
[]
[]
[]
[]
[]
[]
[]
[]
[]
[]
[]
[]
[]
[]
[]
[]
[]
[]
[]
[]
[]
[]
[]
[]
[]
[]
[]
[]
[]
[]
[]
[]
[]
[]
[]
[]
[]
[]
[]
[]
[]
[]
[]
[]
[]
[]
[]
[]
[]
[]
[]
[]
[]
[]
[]
[]
[]
[]
[]
[]
[]
[]
[]
[]
[]
[]
[]
[]
[]
[]
[]
[]
[]
[]
[]
[]
[]
[]
[]
[]
[]
[]
[]
[]
[]
[]
[]
[]
[]
[]
[]
[]
[]
[]
[]
[]
[]
[]
[]
[]
[]
[]
[]
[]
[]
[]
[]
[]
[]
[]
[]
[]
[]
[]
[]
[]
[]
[]
[]
[]
[]
[]
[]
[]
[]
[]
[]
[]
[]
[]
[]
[]
[]
[]
[]
[]
[]
[]
[]
[]
[]
[]
[]
[]
[]
[]
[]
[]
[]
[]
[]
[]
[]
[]
[]
[]
[]
[]
[]
[]
[]
[]
[]
[]
[]
[]
[]
[]
[]
[]
[]
[]
[]
[]
[]
[]
[]
[]
[]
[]
[]
[]
[]
[]
[]
[]
[]
[]
[]
[]
[]
[]
[]
[]
[]
[]
[]
[]
[]
[]
[]
[]
[]
[]
[]
[]
[]
[]
[]
[]
[]
[]
[]
[]
[]
[]
[]
[]
[]
[]
[]
[]
[]
[]
[]
[]
[]
[]
[]
[]
[]
[]
[]
[]
[]
[]
[]
[]
[]
[]
[]
[]
[]
[]
[]
[]
[]
[]
[]
[]
[]
[]
[]
[]
[]
[]
[]
[]
[]
[]
[]
[]
[]
[]
[]
[]
[]
[]
[]
[]
[]
[]
[]
[]
[]
[]
[]
[]
[]
[]
[]
[]
[]
[]
[]
[]
[]
[]
[]
[]
[]
[]
[]
[]
[]
[]
[]
[]
[]
[]
[]
[]
[]
[]
[]
[]
[]
[]
[]
[]
[]
[]
[]
[]
[]
[]
[]
[]
[]
[]
[]
[]
[]
[]
[]
[]
[]
[]
[]
[]
[]
[]
[]
[]
[]
[]
[]
[]
[]
[]
[]
[]
[]
[]
[]
[]
[]
[]
[]
[]
[]
[]
[]
[]
[]
[]
[]
[]
[]
[]
[]
[]
[]
[]
[]
[]
[]
[]
[]
[]
[]
[]
[]
[]
[]
[]
[]
[]
[]
[]
[]
[]
[]
[]
[]
[]
[]
[]
[]
[]
[]
[]
[]
[]
[]
[]
[]
[]
[]
[]
[]
[]
[]
[]
[]
[]
[]
[]
[]
[]
[]
[]
[]
[]
[]
[]
[]
[]
[]
[]
[]
[]
[]
[]
[]
[]
[]
[]
[]
[]
[]
[]
[]
[]
[]
[]
[]
[]
[]
[]
[]
[]
[]
[]
[]
[]
[]
[]
[]
[]
[]
[]
[]
[]
[]
[]
[]
[]
[]
[]
[]
[]
[]
[]
[]
[]
[]
[]
[]
[]
[]
[]
[]
[]
[]
[]
[]
[]
[]
[]
[]
[]
[]
[]
[]
[]
[]
[]
[]
[]
[]
[]
[]
[]
[]
[]
[]
[]
[]
[]
[]
[]
[]
[]
[]
[]
[]
[]
[]
[]
[]
[]
[]
[]
[]
[]
[]
[]
[]
[]
[]
[]
[]
[]
[]
[]
[]
[]
[]
[]
[]
[]
[]
[]
[]
[]
[]
[]
[]
[]
[]
[]
[]
[]
[]
[]
[]
[]
[]
[]
[]
[]
[]
[]
[]
[]
[]
[]
[]
[]
[]
[]
[]
[]
[]
[]
[]
[]
[]
[]
[]
[]
[]
[]
[]
[]
[]
[]
[]
[]
[]
[]
[]
[]
[]
[]
[]
[]
[]
[]
[]
[]
[]
[]
[]
[]
[]
[]
[]
[]
[]
[]
[]
[]
[]
[]
[]
[]
[]
[]
[]
[]
[]
[]
[]
[]
[]
[]
[]
[]
[]
[]
[]
[]
[]
[]
[]
[]
[]
[]
[]
[]
[]
[]
[]
[]
[]
[]
[]
[]
[]
[]
[]
[]
[]
[]
[]
[]
[]
[]
[]
[]
[]
[]
[]
[]
[]
[]
[]
[]
[]
[]
[]
[]
[]
[]
[]
[]
[]
[]
[]
[]
[]
[]
[]
[]
[]
[]
[]
[]
[]
[]
[]
[]
[]
[]
[]
[]
[]
[]
[]
[]
[]
[]
[]
[]
[]
[]
[]
[]
[]
[]
[]
[]
[]
[]
[]
[]
[]
[]
[]
[]
[]
[]
[]
[]
[]
[]
[]
[]
[]
[]
[]
[]
[]
[]
[]
[]
[]
[]
[]
[]
[]
[]
[]
[]
[]
[]
[]
[]
[]
[]
[]
[]
[]
[]
[]
[]
[]
[]
[]
[]
[]
[]
[]
[]
[]
[]
[]
[]
[]
[]
[]
[]
[]
[]
[]
[]
[]
[]
[]
[]
[]
[]
[]
[]
[]
[]
[]
[]
[]
[]
[]
[]
[]
[]
[]
[]
[]
[]
[]
[]
[]
[]
[]
[]
[]
[]
[]
[]
[]
[]
[]
[]
[]
[]
[]
[]
[]
[]
[]
[]
[]
[]
[]
[]
[]
[]
[]
[]
[]
[]
[]
[]
[]
[]
[]
[]
[]
[]
[]
[]
[]
[]
[]
[]
[]
[]
[]
[]
[]
[]
[]
[]
[]
[]
[]
[]
[]
[]
[]
[]
[]
[]
[]
[]
[]
[]
[]
[]
[]
[]
[]
[]
[]
[]
[]
[]
[]
[]
[]
[]
[]
[]
[]
[]
[]
[]
[]
[]
[]
[]
[]
[]
[]
[]
[]
[]
[]
[]
[]
[]
[]
[]
[]
[]
[]
[]
[]
[]
[]
[]
[]
[]
[]
[]
[]
[]
[]
[]
[]
[]
[]
[]
[]
[]
[]
[]
[]
[]
[]
[]
[]
[]
[]
[]
[]
[]
[]
[]
[]
[]
[]
[]
[]
[]
[]
[]
[]
[]
[]
[]
[]
[]
[]
[]
[]
[]
[]
[]
[]
[]
[]
[]
[]
[]
[]
[]
[]
[]
[]
[]
[]
[]
[]
[]
[]
[]
[]
[]
[]
[]
[]
[]
[]
[]
[]
[]
[]
[]
[]
[]
[]
[]
[]
[]
[]
[]
[]
[]
[]
[]
[]
[]
[]
[]
[]
[]
[]
[]
[]
[]
[]
[]
[]
[]
[]
[]
[]
[]
[]
[]
[]
[]
[]
[]
[]
[]
[]
[]
[]
[]
[]
[]
[]
[]
[]
[]
[]
[]
[]
[]
[]
[]
[]
[]
[]
[]
[]
[]
[]
[]
[]
[]
[]
[]
[]
[]
[]
[]
[]
[]
[]
[]
[]
[]
[]
[]
[]
[]
[]
[]
[]
[]
[]
[]
[]
[]
[]
[]
[]
[]
[]
[]
[]
[]
[]
[]
[]
[]
[]
[]
[]
[]
[]
[]
[]
[]
[]
[]
[]
[]
[]
[]
[]
[]
[]
[]
[]
[]
[]
[]
[]
[]
[]
[]
[]
[]
[]
[]
[]
[]
[]
[]
[]
[]
[]
[]
[]
[]
[]
[]
[]
[]
[]
[]
[]
[]
[]
[]
[]
[]
[]
[]
[]
[]
[]
[]
[]
[]
[]
[]
[]
[]
[]
[]
[]
[]
[]
[]
[]
[]
[]
[]
[]
[]
[]
[]
[]
[]
[]
[]
[]
[]
[]
[]
[]
[]
[]
[]
[]
[]
[]
[]
[]
[]
[]
[]
[]
[]
[]
[]
[]
[]
[]
[]
[]
[]
[]
[]
[]
[]
[]
[]
[]
[]
[]
[]
[]
[]
[]
[]
[]
[]
[]
[]
[]
[]
[]
[]
[]
[]
[]
[]
[]
[]
[]
[]
[]
[]
[]
[]
[]
[]
[]
[]
[]
[]
[]
[]
[]
[]
[]
[]
[]
[]
[]
[]
[]
[]
[]
[]
[]
[]
[]
[]
[]
[]
[]
[]
[]
[]
[]
[]
[]
[]
[]
[]
[]
[]
[]
[]
[]
[]
[]
[]
[]
[]
[]
[]
[]
[]
[]
[]
[]
[]
[]
[]
[]
[]
[]
[]
[]
[]
[]
[]
[]
[]
[]
[]
[]
[]
[]
[]
[]
[]
[]
[]
[]
[]
[]
[]
[]
[]
[]
[]
[]
[]
[]
[]
[]
[]
[]
[]
[]
[]
[]
[]
[]
[]
[]
[]
[]
[]
[]
[]
[]
[]
[]
[]
[]
[]
[]
[]
[]
[]
[]
[]
[]
[]
[]
[]
[]
[]
[]
[]
[]
[]
[]
[]
[]
[]
[]
[]
[]
[]
[]
[]
[]
[]
[]
[]
[]
[]
[]
[]
[]
[]
[]
[]
[]
[]
[]
[]
[]
[]
[]
[]
[]
[]
[]
[]
[]
[]
[]
[]
[]
[]
[]
[]
[]
[]
[]
[]
[]
[]
[]
[]
[]
[]
[]
[]
[]
[]
[]
[]
[]
[]
[]
[]
[]
[]
[]
[]
[]
[]
[]
[]
[]
[]
[]
[]
[]
[]
[]
[]
[]
[]
[]
[]
[]
[]
[]
[]
[]
[]
[]
[]
[]
[]
[]
[]
[]
[]
[]
[]
[]
[]
[]
[]
[]
[]
[]
[]
[]
[]
[]
[]
[]
[]
[]
[]
[]
[]
[]
[]
[]
[]
[]
[]
[]
[]
[]
[]
[]
[]
[]
[]
[]
[]
[]
[]
[]
[]
[]
[]
[]
[]
[]
[]
[]
[]
[]
[]
[]
[]
[]
[]
[]
[]
[]
[]
[]
[]
[]
[]
[]
[]
[]
[]
[]
[]
[]
[]
[]
[]
[]
[]
[]
[]
[]
[]
[]
[]
[]
[]
[]
[]
[]
[]
[]
[]
[]
[]
[]
[]
[]
[]
[]
[]
[]
[]
[]
[]
[]
[]
[]
[]
[]
[]
[]
[]
[]
[]
[]
[]
[]
[]
[]
[]
[]
[]
[]
[]
[]
[]
[]
[]
[]
[]
[]
[]
[]
[]
[]
[]
[]
[]
[]
[]
[]
[]
[]
[]
[]
[]
[]
[]
[]
[]
[]
[]
[]
[]
[]
[]
[]
[]
[]
[]
[]
[]
[]
[]
[]
[]
[]
[]
[]
[]
[]
[]
[]
[]
[]
[]
[]
[]
[]
[]
[]
[]
[]
[]
[]
[]
[]
[]
[]
[]
[]
[]
[]
[]
[]
[]
[]
[]
[]
[]
[]
[]
[]
[]
[]
[]
[]
[]
[]
[]
[]
[]
[]
[]
[]
[]
[]
[]
[]
[]
[]
[]
[]
[]
[]
[]
[]
[]
[]
[]
[]
[]
[]
[]
[]
[]
[]
[]
[]
[]
[]
[]
[]
[]
[]
[]
[]
[]
[]
[]
[]
[]
[]
[]
[]
[]
[]
[]
[]
[]
[]
[]
[]
[]
[]
[]
[]
[]
[]
[]
[]
[]
[]
[]
[]
[]
[]
[]
[]
[]
[]
[]
[]
[]
[]
[]
[]
[]
[]
[]
[]
[]
[]
[]
[]
[]
[]
[]
[]
[]
[]
[]
[]
[]
[]
[]
[]
[]
[]
[]
[]
[]
[]
[]
[]
[]
[]
[]
[]
[]
[]
[]
[]
[]
[]
[]
[]
[]
[]
[]
[]
[]
[]
[]
[]
[]
[]
[]
[]
[]
[]
[]
[]
[]
[]
[]
[]
[]
[]
[]
[]
[]
[]
[]
[]
[]
[]
[]
[]
[]
[]
[]
[]
[]
[]
[]
[]
[]
[]
[]
[]
[]
[]
[]
[]
[]
[]
[]
[]
[]
[]
[]
[]
[]
[]
[]
[]
[]
[]
[]
[]
[]
[]
[]
[]
[]
[]
[]
[]
[]
[]
[]
[]
[]
[]
[]
[]
[]
[]
[]
[]
[]
[]
[]
[]
[]
[]
[]
[]
[]
[]
[]
[]
[]
[]
[]
[]
[]
[]
[]
[]
[]
[]
[]
[]
[]
[]
[]
[]
[]
[]
[]
[]
[]
[]
[]
[]
[]
[]
[]
[]
[]
[]
[]
[]
[]
[]
[]
[]
[]
[]
[]
[]
[]
[]
[]
[]
[]
[]
[]
[]
[]
[]
[]
[]
[]
[]
[]
[]
[]
[]
[]
[]
[]
[]
[]
[]
[]
[]
[]
[]
[]
[]
[]
[]
[]
[]
[]
[]
[]
[]
[]
[]
[]
[]
[]
[]
[]
[]
[]
[]
[]
[]
[]
[]
[]
[]
[]
[]
[]
[]
[]
[]
[]
[]
[]
[]
[]
[]
[]
[]
[]
[]
[]
[]
[]
[]
[]
[]
[]
[]
[]
[]
[]
[]
[]
[]
[]
[]
[]
[]
[]
[]
[]
[]
[]
[]
[]
[]
[]
[]
[]
[]
[]
[]
[]
[]
[]
[]
[]
[]
[]
[]
[]
[]
[]
[]
[]
[]
[]
[]
[]
[]
[]
[]
[]
[]
[]
[]
[]
[]
[]
[]
[]
[]
[]
[]
[]
[]
[]
[]
[]
[]
[]
[]
[]
[]
[]
[]
[]
[]
[]
[]
[]
[]
[]
[]
[]
[]
[]
[]
[]
[]
[]
[]
[]
[]
[]
[]
[]
[]
[]
[]
[]
[]
[]
[]
[]
[]
[]
[]
[]
[]
[]
[]
[]
[]
[]
[]
[]
[]
[]
[]
[]
[]
[]
[]
[]
[]
[]
[]
[]
[]
[]
[]
[]
[]
[]
[]
[]
[]
[]
[]
[]
[]
[]
[]
[]
[]
[]
[]
[]
[]
[]
[]
[]
[]
[]
[]
[]
[]
[]
[]
[]
[]
[]
[]
[]
[]
[]
[]
[]
[]
[]
[]
[]
[]
[]
[]
[]
[]
[]
[]
[]
[]
[]
[]
[]
[]
[]
[]
[]
[]
[]
[]
[]
[]
[]
[]
[]
[]
[]
[]
[]
[]
[]
[]
[]
[]
[]
[]
[]
[]
[]
[]
[]
[]
[]
[]
[]
[]
[]
[]
[]
[]
[]
[]
[]
[]
[]
[]
[]
[]
[]
[]
[]
[]
[]
[]
[]
[]
[]
[]
[]
[]
[]
[]
[]
[]
[]
[]
[]
[]
[]
[]
[]
[]
[]
[]
[]
[]
[]
[]
[]
[]
[]
[]
[]
[]
[]
[]
[]
[]
[]
[]
[]
[]
[]
[]
[]
[]
[]
[]
[]
[]
[]
[]
[]
[]
[]
[]
[]
[]
[]
[]
[]
[]
[]
[]
[]
[]
[]
[]
[]
[]
[]
[]
[]
[]
[]
[]
[]
[]
[]
[]
[]
[]
[]
[]
[]
[]
[]
[]
[]
[]
[]
[]
[]
[]
[]
[]
[]
[]
[]
[]
[]
[]
[]
[]
[]
[]
[]
[]
[]
[]
[]
[]
[]
[]
[]
[]
[]
[]
[]
[]
[]
[]
[]
[]
[]
[]
[]
[]
[]
[]
[]
[]
[]
[]
[]
[]
[]
[]
[]
[]
[]
[]
[]
[]
[]
[]
[]
[]
[]
[]
[]
[]
[]
[]
[]
[]
[]
[]
[]
[]
[]
[]
[]
[]
[]
[]
[]
[]
[]
[]
[]
[]
[]
[]
[]
[]
[]
[]
[]
[]
[]
[]
[]
[]
[]
[]
[]
[]
[]
[]
[]
[]
[]
[]
[]
[]
[]
[]
[]
[]
[]
[]
[]
[]
[]
[]
[]
[]
[]
[]
[]
[]
[]
[]
[]
[]
[]
[]
[]
[]
[]
[]
[]
[]
[]
[]
[]
[]
[]
[]
[]
[]
[]
[]
[]
[]
[]
[]
[]
[]
[]
[]
[]
[]
[]
[]
[]
[]
[]
[]
[]
[]
[]
[]
[]
[]
[]
[]
[]
[]
[]
[]
[]
[]
[]
[]
[]
[]
[]
[]
[]
[]
[]
[]
[]
[]
[]
[]
[]
[]
[]
[]
[]
[]
[]
[]
[]
[]
[]
[]
[]
[]
[]
[]
[]
[]
[]
[]
[]
[]
[]
[]
[]
[]
[]
[]
[]
[]
[]
[]
[]
[]
[]
[]
[]
[]
[]
[]
[]
[]
[]
[]
[]
[]
[]
[]
[]
[]
[]
[]
[]
[]
[]
[]
[]
[]
[]
[]
[]
[]
[]
[]
[]
[]
[]
[]
[]
[]
[]
[]
[]
[]
[]
[]
[]
[]
[]
[]
[]
[]
[]
[]
[]
[]
[]
[]
[]
[]
[]
[]
[]
[]
[]
[]
[]
[]
[]
[]
[]
[]
[]
[]
[]
[]
[]
[]
[]
[]
[]
[]
[]
[]
[]
[]
[]
[]
[]
[]
[]
[]
[]
[]
[]
[]
[]
[]
[]
[]
[]
[]
[]
[]
[]
[]
[]
[]
[]
[]
[]
[]
[]
[]
[]
[]
[]
[]
[]
[]
[]
[]
[]
[]
[]
[]
[]
[]
[]
[]
[]
[]
[]
[]
[]
[]
[]
[]
[]
[]
[]
[]
[]
[]
[]
[]
[]
[]
[]
[]
[]
[]
[]
[]
[]
[]
[]
[]
[]
[]
[]
[]
[]
[]
[]
[]
[]
[]
[]
[]
[]
[]
[]
[]
[]
[]
[]
[]
[]
[]
[]
[]
[]
[]
[]
[]
[]
[]
[]
[]
[]
[]
[]
[]
[]
[]
[]
[]
[]
[]
[]
[]
[]
[]
[]
[]
[]
[]
[]
[]
[]
[]
[]
[]
[]
[]
[]
[]
[]
[]
[]
[]
[]
[]
[]
[]
[]
[]
[]
[]
[]
[]
[]
[]
[]
[]
[]
[]
[]
[]
[]
[]
[]
[]
[]
[]
[]
[]
[]
[]
[]
[]
[]
[]
[]
[]
[]
[]
[]
[]
[]
[]
[]
[]
[]
[]
[]
[]
[]
[]
[]
[]
[]
[]
[]
[]
[]
[]
[]
[]
[]
[]
[]
[]
[]
[]
[]
[]
[]
[]
[]
[]
[]
[]
[]
[]
[]
[]
[]
[]
[]
[]
[]
[]
[]
[]
[]
[]
[]
[]
[]
[]
[]
[]
[]
[]
[]
[]
[]
[]
[]
[]
[]
[]
[]
[]
[]
[]
[]
[]
[]
[]
[]
[]
[]
[]
[]
[]
[]
[]
[]
[]
[]
[]
[]
[]
[]
[]
[]
[]
[]
[]
[]
[]
[]
[]
[]
[]
[]
[]
[]
[]
[]
[]
[]
[]
[]
[]
[]
[]
[]
[]
[]
[]
[]
[]
[]
[]
[]
[]
[]
[]
[]
[]
[]
[]
[]
[]
[]
[]
[]
[]
[]
[]
[]
[]
[]
[]
[]
[]
[]
[]
[]
[]
[]
[]
[]
[]
[]
[]
[]
[]
[]
[]
[]
[]
[]
[]
[]
[]
[]
[]
[]
[]
[]
[]
[]
[]
[]
[]
[]
[]
[]
[]
[]
[]
[]
[]
[]
[]
[]
[]
[]
[]
[]
[]
[]
[]
[]
[]
[]
[]
[]
[]
[]
[]
[]
[]
[]
[]
[]
[]
[]
[]
[]
[]
[]
[]
[]
[]
[]
[]
[]
[]
[]
[]
[]
[]
[]
[]
[]
[]
[]
[]
[]
[]
[]
[]
[]
[]
[]
[]
[]
[]
[]
[]
[]
[]
[]
[]
[]
[]
[]
[]
[]
[]
[]
[]
[]
[]
[]
[]
[]
[]
[]
[]
[]
[]
[]
[]
[]
[]
[]
[]
[]
[]
[]
[]
[]
[]
[]
[]
[]
[]
[]
[]
[]
[]
[]
[]
[]
[]
[]
[]
[]
[]
[]
[]
[]
[]
[]
[]
[]
[]
[]
[]
[]
[]
[]
[]
[]
[]
[]
[]
[]
[]
[]
[]
[]
[]
[]
[]
[]
[]
[]
[]
[]
[]
[]
[]
[]
[]
[]
[]
[]
[]
[]
[]
[]
[]
[]
[]
[]
[]
[]
[]
[]
[]
[]
[]
[]
[]
[]
[]
[]
[]
[]
[]
[]
[]
[]
[]
[]
[]
[]
[]
[]
[]
[]
[]
[]
[]
[]
[]
[]
[]
[]
[]
[]
[]
[]
[]
[]
[]
[]
[]
[]
[]
[]
[]
[]
[]
[]
[]
[]
[]
[]
[]
[]
[]
[]
[]
[]
[]
[]
[]
[]
[]
[]
[]
[]
[]
[]
[]
[]
[]
[]
[]
[]
[]
[]
[]
[]
[]
[]
[]
[]
[]
[]
[]
[]
[]
[]
[]
[]
[]
[]
[]
[]
[]
[]
[]
[]
[]
[]
[]
[]
[]
[]
[]
[]
[]
[]
[]
[]
[]
[]
[]
[]
[]
[]
[]
[]
[]
[]
[]
[]
[]
[]
[]
[]
[]
[]
[]
[]
[]
[]
[]
[]
[]
[]
[]
[]
[]
[]
[]
[]
[]
[]
[]
[]
[]
[]
[]
[]
[]
[]
[]
[]
[]
[]
[]
[]
[]
[]
[]
[]
[]
[]
[]
[]
[]
[]
[]
[]
[]
[]
[]
[]
[]
[]
[]
[]
[]
[]
[]
[]
[]
[]
[]
[]
[]
[]
[]
[]
[]
[]
[]
[]
[]
[]
[]
[]
[]
[]
[]
[]
[]
[]
[]
[]
[]
[]
[]
[]
[]
[]
[]
[]
[]
[]
[]
[]
[]
[]
[]
[]
[]
[]
[]
[]
[]
[]
[]
[]
[]
[]
[]
[]
[]
[]
[]
[]
[]
[]
[]
[]
[]
[]
[]
[]
[]
[]
[]
[]
[]
[]
[]
[]
[]
[]
[]
[]
[]
[]
[]
[]
[]
[]
[]
[]
[]
[]
[]
[]
[]
[]
[]
[]
[]
[]
[]
[]
[]
[]
[]
[]
[]
[]
[]
[]
[]
[]
[]
[]
[]
[]
[]
[]
[]
[]
[]
[]
[]
[]
[]
[]
[]
[]
[]
[]
[]
[]
[]
[]
[]
[]
[]
[]
[]
[]
[]
[]
[]
[]
[]
[]
[]
[]
[]
[]
[]
[]
[]
[]
[]
[]
[]
[]
[]
[]
[]
[]
[]
[]
[]
[]
[]
[]
[]
[]
[]
[]
[]
[]
[]
[]
[]
[]
[]
[]
[]
[]
[]
[]
[]
[]
[]
[]
[]
[]
[]
[]
[]
[]
[]
[]
[]
[]
[]
[]
[]
[]
[]
[]
[]
[]
[]
[]
[]
[]
[]
[]
[]
[]
[]
[]
[]
[]
[]
[]
[]
[]
[]
[]
[]
[]
[]
[]
[]
[]
[]
[]
[]
[]
[]
[]
[]
[]
[]
[]
[]
[]
[]
[]
[]
[]
[]
[]
[]
[]
[]
[]
[]
[]
[]
[]
[]
[]
[]
[]
[]
[]
[]
[]
[]
[]
[]
[]
[]
[]
[]
[]
[]
[]
[]
[]
[]
[]
[]
[]
[]
[]
[]
[]
[]
[]
[]
[]
[]
[]
[]
[]
[]
[]
[]
[]
[]
[]
[]
[]
[]
[]
[]
[]
[]
[]
[]
[]
[]
[]
[]
[]
[]
[]
[]
[]
[]
[]
[]
[]
[]
[]
[]
[]
[]
[]
[]
[]
[]
[]
[]
[]
[]
[]
[]
[]
[]
[]
[]
[]
[]
[]
[]
[]
[]
[]
[]
[]
[]
[]
[]
[]
[]
[]
[]
[]
[]
[]
[]
[]
[]
[]
[]
[]
[]
[]
[]
[]
[]
[]
[]
[]
[]
[]
[]
[]
[]
[]
[]
[]
[]
[]
[]
[]
[]
[]
[]
[]
[]
[]
[]
[]
[]
[]
[]
[]
[]
[]
[]
[]
[]
[]
[]
[]
[]
[]
[]
[]
[]
[]
[]
[]
[]
[]
[]
[]
[]
[]
[]
[]
[]
[]
[]
[]
[]
[]
[]
[]
[]
[]
[]
[]
[]
[]
[]
[]
[]
[]
[]
[]
[]
[]
[]
[]
[]
[]
[]
[]
[]
[]
[]
[]
[]
[]
[]
[]
[]
[]
[]
[]
[]
[]
[]
[]
[]
[]
[]
[]
[]
[]
[]
[]
[]
[]
[]
[]
[]
[]
[]
[]
[]
[]
[]
[]
[]
[]
[]
[]
[]
[]
[]
[]
[]
[]
[]
[]
[]
[]
[]
[]
[]
[]
[]
[]
[]
[]
[]
[]
[]
[]
[]
[]
[]
[]
[]
[]
[]
[]
[]
[]
[]
[]
[]
[]
[]
[]
[]
[]
[]
[]
[]
[]
[]
[]
[]
[]
[]
[]
[]
[]
[]
[]
[]
[]
[]
[]
[]
[]
[]
[]
[]
[]
[]
[]
[]
[]
[]
[]
[]
[]
[]
[]
[]
[]
[]
[]
[]
[]
[]
[]
[]
[]
[]
[]
[]
[]
[]
[]
[]
[]
[]
[]
[]
[]
[]
[]
[]
[]
[]
[]
[]
[]
[]
[]
[]
[]
[]
[]
[]
[]
[]
[]
[]
[]
[]
[]
[]
[]
[]
[]
[]
[]
[]
[]
[]
[]
[]
[]
[]
[]
[]
[]
[]
[]
[]
[]
[]
[]
[]
[]
[]
[]
[]
[]
[]
[]
[]
[]
[]
[]
[]
[]
[]
[]
[]
[]
[]
[]
[]
[]
[]
[]
[]
[]
[]
[]
[]
[]
[]
[]
[]
[]
[]
[]
[]
[]
[]
[]
[]
[]
[]
[]
[]
[]
[]
[]
[]
[]
[]
[]
[]
[]
[]
[]
[]
[]
[]
[]
[]
[]
[]
[]
[]
[]
[]
[]
[]
[]
[]
[]
[]
[]
[]
[]
[]
[]
[]
[]
[]
[]
[]
[]
[]
[]
[]
[]
[]
[]
[]
[]
[]
[]
[]
[]
[]
[]
[]
[]
[]
[]
[]
[]
[]
[]
[]
[]
[]
[]
[]
[]
[]
[]
[]
[]
[]
[]
[]
[]
[]
[]
[]
[]
[]
[]
[]
[]
[]
[]
[]
[]
[]
[]
[]
[]
[]
[]
[]
[]
[]
[]
[]
[]
[]
[]
[]
[]
[]
[]
[]
[]
[]
[]
[]
[]
[]
[]
[]
[]
[]
[]
[]
[]
[]
[]
[]
[]
[]
[]
[]
[]
[]
[]
[]
[]
[]
[]
[]
[]
[]
[]
[]
[]
[]
[]
[]
[]
[]
[]
[]
[]
[]
[]
[]
[]
[]
[]
[]
[]
[]
[]
[]
[]
[]
[]
[]
[]
[]
[]
[]
[]
[]
[]
[]
[]
[]
[]
[]
[]
[]
[]
[]
[]
[]
[]
[]
[]
[]
[]
[]
[]
[]
[]
[]
[]
[]
[]
[]
[]
[]
[]
[]
[]
[]
[]
[]
[]
[]
[]
[]
[]
[]
[]
[]
[]
[]
[]
[]
[]
[]
[]
[]
[]
[]
[]
[]
[]
[]
[]
[]
[]
[]
[]
[]
[]
[]
[]
[]
[]
[]
[]
[]
[]
[]
[]
[]
[]
[]
[]
[]
[]
[]
[]
[]
[]
[]
[]
[]
[]
[]
[]
[]
[]
[]
[]
[]
[]
[]
[]
[]
[]
[]
[]
[]
[]
[]
[]
[]
[]
[]
[]
[]
[]
[]
[]
[]
[]
[]
[]
[]
[]
[]
[]
[]
[]
[]
[]
[]
[]
[]
[]
[]
[]
[]
[]
[]
[]
[]
[]
[]
[]
[]
[]
[]
[]
[]
[]
[]
[]
[]
[]
[]
[]
[]
[]
[]
[]
[]
[]
[]
[]
[]
[]
[]
[]
[]
[]
[]
[]
[]
[]
[]
[]
[]
[]
[]
[]
[]
[]
[]
[]
[]
[]
[]
[]
[]
[]
[]
[]
[]
[]
[]
[]
[]
[]
[]
[]
[]
[]
[]
[]
[]
[]
[]
[]
[]
[]
[]
[]
[]
[]
[]
[]
[]
[]
[]
[]
[]
[]
[]
[]
[]
[]
[]
[]
[]
[]
[]
[]
[]
[]
[]
[]
[]
[]
[]
[]
[]
[]
[]
[]
[]
[]
[]
[]
[]
[]
[]
[]
[]
[]
[]
[]
[]
[]
[]
[]
[]
[]
[]
[]
[]
[]
[]
[]
[]
[]
[]
[]
[]
[]
[]
[]
[]
[]
[]
[]
[]
[]
[]
[]
[]
[]
[]
[]
[]
[]
[]
[]
[]
[]
[]
[]
[]
[]
[]
[]
[]
[]
[]
[]
[]
[]
[]
[]
[]
[]
[]
[]
[]
[]
[]
[]
[]
[]
[]
[]
[]
[]
[]
[]
[]
[]
[]
[]
[]
[]
[]
[]
[]
[]
[]
[]
[]
[]
[]
[]
[]
[]
[]
[]
[]
[]
[]
[]
[]
[]
[]
[]
[]
[]
[]
[]
[]
[]
[]
[]
[]
[]
[]
[]
[]
[]
[]
[]
[]
[]
[]
[]
[]
[]
[]
[]
[]
[]
[]
[]
[]
[]
[]
[]
[]
[]
[]
[]
[]
[]
[]
[]
[]
[]
[]
[]
[]
[]
[]
[]
[]
[]
[]
[]
[]
[]
[]
[]
[]
[]
[]
[]
[]
[]
[]
[]
[]
[]
[]
[]
[]
[]
[]
[]
[]
[]
[]
[]
[]
[]
[]
[]
[]
[]
[]
[]
[]
[]
[]
[]
[]
[]
[]
[]
[]
[]
[]
[]
[]
[]
[]
[]
[]
[]
[]
[]
[]
[]
[]
[]
[]
[]
[]
[]
[]
[]
[]
[]
[]
[]
[]
[]
[]
[]
[]
[]
[]
[]
[]
[]
[]
[]
[]
[]
[]
[]
[]
[]
[]
[]
[]
[]
[]
[]
[]
[]
[]
[]
[]
[]
[]
[]
[]
[]
[]
[]
[]
[]
[]
[]
[]
[]
[]
[]
[]
[]
[]
[]
[]
[]
[]
[]
[]
[]
[]
[]
[]
[]
[]
[]
[]
[]
[]
[]
[]
[]
[]
[]
[]
[]
[]
[]
[]
[]
[]
[]
[]
[]
[]
[]
[]
[]
[]
[]
[]
[]
[]
[]
[]
[]
[]
[]
[]
[]
[]
[]
[]
[]
[]
[]
[]
[]
[]
[]
[]
[]
[]
[]
[]
[]
[]
[]
[]
[]
[]
[]
[]
[]
[]
[]
[]
[]
[]
[]
[]
[]
[]
[]
[]
[]
[]
[]
[]
[]
[]
[]
[]
[]
[]
[]
[]
[]
[]
[]
[]
[]
[]
[]
[]
[]
[]
[]
[]
[]
[]
[]
[]
[]
[]
[]
[]
[]
[]
[]
[]
[]
[]
[]
[]
[]
[]
[]
[]
[]
[]
[]
[]
[]
[]
[]
[]
[]
[]
[]
[]
[]
[]
[]
[]
[]
[]
[]
[]
[]
[]
[]
[]
[]
[]
[]
[]
[]
[]
[]
[]
[]
[]
[]
[]
[]
[]
[]
[]
[]
[]
[]
[]
[]
[]
[]
[]
[]
[]
[]
[]
[]
[]
[]
[]
[]
[]
[]
[]
[]
[]
[]
[]
[]
[]
[]
[]
[]
[]
[]
[]
[]
[]
[]
[]
[]
[]
[]
[]
[]
[]
[]
[]
[]
[]
[]
[]
[]
[]
[]
[]
[]
[]
[]
[]
[]
[]
[]
[]
[]
[]
[]
[]
[]
[]
[]
[]
[]
[]
[]
[]
[]
[]
[]
[]
[]
[]
[]
[]
[]
[]
[]
[]
[]
[]
[]
[]
[]
[]
[]
[]
[]
[]
[]
[]
[]
[]
[]
[]
[]
[]
[]
[]
[]
[]
[]
[]
[]
[]
[]
[]
[]
[]
[]
[]
[]
[]
[]
[]
[]
[]
[]
[]
[]
[]
[]
[]
[]
[]
[]
[]
[]
[]
[]
[]
[]
[]
[]
[]
[]
[]
[]
[]
[]
[]
[]
[]
[]
[]
[]
[]
[]
[]
[]
[]
[]
[]
[]
[]
[]
[]
[]
[]
[]
[]
[]
[]
[]
[]
[]
[]
[]
[]
[]
[]
[]
[]
[]
[]
[]
[]
[]
[]
[]
[]
[]
[]
[]
[]
[]
[]
[]
[]
[]
[]
[]
[]
[]
[]
[]
[]
[]
[]
[]
[]
[]
[]
[]
[]
[]
[]
[]
[]
[]
[]
[]
[]
[]
[]
[]
[]
[]
[]
[]
[]
[]
[]
[]
[]
[]
[]
[]
[]
[]
[]
[]
[]
[]
[]
[]
[]
[]
[]
[]
[]
[]
[]
[]
[]
[]
[]
[]
[]
[]
[]
[]
[]
[]
[]
[]
[]
[]
[]
[]
[]
[]
[]
[]
[]
[]
[]
[]
[]
[]
[]
[]
[]
[]
[]
[]
[]
[]
[]
[]
[]
[]
[]
[]
[]
[]
[]
[]
[]
[]
[]
[]
[]
[]
[]
[]
[]
[]
[]
[]
[]
[]
[]
[]
[]
[]
[]
[]
[]
[]
[]
[]
[]
[]
[]
[]
[]
[]
[]
[]
[]
[]
[]
[]
[]
[]
[]
[]
[]
[]
[]
[]
[]
[]
[]
[]
[]
[]
[]
[]
[]
[]
[]
[]
[]
[]
[]
[]
[]
[]
[]
[]
[]
[]
[]
[]
[]
[]
[]
[]
[]
[]
[]
[]
[]
[]
[]
[]
[]
[]
[]
[]
[]
[]
[]
[]
[]
[]
[]
[]
[]
[]
[]
[]
[]
[]
[]
[]
[]
[]
[]
[]
[]
[]
[]
[]
[]
[]
[]
[]
[]
[]
[]
[]
[]
[]
[]
[]
[]
[]
[]
[]
[]
[]
[]
[]
[]
[]
[]
[]
[]
[]
[]
[]
[]
[]
[]
[]
[]
[]
[]
[]
[]
[]
[]
[]
[]
[]
[]
[]
[]
[]
[]
[]
[]
[]
[]
[]
[]
[]
[]
[]
[]
[]
[]
[]
[]
[]
[]
[]
[]
[]
[]
[]
[]
[]
[]
[]
[]
[]
[]
[]
[]
[]
[]
[]
[]
[]
[]
[]
[]
[]
[]
[]
[]
[]
[]
[]
[]
[]
[]
[]
[]
[]
[]
[]
[]
[]
[]
[]
[]
[]
[]
[]
[]
[]
[]
[]
[]
[]
[]
[]
[]
[]
[]
[]
[]
[]
[]
[]
[]
[]
[]
[]
[]
[]
[]
[]
[]
[]
[]
[]
[]
[]
[]
[]
[]
[]
[]
[]
[]
[]
[]
[]
[]
[]
[]
[]
[]
[]
[]
[]
[]
[]
[]
[]
[]
[]
[]
[]
[]
[]
[]
[]
[]
[]
[]
[]
[]
[]
[]
[]
[]
[]
[]
[]
[]
[]
[]
[]
[]
[]
[]
[]
[]
[]
[]
[]
[]
[]
[]
[]
[]
[]
[]
[]
[]
[]
[]
[]
[]
[]
[]
[]
[]
[]
[]
[]
[]
[]
[]
[]
[]
[]
[]
[]
[]
[]
[]
[]
[]
[]
[]
[]
[]
[]
[]
[]
[]
[]
[]
[]
[]
[]
[]
[]
[]
[]
[]
[]
[]
[]
[]
[]
[]
[]
[]
[]
[]
[]
[]
[]
[]
[]
[]
[]
[]
[]
[]
[]
[]
[]
[]
[]
[]
[]
[]
[]
[]
[]
[]
[]
[]
[]
[]
[]
[]
[]
[]
[]
[]
[]
[]
[]
[]
[]
[]
[]
[]
[]
[]
[]
[]
[]
[]
[]
[]
[]
[]
[]
[]
[]
[]
[]
[]
[]
[]
[]
[]
[]
[]
[]
[]
[]
[]
[]
[]
[]
[]
[]
[]
[]
[]
[]
[]
[]
[]
[]
[]
[]
[]
[]
[]
[]
[]
[]
[]
[]
[]
[]
[]
[]
[]
[]
[]
[]
[]
[]
[]
[]
[]
[]
[]
[]
[]
[]
[]
[]
[]
[]
[]
[]
[]
[]
[]
[]
[]
[]
[]
[]
[]
[]
[]
[]
[]
[]
[]
[]
[]
[]
[]
[]
[]
[]
[]
[]
[]
[]
[]
[]
[]
[]
[]
[]
[]
[]
[]
[]
[]
[]
[]
[]
[]
[]
[]
[]
[]
[]
[]
[]
[]
[]
[]
[]
[]
[]
[]
[]
[]
[]
[]
[]
[]
[]
[]
[]
[]
[]
[]
[]
[]
[]
[]
[]
[]
[]
[]
[]
[]
[]
[]
[]
[]
[]
[]
[]
[]
[]
[]
[]
[]
[]
[]
[]
[]
[]
[]
[]
[]
[]
[]
[]
[]
[]
[]
[]
[]
[]
[]
[]
[]
[]
[]
[]
[]
[]
[]
[]
[]
[]
[]
[]
[]
[]
[]
[]
[]
[]
[]
[]
[]
[]
[]
[]
[]
[]
[]
[]
[]
[]
[]
[]
[]
[]
[]
[]
[]
[]
[]
[]
[]
[]
[]
[]
[]
[]
[]
[]
[]
[]
[]
[]
[]
[]
[]
[]
[]
[]
[]
[]
[]
[]
[]
[]
[]
[]
[]
[]
[]
[]
[]
[]
[]
[]
[]
[]
[]
[]
[]
[]
[]
[]
[]
[]
[]
[]
[]
[]
[]
[]
[]
[]
[]
[]
[]
[]
[]
[]
[]
[]
[]
[]
[]
[]
[]
[]
[]
[]
[]
[]
[]
[]
[]
[]
[]
[]
[]
[]
[]
[]
[]
[]
[]
[]
[]
[]
[]
[]
[]
[]
[]
[]
[]
[]
[]
[]
[]
[]
[]
[]
[]
[]
[]
[]
[]
[]
[]
[]
[]
[]
[]
[]
[]
[]
[]
[]
[]
[]
[]
[]
[]
[]
[]
[]
[]
[]
[]
[]
[]
[]
[]
[]
[]
[]
[]
[]
[]
[]
[]
[]
[]
[]
[]
[]
[]
[]
[]
[]
[]
[]
[]
[]
[]
[]
[]
[]
[]
[]
[]
[]
[]
[]
[]
[]
[]
[]
[]
[]
[]
[]
[]
[]
[]
[]
[]
[]
[]
[]
[]
[]
[]
[]
[]
[]
[]
[]
[]
[]
[]
[]
[]
[]
[]
[]
[]
[]
[]
[]
[]
[]
[]
[]
[]
[]
[]
[]
[]
[]
[]
[]
[]
[]
[]
[]
[]
[]
[]
[]
[]
[]
[]
[]
[]
[]
[]
[]
[]
[]
[]
[]
[]
[]
[]
[]
[]
[]
[]
[]
[]
[]
[]
[]
[]
[]
[]
[]
[]
[]
[]
[]
[]
[]
[]
[]
[]
[]
[]
[]
[]
[]
[]
[]
[]
[]
[]
[]
[]
[]
[]
[]
[]
[]
[]
[]
[]
[]
[]
[]
[]
[]
[]
[]
[]
[]
[]
[]
[]
[]
[]
[]
[]
[]
[]
[]
[]
[]
[]
[]
[]
[]
[]
[]
[]
[]
[]
[]
[]
[]
[]
[]
[]
[]
[]
[]
[]
[]
[]
[]
[]
[]
[]
[]
[]
[]
[]
[]
[]
[]
[]
[]
[]
[]
[]
[]
[]
[]
[]
[]
[]
[]
[]
[]
[]
[]
[]
[]
[]
[]
[]
[]
[]
[]
[]
[]
[]
[]
[]
[]
[]
[]
[]
[]
[]
[]
[]
[]
[]
[]
[]
[]
[]
[]
[]
[]
[]
[]
[]
[]
[]
[]
[]
[]
[]
[]
[]
[]
[]
[]
[]
[]
[]
[]
[]
[]
[]
[]
[]
[]
[]
[]
[]
[]
[]
[]
[]
[]
[]
[]
[]
[]
[]
[]
[]
[]
[]
[]
[]
[]
[]
[]
[]
[]
[]
[]
[]
[]
[]
[]
[]
[]
[]
[]
[]
[]
[]
[]
[]
[]
[]
[]
[]
[]
[]
[]
[]
[]
[]
[]
[]
[]
[]
[]
[]
[]
[]
[]
[]
[]
[]
[]
[]
[]
[]
[]
[]
[]
[]
[]
[]
[]
[]
[]
[]
[]
[]
[]
[]
[]
[]
[]
[]
[]
[]
[]
[]
[]
[]
[]
[]
[]
[]
[]
[]
[]
[]
[]
[]
[]
[]
[]
[]
[]
[]
[]
[]
[]
[]
[]
[]
[]
[]
[]
[]
[]
[]
[]
[]
[]
[]
[]
[]
[]
[]
[]
[]
[]
[]
[]
[]
[]
[]
[]
[]
[]
[]
[]
[]
[]
[]
[]
[]
[]
[]
[]
[]
[]
[]
[]
[]
[]
[]
[]
[]
[]
[]
[]
[]
[]
[]
[]
[]
[]
[]
[]
[]
[]
[]
[]
[]
[]
[]
[]
[]
[]
[]
[]
[]
[]
[]
[]
[]
[]
[]
[]
[]
[]
[]
[]
[]
[]
[]
[]
[]
[]
[]
[]
[]
[]
[]
[]
[]
[]
[]
[]
[]
[]
[]
[]
[]
[]
[]
[]
[]
[]
[]
[]
[]
[]
[]
[]
[]
[]
[]
[]
[]
[]
[]
[]
[]
[]
[]
[]
[]
[]
[]
[]
[]
[]
[]
[]
[]
[]
[]
[]
[]
[]
[]
[]
[]
[]
[]
[]
[]
[]
[]
[]
[]
[]
[]
[]
[]
[]
[]
[]
[]
[]
[]
[]
[]
[]
[]
[]
[]
[]
[]
[]
[]
[]
[]
[]
[]
[]
[]
[]
[]
[]
[]
[]
[]
[]
[]
[]
[]
[]
[]
[]
[]
[]
[]
[]
[]
[]
[]
[]
[]
[]
[]
[]
[]
[]
[]
[]
[]
[]
[]
[]
[]
[]
[]
[]
[]
[]
[]
[]
[]
[]
[]
[]
[]
[]
[]
[]
[]
[]
[]
[]
[]
[]
[]
[]
[]
[]
[]
[]
[]
[]
[]
[]
[]
[]
[]
[]
[]
[]
[]
[]
[]
[]
[]
[]
[]
[]
[]
[]
[]
[]
[]
[]
[]
[]
[]
[]
[]
[]
[]
[]
[]
[]
[]
[]
[]
[]
[]
[]
[]
[]
[]
[]
[]
[]
[]
[]
[]
[]
[]
[]
[]
[]
[]
[]
[]
[]
[]
[]
[]
[]
[]
[]
[]
[]
[]
[]
[]
[]
[]
[]
[]
[]
[]
[]
[]
[]
[]
[]
[]
[]
[]
[]
[]
[]
[]
[]
[]
[]
[]
[]
[]
[]
[]
[]
[]
[]
[]
[]
[]
[]
[]
[]
[]
[]
[]
[]
[]
[]
[]
[]
[]
[]
[]
[]
[]
[]
[]
[]
[]
[]
[]
[]
[]
[]
[]
[]
[]
[]
[]
[]
[]
[]
[]
[]
[]
[]
[]
[]
[]
[]
[]
[]
[]
[]
[]
[]
[]
[]
[]
[]
[]
[]
[]
[]
[]
[]
[]
[]
[]
[]
[]
[]
[]
[]
[]
[]
[]
[]
[]
[]
[]
[]
[]
[]
[]
[]
[]
[]
[]
[]
[]
[]
[]
[]
[]
[]
[]
[]
[]
[]
[]
[]
[]
[]
[]
[]
[]
[]
[]
[]
[]
[]
[]
[]
[]
[]
[]
[]
[]
[]
[]
[]
[]
[]
[]
[]
[]
[]
[]
[]
[]
[]
[]
[]
[]
[]
[]
[]
[]
[]
[]
[]
[]
[]
[]
[]
[]
[]
[]
[]
[]
[]
[]
[]
[]
[]
[]
[]
[]
[]
[]
[]
[]
[]
[]
[]
[]
[]
[]
[]
[]
[]
[]
[]
[]
[]
[]
[]
[]
[]
[]
[]
[]
[]
[]
[]
[]
[]
[]
[]
[]
[]
[]
[]
[]
[]
[]
[]
[]
[]
[]
[]
[]
[]
[]
[]
[]
[]
[]
[]
[]
[]
[]
[]
[]
[]
[]
[]
[]
[]
[]
[]
[]
[]
[]
[]
[]
[]
[]
[]
[]
[]
[]
[]
[]
[]
[]
[]
[]
[]
[]
[]
[]
[]
[]
[]
[]
[]
[]
[]
[]
[]
[]
[]
[]
[]
[]
[]
[]
[]
[]
[]
[]
[]
[]
[]
[]
[]
[]
[]
[]
[]
[]
[]
[]
[]
[]
[]
[]
[]
[]
[]
[]
[]
[]
[]
[]
[]
[]
[]
[]
[]
[]
[]
[]
[]
[]
[]
[]
[]
[]
[]
[]
[]
[]
[]
[]
[]
[]
[]
[]
[]
[]
[]
[]
[]
[]
[]
[]
[]
[]
[]
[]
[]
[]
[]
[]
[]
[]
[]
[]
[]
[]
[]
[]
[]
[]
[]
[]
[]
[]
[]
[]
[]
[]
[]
[]
[]
[]
[]
[]
[]
[]
[]
[]
[]
[]
[]
[]
[]
[]
[]
[]
[]
[]
[]
[]
[]
[]
[]
[]
[]
[]
[]
[]
[]
[]
[]
[]
[]
[]
[]
[]
[]
[]
[]
[]
[]
[]
[]
[]
[]
[]
[]
[]
[]
[]
[]
[]
[]
[]
[]
[]
[]
[]
[]
[]
[]
[]
[]
[]
[]
[]
[]
[]
[]
[]
[]
[]
[]
[]
[]
[]
[]
[]
[]
[]
[]
[]
[]
[]
[]
[]
[]
[]
[]
[]
[]
[]
[]
[]
[]
[]
[]
[]
[]
[]
[]
[]
[]
[]
[]
[]
[]
[]
[]
[]
[]
[]
[]
[]
[]
[]
[]
[]
[]
[]
[]
[]
[]
[]
[]
[]
[]
[]
[]
[]
[]
[]
[]
[]
[]
[]
[]
[]
[]
[]
[]
[]
[]
[]
[]
[]
[]
[]
[]
[]
[]
[]
[]
[]
[]
[]
[]
[]
[]
[]
[]
[]
[]
[]
[]
[]
[]
[]
[]
[]
[]
[]
[]
[]
[]
[]
[]
[]
[]
[]
[]
[]
[]
[]
[]
[]
[]
[]
[]
[]
[]
[]
[]
[]
[]
[]
[]
[]
[]
[]
[]
[]
[]
[]
[]
[]
[]
[]
[]
[]
[]
[]
[]
[]
[]
[]
[]
[]
[]
[]
[]
[]
[]
[]
[]
[]
[]
[]
[]
[]
[]
[]
[]
[]
[]
[]
[]
[]
[]
[]
[]
[]
[]
[]
[]
[]
[]
[]
[]
[]
[]
[]
[]
[]
[]
[]
[]
[]
[]
[]
[]
[]
[]
[]
[]
[]
[]
[]
[]
[]
[]
[]
[]
[]
[]
[]
[]
[]
[]
[]
[]
[]
[]
[]
[]
[]
[]
[]
[]
[]
[]
[]
[]
[]
[]
[]
[]
[]
[]
[]
[]
[]
[]
[]
[]
[]
[]
[]
[]
[]
[]
[]
[]
[]
[]
[]
[]
[]
[]
[]
[]
[]
[]
[]
[]
[]
[]
[]
[]
[]
[]
[]
[]
[]
[]
[]
[]
[]
[]
[]
[]
[]
[]
[]
[]
[]
[]
[]
[]
[]
[]
[]
[]
[]
[]
[]
[]
[]
[]
[]
[]
[]
[]
[]
[]
[]
[]
[]
[]
[]
[]
[]
[]
[]
[]
[]
[]
[]
[]
[]
[]
[]
[]
[]
[]
[]
[]
[]
[]
[]
[]
[]
[]
[]
[]
[]
[]
[]
[]
[]
[]
[]
[]
[]
[]
[]
[]
[]
[]
[]
[]
[]
[]
[]
[]
[]
[]
[]
[]
[]
[]
[]
[]
[]
[]
[]
[]
[]
[]
[]
[]
[]
[]
[]
[]
[]
[]
[]
[]
[]
[]
[]
[]
[]
[]
[]
[]
[]
[]
[]
[]
[]
[]
[]
[]
[]
[]
[]
[]
[]
[]
[]
[]
[]
[]
[]
[]
[]
[]
[]
[]
[]
[]
[]
[]
[]
[]
[]
[]
[]
[]
[]
[]
[]
[]
[]
[]
[]
[]
[]
[]
[]
[]
[]
[]
[]
[]
[]
[]
[]
[]
[]
[]
[]
[]
[]
[]
[]
[]
[]
[]
[]
[]
[]
[]
[]
[]
[]
[]
[]
[]
[]
[]
[]
[]
[]
[]
[]
[]
[]
[]
[]
[]
[]
[]
[]
[]
[]
[]
[]
[]
[]
[]
[]
[]
[]
[]
[]
[]
[]
[]
[]
[]
[]
[]
[]
[]
[]
[]
[]
[]
[]
[]
[]
[]
[]
[]
[]
[]
[]
[]
[]
[]
[]
[]
[]
[]
[]
[]
[]
[]
[]
[]
[]
[]
[]
[]
[]
[]
[]
[]
[]
[]
[]
[]
[]
[]
[]
[]
[]
[]
[]
[]
[]
[]
[]
[]
[]
[]
[]
[]
[]
[]
[]
[]
[]
[]
[]
[]
[]
[]
[]
[]
[]
[]
[]
[]
[]
[]
[]
[]
[]
[]
[]
[]
[]
[]
[]
[]
[]
[]
[]
[]
[]
[]
[]
[]
[]
[]
[]
[]
[]
[]
[]
[]
[]
[]
[]
[]
[]
[]
[]
[]
[]
[]
[]
[]
[]
[]
[]
[]
[]
[]
[]
[]
[]
[]
[]
[]
[]
[]
[]
[]
[]
[]
[]
[]
[]
[]
[]
[]
[]
[]
[]
[]
[]
[]
[]
[]
[]
[]
[]
[]
[]
[]
[]
[]
[]
[]
[]
[]
[]
[]
[]
[]
[]
[]
[]
[]
[]
[]
[]
[]
[]
[]
[]
[]
[]
[]
[]
[]
[]
[]
[]
[]
[]
[]
[]
[]
[]
[]
[]
[]
[]
[]
[]
[]
[]
[]
[]
[]
[]
[]
[]
[]
[]
[]
[]
[]
[]
[]
[]
[]
[]
[]
[]
[]
[]
[]
[]
[]
[]
[]
[]
[]
[]
[]
[]
[]
[]
[]
[]
[]
[]
[]
[]
[]
[]
[]
[]
[]
[]
[]
[]
[]
[]
[]
[]
[]
[]
[]
[]
[]
[]
[]
[]
[]
[]
[]
[]
[]
[]
[]
[]
[]
[]
[]
[]
[]
[]
[]
[]
[]
[]
[]
[]
[]
[]
[]
[]
[]
[]
[]
[]
[]
[]
[]
[]
[]
[]
[]
[]
[]
[]
[]
[]
[]
[]
[]
[]
[]
[]
[]
[]
[]
[]
[]
[]
[]
[]
[]
[]
[]
[]
[]
[]
[]
[]
[]
[]
[]
[]
[]
[]
[]
[]
[]
[]
[]
[]
[]
[]
[]
[]
[]
[]
[]
[]
[]
[]
[]
[]
[]
[]
[]
[]
[]
[]
[]
[]
[]
[]
[]
[]
[]
[]
[]
[]
[]
[]
[]
[]
[]
[]
[]
[]
[]
[]
[]
[]
[]
[]
[]
[]
[]
[]
[]
[]
[]
[]
[]
[]
[]
[]
[]
[]
[]
[]
[]
[]
[]
[]
[]
[]
[]
[]
[]
[]
[]
[]
[]
[]
[]
[]
[]
[]
[]
[]
[]
[]
[]
[]
[]
[]
[]
[]
[]
[]
[]
[]
[]
[]
[]
[]
[]
[]
[]
[]
[]
[]
[]
[]
[]
[]
[]
[]
[]
[]
[]
[]
[]
[]
[]
[]
[]
[]
[]
[]
[]
[]
[]
[]
[]
[]
[]
[]
[]
[]
[]
[]
[]
[]
[]
[]
[]
[]
[]
[]
[]
[]
[]
[]
[]
[]
[]
[]
[]
[]
[]
[]
[]
[]
[]
[]
[]
[]
[]
[]
[]
[]
[]
[]
[]
[]
[]
[]
[]
[]
[]
[]
[]
[]
[]
[]
[]
[]
[]
[]
[]
[]
[]
[]
[]
[]
[]
[]
[]
[]
[]
[]
[]
[]
[]
[]
[]
[]
[]
[]
[]
[]
[]
[]
[]
[]
[]
[]
[]
[]
[]
[]
[]
[]
[]
[]
[]
[]
[]
[]
[]
[]
[]
[]
[]
[]
[]
[]
[]
[]
[]
[]
[]
[]
[]
[]
[]
[]
[]
[]
[]
[]
[]
[]
[]
[]
[]
[]
[]
[]
[]
[]
[]
[]
[]
[]
[]
[]
[]
[]
[]
[]
[]
[]
[]
[]
[]
[]
[]
[]
[]
[]
[]
[]
[]
[]
[]
[]
[]
[]
[]
[]
[]
[]
[]
[]
[]
[]
[]
[]
[]
[]
[]
[]
[]
[]
[]
[]
[]
[]
[]
[]
[]
[]
[]
[]
[]
[]
[]
[]
[]
[]
[]
[]
[]
[]
[]
[]
[]
[]
[]
[]
[]
[]
[]
[]
[]
[]
[]
[]
[]
[]
[]
[]
[]
[]
[]
[]
[]
[]
[]
[]
[]
[]
[]
[]
[]
[]
[]
[]
[]
[]
[]
[]
[]
[]
[]
[]
[]
[]
[]
[]
[]
[]
[]
[]
[]
[]
[]
[]
[]
[]
[]
[]
[]
[]
[]
[]
[]
[]
[]
[]
[]
[]
[]
[]
[]
[]
[]
[]
[]
[]
[]
[]
[]
[]
[]
[]
[]
[]
[]
[]
[]
[]
[]
[]
[]
[]
[]
[]
[]
[]
[]
[]
[]
[]
[]
[]
[]
[]
[]
[]
[]
[]
[]
[]
[]
[]
[]
[]
[]
[]
[]
[]
[]
[]
[]
[]
[]
[]
[]
[]
[]
[]
[]
[]
[]
[]
[]
[]
[]
[]
[]
[]
[]
[]
[]
[]
[]
[]
[]
[]
[]
[]
[]
[]
[]
[]
[]
[]
[]
[]
[]
[]
[]
[]
[]
[]
[]
[]
[]
[]
[]
[]
[]
[]
[]
[]
[]
[]
[]
[]
[]
[]
[]
[]
[]
[]
[]
[]
[]
[]
[]
[]
[]
[]
[]
[]
[]
[]
[]
[]
[]
[]
[]
[]
[]
[]
[]
[]
[]
[]
[]
[]
[]
[]
[]
[]
[]
[]
[]
[]
[]
[]
[]
[]
[]
[]
[]
[]
[]
[]
[]
[]
[]
[]
[]
[]
[]
[]
[]
[]
[]
[]
[]
[]
[]
[]
[]
[]
[]
[]
[]
[]
[]
[]
[]
[]
[]
[]
[]
[]
[]
[]
[]
[]
[]
[]
[]
[]
[]
[]
[]
[]
[]
[]
[]
[]
[]
[]
[]
[]
[]
[]
[]
[]
[]
[]
[]
[]
[]
[]
[]
[]
[]
[]
[]
[]
[]
[]
[]
[]
[]
[]
[]
[]
[]
[]
[]
[]
[]
[]
[]
[]
[]
[]
[]
[]
[]
[]
[]
[]
[]
[]
[]
[]
[]
[]
[]
[]
[]
[]
[]
[]
[]
[]
[]
[]
[]
[]
[]
[]
[]
[]
[]
[]
[]
[]
[]
[]
[]
[]
[]
[]
[]
[]
[]
[]
[]
[]
[]
[]
[]
[]
[]
[]
[]
[]
[]
[]
[]
[]
[]
[]
[]
[]
[]
[]
[]
[]
[]
[]
[]
[]
[]
[]
[]
[]
[]
[]
[]
[]
[]
[]
[]
[]
[]
[]
[]
[]
[]
[]
[]
[]
[]
[]
[]
[]
[]
[]
[]
[]
[]
[]
[]
[]
[]
[]
[]
[]
[]
[]
[]
[]
[]
[]
[]
[]
[]
[]
[]
[]
[]
[]
[]
[]
[]
[]
[]
[]
[]
[]
[]
[]
[]
[]
[]
[]
[]
[]
[]
[]
[]
[]
[]
[]
[]
[]
[]
[]
[]
[]
[]
[]
[]
[]
[]
[]
[]
[]
[]
[]
[]
[]
[]
[]
[]
[]
[]
[]
[]
[]
[]
[]
[]
[]
[]
[]
[]
[]
[]
[]
[]
[]
[]
[]
[]
[]
[]
[]
[]
[]
[]
[]
[]
[]
[]
[]
[]
[]
[]
[]
[]
[]
[]
[]
[]
[]
[]
[]
[]
[]
[]
[]
[]
[]
[]
[]
[]
[]
[]
[]
[]
[]
[]
[]
[]
[]
[]
[]
[]
[]
[]
[]
[]
[]
[]
[]
[]
[]
[]
[]
[]
[]
[]
[]
[]
[]
[]
[]
[]
[]
[]
[]
[]
[]
[]
[]
[]
[]
[]
[]
[]
[]
[]
[]
[]
[]
[]
[]
[]
[]
[]
[]
[]
[]
[]
[]
[]
[]
[]
[]
[]
[]
[]
[]
[]
[]
[]
[]
[]
[]
[]
[]
[]
[]
[]
[]
[]
[]
[]
[]
[]
[]
[]
[]
[]
[]
[]
[]
[]
[]
[]
[]
[]
[]
[]
[]
[]
[]
[]
[]
[]
[]
[]
[]
[]
[]
[]
[]
[]
[]
[]
[]
[]
[]
[]
[]
[]
[]
[]
[]
[]
[]
[]
[]
[]
[]
[]
[]
[]
[]
[]
[]
[]
[]
[]
[]
[]
[]
[]
[]
[]
[]
[]
[]
[]
[]
[]
[]
[]
[]
[]
[]
[]
[]
[]
[]
[]
[]
[]
[]
[]
[]
[]
[]
[]
[]
[]
[]
[]
[]
[]
[]
[]
[]
[]
[]
[]
[]
[]
[]
[]
[]
[]
[]
[]
[]
[]
[]
[]
[]
[]
[]
[]
[]
[]
[]
[]
[]
[]
[]
[]
[]
[]
[]
[]
[]
[]
[]
[]
[]
[]
[]
[]
[]
[]
[]
[]
[]
[]
[]
[]
[]
[]
[]
[]
[]
[]
[]
[]
[]
[]
[]
[]
[]
[]
[]
[]
[]
[]
[]
[]
[]
[]
[]
[]
[]
[]
[]
[]
[]
[]
[]
[]
[]
[]
[]
[]
[]
[]
[]
[]
[]
[]
[]
[]
[]
[]
[]
[]
[]
[]
[]
[]
[]
[]
[]
[]
[]
[]
[]
[]
[]
[]
[]
[]
[]
[]
[]
[]
[]
[]
[]
[]
[]
[]
[]
[]
[]
[]
[]
[]
[]
[]
[]
[]
[]
[]
[]
[]
[]
[]
[]
[]
[]
[]
[]
[]
[]
[]
[]
[]
[]
[]
[]
[]
[]
[]
[]
[]
[]
[]
[]
[]
[]
[]
[]
[]
[]
[]
[]
[]
[]
[]
[]
[]
[]
[]
[]
[]
[]
[]
[]
[]
[]
[]
[]
[]
[]
[]
[]
[]
[]
[]
[]
[]
[]
[]
[]
[]
[]
[]
[]
[]
[]
[]
[]
[]
[]
[]
[]
[]
[]
[]
[]
[]
[]
[]
[]
[]
[]
[]
[]
[]
[]
[]
[]
[]
[]
[]
[]
[]
[]
[]
[]
[]
[]
[]
[]
[]
[]
[]
[]
[]
[]
[]
[]
[]
[]
[]
[]
[]
[]
[]
[]
[]
[]
[]
[]
[]
[]
[]
[]
[]
[]
[]
[]
[]
[]
[]
[]
[]
[]
[]
[]
[]
[]
[]
[]
[]
[]
[]
[]
[]
[]
[]
[]
[]
[]
[]
[]
[]
[]
[]
[]
[]
[]
[]
[]
[]
[]
[]
[]
[]
[]
[]
[]
[]
[]
[]
[]
[]
[]
[]
[]
[]
[]
[]
[]
[]
[]
[]
[]
[]
[]
[]
[]
[]
[]
[]
[]
[]
[]
[]
[]
[]
[]
[]
[]
[]
[]
[]
[]
[]
[]
[]
[]
[]
[]
[]
[]
[]
[]
[]
[]
[]
[]
[]
[]
[]
[]
[]
[]
[]
[]
[]
[]
[]
[]
[]
[]
[]
[]
[]
[]
[]
[]
[]
[]
[]
[]
[]
[]
[]
[]
[]
[]
[]
[]
[]
[]
[]
[]
[]
[]
[]
[]
[]
[]
[]
[]
[]
[]
[]
[]
[]
[]
[]
[]
[]
[]
[]
[]
[]
[]
[]
[]
[]
[]
[]
[]
[]
[]
[]
[]
[]
[]
[]
[]
[]
[]
[]
[]
[]
[]
[]
[]
[]
[]
[]
[]
[]
[]
[]
[]
[]
[]
[]
[]
[]
[]
[]
[]
[]
[]
[]
[]
[]
[]
[]
[]
[]
[]
[]
[]
[]
[]
[]
[]
[]
[]
[]
[]
[]
[]
[]
[]
[]
[]
[]
[]
[]
[]
[]
[]
[]
[]
[]
[]
[]
[]
[]
[]
[]
[]
[]
[]
[]
[]
[]
[]
[]
[]
[]
[]
[]
[]
[]
[]
[]
[]
[]
[]
[]
[]
[]
[]
[]
[]
[]
[]
[]
[]
[]
[]
[]
[]
[]
[]
[]
[]
[]
[]
[]
[]
[]
[]
[]
[]
[]
[]
[]
[]
[]
[]
[]
[]
[]
[]
[]
[]
[]
[]
[]
[]
[]
[]
[]
[]
[]
[]
[]
[]
[]
[]
[]
[]
[]
[]
[]
[]
[]
[]
[]
[]
[]
[]
[]
[]
[]
[]
[]
[]
[]
[]
[]
[]
[]
[]
[]
[]
[]
[]
[]
[]
[]
[]
[]
[]
[]
[]
[]
[]
[]
[]
[]
[]
[]
[]
[]
[]
[]
[]
[]
[]
[]
[]
[]
[]
[]
[]
[]
[]
[]
[]
[]
[]
[]
[]
[]
[]
[]
[]
[]
[]
[]
[]
[]
[]
[]
[]
[]
[]
[]
[]
[]
[]
[]
[]
[]
[]
[]
[]
[]
[]
[]
[]
[]
[]
[]
[]
[]
[]
[]
[]
[]
[]
[]
[]
[]
[]
[]
[]
[]
[]
[]
[]
[]
[]
[]
[]
[]
[]
[]
[]
[]
[]
[]
[]
[]
[]
[]
[]
[]
[]
[]
[]
[]
[]
[]
[]
[]
[]
[]
[]
[]
[]
[]
[]
[]
[]
[]
[]
[]
[]
[]
[]
[]
[]
[]
[]
[]
[]
[]
[]
[]
[]
[]
[]
[]
[]
[]
[]
[]
[]
[]
[]
[]
[]
[]
[]
[]
[]
[]
[]
[]
[]
[]
[]
[]
[]
[]
[]
[]
[]
[]
[]
[]
[]
[]
[]
[]
[]
[]
[]
[]
[]
[]
[]
[]
[]
[]
[]
[]
[]
[]
[]
[]
[]
[]
[]
[]
[]
[]
[]
[]
[]
[]
[]
[]
[]
[]
[]
[]
[]
[]
[]
[]
[]
[]
[]
[]
[]
[]
[]
[]
[]
[]
[]
[]
[]
[]
[]
[]
[]
[]
[]
[]
[]
[]
[]
[]
[]
[]
[]
[]
[]
[]
[]
[]
[]
[]
[]
[]
[]
[]
[]
[]
[]
[]
[]
[]
[]
[]
[]
[]
[]
[]
[]
[]
[]
[]
[]
[]
[]
[]
[]
[]
[]
[]
[]
[]
[]
[]
[]
[]
[]
[]
[]
[]
[]
[]
[]
[]
[]
[]
[]
[]
[]
[]
[]
[]
[]
[]
[]
[]
[]
[]
[]
[]
[]
[]
[]
[]
[]
[]
[]
[]
[]
[]
[]
[]
[]
[]
[]
[]
[]
[]
[]
[]
[]
[]
[]
[]
[]
[]
[]
[]
[]
[]
[]
[]
[]
[]
[]
[]
[]
[]
[]
[]
[]
[]
[]
[]
[]
[]
[]
[]
[]
[]
[]
[]
[]
[]
[]
[]
[]
[]
[]
[]
[]
[]
[]
[]
[]
[]
[]
[]
[]
[]
[]
[]
[]
[]
[]
[]
[]
[]
[]
[]
[]
[]
[]
[]
[]
[]
[]
[]
[]
[]
[]
[]
[]
[]
[]
[]
[]
[]
[]
[]
[]
[]
[]
[]
[]
[]
[]
[]
[]
[]
[]
[]
[]
[]
[]
[]
[]
[]
[]
[]
[]
[]
[]
[]
[]
[]
[]
[]
[]
[]
[]
[]
[]
[]
[]
[]
[]
[]
[]
[]
[]
[]
[]
[]
[]
[]
[]
[]
[]
[]
[]
[]
[]
[]
[]
[]
[]
[]
[]
[]
[]
[]
[]
[]
[]
[]
[]
[]
[]
[]
[]
[]
[]
[]
[]
[]
[]
[]
[]
[]
[]
[]
[]
[]
[]
[]
[]
[]
[]
[]
[]
[]
[]
[]
[]
[]
[]
[]
[]
[]
[]
[]
[]
[]
[]
[]
[]
[]
[]
[]
[]
[]
[]
[]
[]
[]
[]
[]
[]
[]
[]
[]
[]
[]
[]
[]
[]
[]
[]
[]
[]
[]
[]
[]
[]
[]
[]
[]
[]
[]
[]
[]
[]
[]
[]
[]
[]
[]
[]
[]
[]
[]
[]
[]
[]
[]
[]
[]
[]
[]
[]
[]
[]
[]
[]
[]
[]
[]
[]
[]
[]
[]
[]
[]
[]
[]
[]
[]
[]
[]
[]
[]
[]
[]
[]
[]
[]
[]
[]
[]
[]
[]
[]
[]
[]
[]
[]
[]
[]
[]
[]
[]
[]
[]
[]
[]
[]
[]
[]
[]
[]
[]
[]
[]
[]
[]
[]
[]
[]
[]
[]
[]
[]
[]
[]
[]
[]
[]
[]
[]
[]
[]
[]
[]
[]
[]
[]
[]
[]
[]
[]
[]
[]
[]
[]
[]
[]
[]
[]
[]
[]
[]
[]
[]
[]
[]
[]
[]
[]
[]
[]
[]
[]
[]
[]
[]
[]
[]
[]
[]
[]
[]
[]
[]
[]
[]
[]
[]
[]
[]
[]
[]
[]
[]
[]
[]
[]
[]
[]
[]
[]
[]
[]
[]
[]
[]
[]
[]
[]
[]
[]
[]
[]
[]
[]
[]
[]
[]
[]
[]
[]
[]
[]
[]
[]
[]
[]
[]
[]
[]
[]
[]
[]
[]
[]
[]
[]
[]
[]
[]
[]
[]
[]
[]
[]
[]
[]
[]
[]
[]
[]
[]
[]
[]
[]
[]
[]
[]
[]
[]
[]
[]
[]
[]
[]
[]
[]
[]
[]
[]
[]
[]
[]
[]
[]
[]
[]
[]
[]
[]
[]
[]
[]
[]
[]
[]
[]
[]
[]
[]
[]
[]
[]
[]
[]
[]
[]
[]
[]
[]
[]
[]
[]
[]
[]
[]
[]
[]
[]
[]
[]
[]
[]
[]
[]
[]
[]
[]
[]
[]
[]
[]
[]
[]
[]
[]
[]
[]
[]
[]
[]
[]
[]
[]
[]
[]
[]
[]
[]
[]
[]
[]
[]
[]
[]
[]
[]
[]
[]
[]
[]
[]
[]
[]
[]
[]
[]
[]
[]
[]
[]
[]
[]
[]
[]
[]
[]
[]
[]
[]
[]
[]
[]
[]
[]
[]
[]
[]
[]
[]
[]
[]
[]
[]
[]
[]
[]
[]
[]
[]
[]
[]
[]
[]
[]
[]
[]
[]
[]
[]
[]
[]
[]
[]
[]
[]
[]
[]
[]
[]
[]
[]
[]
[]
[]
[]
[]
[]
[]
[]
[]
[]
[]
[]
[]
[]
[]
[]
[]
[]
[]
[]
[]
[]
[]
[]
[]
[]
[]
[]
[]
[]
[]
[]
[]
[]
[]
[]
[]
[]
[]
[]
[]
[]
[]
[]
[]
[]
[]
[]
[]
[]
[]
[]
[]
[]
[]
[]
[]
[]
[]
[]
[]
[]
[]
[]
[]
[]
[]
[]
[]
[]
[]
[]
[]
[]
[]
[]
[]
[]
[]
[]
[]
[]
[]
[]
[]
[]
[]
[]
[]
[]
[]
[]
[]
[]
[]
[]
[]
[]
[]
[]
[]
[]
[]
[]
[]
[]
[]
[]
[]
[]
[]
[]
[]
[]
[]
[]
[]
[]
[]
[]
[]
[]
[]
[]
[]
[]
[]
[]
[]
[]
[]
[]
[]
[]
[]
[]
[]
[]
[]
[]
[]
[]
[]
[]
[]
[]
[]
[]
[]
[]
[]
[]
[]
[]
[]
[]
[]
[]
[]
[]
[]
[]
[]
[]
[]
[]
[]
[]
[]
[]
[]
[]
[]
[]
[]
[]
[]
[]
[]
[]
[]
[]
[]
[]
[]
[]
[]
[]
[]
[]
[]
[]
[]
[]
[]
[]
[]
[]
[]
[]
[]
[]
[]
[]
[]
[]
[]
[]
[]
[]
[]
[]
[]
[]
[]
[]
[]
[]
[]
[]
[]
[]
[]
[]
[]
[]
[]
[]
[]
[]
[]
[]
[]
[]
[]
[]
[]
[]
[]
[]
[]
[]
[]
[]
[]
[]
[]
[]
[]
[]
[]
[]
[]
[]
[]
[]
[]
[]
[]
[]
[]
[]
[]
[]
[]
[]
[]
[]
[]
[]
[]
[]
[]
[]
[]
[]
[]
[]
[]
[]
[]
[]
[]
[]
[]
[]
[]
[]
[]
[]
[]
[]
[]
[]
[]
[]
[]
[]
[]
[]
[]
[]
[]
[]
[]
[]
[]
[]
[]
[]
[]
[]
[]
[]
[]
[]
[]
[]
[]
[]
[]
[]
[]
[]
[]
[]
[]
[]
[]
[]
[]
[]
[]
[]
[]
[]
[]
[]
[]
[]
[]
[]
[]
[]
[]
[]
[]
[]
[]
[]
[]
[]
[]
[]
[]
[]
[]
[]
[]
[]
[]
[]
[]
[]
[]
[]
[]
[]
[]
[]
[]
[]
[]
[]
[]
[]
[]
[]
[]
[]
[]
[]
[]
[]
[]
[]
[]
[]
[]
[]
[]
[]
[]
[]
[]
[]
[]
[]
[]
[]
[]
[]
[]
[]
[]
[]
[]
[]
[]
[]
[]
[]
[]
[]
[]
[]
[]
[]
[]
[]
[]
[]
[]
[]
[]
[]
[]
[]
[]
[]
[]
[]
[]
[]
[]
[]
[]
[]
[]
[]
[]
[]
[]
[]
[]
[]
[]
[]
[]
[]
[]
[]
[]
[]
[]
[]
[]
[]
[]
[]
[]
[]
[]
[]
[]
[]
[]
[]
[]
[]
[]
[]
[]
[]
[]
[]
[]
[]
[]
[]
[]
[]
[]
[]
[]
[]
[]
[]
[]
[]
[]
[]
[]
[]
[]
[]
[]
[]
[]
[]
[]
[]
[]
[]
[]
[]
[]
[]
[]
[]
[]
[]
[]
[]
[]
[]
[]
[]
[]
[]
[]
[]
[]
[]
[]
[]
[]
[]
[]
[]
[]
[]
[]
[]
[]
[]
[]
[]
[]
[]
[]
[]
[]
[]
[]
[]
[]
[]
[]
[]
[]
[]
[]
[]
[]
[]
[]
[]
[]
[]
[]
[]
[]
[]
[]
[]
[]
[]
[]
[]
[]
[]
[]
[]
[]
[]
[]
[]
[]
[]
[]
[]
[]
[]
[]
[]
[]
[]
[]
[]
[]
[]
[]
[]
[]
[]
[]
[]
[]
[]
[]
[]
[]
[]
[]
[]
[]
[]
[]
[]
[]
[]
[]
[]
[]
[]
[]
[]
[]
[]
[]
[]
[]
[]
[]
[]
[]
[]
[]
[]
[]
[]
[]
[]
[]
[]
[]
[]
[]
[]
[]
[]
[]
[]
[]
[]
[]
[]
[]
[]
[]
[]
[]
[]
[]
[]
[]
[]
[]
[]
[]
[]
[]
[]
[]
[]
[]
[]
[]
[]
[]
[]
[]
[]
[]
[]
[]
[]
[]
[]
[]
[]
[]
[]
[]
[]
[]
[]
[]
[]
[]
[]
[]
[]
[]
[]
[]
[]
[]
[]
[]
[]
[]
[]
[]
[]
[]
[]
[]
[]
[]
[]
[]
[]
[]
[]
[]
[]
[]
[]
[]
[]
[]
[]
[]
[]
[]
[]
[]
[]
[]
[]
[]
[]
[]
[]
[]
[]
[]
[]
[]
[]
[]
[]
[]
[]
[]
[]
[]
[]
[]
[]
[]
[]
[]
[]
[]
[]
[]
[]
[]
[]
[]
[]
[]
[]
[]
[]
[]
[]
[]
[]
[]
[]
[]
[]
[]
[]
[]
[]
[]
[]
[]
[]
[]
[]
[]
[]
[]
[]
[]
[]
[]
[]
[]
[]
[]
[]
[]
[]
[]
[]
[]
[]
[]
[]
[]
[]
[]
[]
[]
[]
[]
[]
[]
[]
[]
[]
[]
[]
[]
[]
[]
[]
[]
[]
[]
[]
[]
[]
[]
[]
[]
[]
[]
[]
[]
[]
[]
[]
[]
[]
[]
[]
[]
[]
[]
[]
[]
[]
[]
[]
[]
[]
[]
[]
[]
[]
[]
[]
[]
[]
[]
[]
[]
[]
[]
[]
[]
[]
[]
[]
[]
[]
[]
[]
[]
[]
[]
[]
[]
[]
[]
[]
[]
[]
[]
[]
[]
[]
[]
[]
[]
[]
[]
[]
[]
[]
[]
[]
[]
[]
[]
[]
[]
[]
[]
[]
[]
[]
[]
[]
[]
[]
[]
[]
[]
[]
[]
[]
[]
[]
[]
[]
[]
[]
[]
[]
[]
[]
[]
[]
[]
[]
[]
[]
[]
[]
[]
[]
[]
[]
[]
[]
[]
[]
[]
[]
[]
[]
[]
[]
[]
[]
[]
[]
[]
[]
[]
[]
[]
[]
[]
[]
[]
[]
[]
[]
[]
[]
[]
[]
[]
[]
[]
[]
[]
[]
[]
[]
[]
[]
[]
[]
[]
[]
[]
[]
[]
[]
[]
[]
[]
[]
[]
[]
[]
[]
[]
[]
[]
[]
[]
[]
[]
[]
[]
[]
[]
[]
[]
[]
[]
[]
[]
[]
[]
[]
[]
[]
[]
[]
[]
[]
[]
[]
[]
[]
[]
[]
[]
[]
[]
[]
[]
[]
[]
[]
[]
[]
[]
[]
[]
[]
[]
[]
[]
[]
[]
[]
[]
[]
[]
[]
[]
[]
[]
[]
[]
[]
[]
[]
[]
[]
[]
[]
[]
[]
[]
[]
[]
[]
[]
[]
[]
[]
[]
[]
[]
[]
[]
[]
[]
[]
[]
[]
[]
[]
[]
[]
[]
[]
[]
[]
[]
[]
[]
[]
[]
[]
[]
[]
[]
[]
[]
[]
[]
[]
[]
[]
[]
[]
[]
[]
[]
[]
[]
[]
[]
[]
[]
[]
[]
[]
[]
[]
[]
[]
[]
[]
[]
[]
[]
[]
[]
[]
[]
[]
[]
[]
[]
[]
[]
[]
[]
[]
[]
[]
[]
[]
[]
[]
[]
[]
[]
[]
[]
[]
[]
[]
[]
[]
[]
[]
[]
[]
[]
[]
[]
[]
[]
[]
[]
[]
[]
[]
[]
[]
[]
[]
[]
[]
[]
[]
[]
[]
[]
[]
[]
[]
[]
[]
[]
[]
[]
[]
[]
[]
[]
[]
[]
[]
[]
[]
[]
[]
[]
[]
[]
[]
[]
[]
[]
[]
[]
[]
[]
[]
[]
[]
[]
[]
[]
[]
[]
[]
[]
[]
[]
[]
[]
[]
[]
[]
[]
[]
[]
[]
[]
[]
[]
[]
[]
[]
[]
[]
[]
[]
[]
[]
[]
[]
[]
[]
[]
[]
[]
[]
[]
[]
[]
[]
[]
[]
[]
[]
[]
[]
[]
[]
[]
[]
[]
[]
[]
[]
[]
[]
[]
[]
[]
[]
[]
[]
[]
[]
[]
[]
[]
[]
[]
[]
[]
[]
[]
[]
[]
[]
[]
[]
[]
[]
[]
[]
[]
[]
[]
[]
[]
[]
[]
[]
[]
[]
[]
[]
[]
[]
[]
[]
[]
[]
[]
[]
[]
[]
[]
[]
[]
[]
[]
[]
[]
[]
[]
[]
[]
[]
[]
[]
[]
[]
[]
[]
[]
[]
[]
[]
[]
[]
[]
[]
[]
[]
[]
[]
[]
[]
[]
[]
[]
[]
[]
[]
[]
[]
[]
[]
[]
[]
[]
[]
[]
[]
[]
[]
[]
[]
[]
[]
[]
[]
[]
[]
[]
[]
[]
[]
[]
[]
[]
[]
[]
[]
[]
[]
[]
[]
[]
[]
[]
[]
[]
[]
[]
[]
[]
[]
[]
[]
[]
[]
[]
[]
[]
[]
[]
[]
[]
[]
[]
[]
[]
[]
[]
[]
[]
[]
[]
[]
[]
[]
[]
[]
[]
[]
[]
[]
[]
[]
[]
[]
[]
[]
[]
[]
[]
[]
[]
[]
[]
[]
[]
[]
[]
[]
[]
[]
[]
[]
[]
[]
[]
[]
[]
[]
[]
[]
[]
[]
[]
[]
[]
[]
[]
[]
[]
[]
[]
[]
[]
[]
[]
[]
[]
[]
[]
[]
[]
[]
[]
[]
[]
[]
[]
[]
[]
[]
[]
[]
[]
[]
[]
[]
[]
[]
[]
[]
[]
[]
[]
[]
[]
[]
[]
[]
[]
[]
[]
[]
[]
[]
[]
[]
[]
[]
[]
[]
[]
[]
[]
[]
[]
[]
[]
[]
[]
[]
[]
[]
[]
[]
[]
[]
[]
[]
[]
[]
[]
[]
[]
[]
[]
[]
[]
[]
[]
[]
[]
[]
[]
[]
[]
[]
[]
[]
[]
[]
[]
[]
[]
[]
[]
[]
[]
[]
[]
[]
[]
[]
[]
[]
[]
[]
[]
[]
[]
[]
[]
[]
[]
[]
[]
[]
[]
[]
[]
[]
[]
[]
[]
[]
[]
[]
[]
[]
[]
[]
[]
[]
[]
[]
[]
[]
[]
[]
[]
[]
[]
[]
[]
[]
[]
[]
[]
[]
[]
[]
[]
[]
[]
[]
[]
[]
[]
[]
[]
[]
[]
[]
[]
[]
[]
[]
[]
[]
[]
[]
[]
[]
[]
[]
[]
[]
[]
[]
[]
[]
[]
[]
[]
[]
[]
[]
[]
[]
[]
[]
[]
[]
[]
[]
[]
[]
[]
[]
[]
[]
[]
[]
[]
[]
[]
[]
[]
[]
[]
[]
[]
[]
[]
[]
[]
[]
[]
[]
[]
[]
[]
[]
[]
[]
[]
[]
[]
[]
[]
[]
[]
[]
[]
[]
[]
[]
[]
[]
[]
[]
[]
[]
[]
[]
[]
[]
[]
[]
[]
[]
[]
[]
[]
[]
[]
[]
[]
[]
[]
[]
[]
[]
[]
[]
[]
[]
[]
[]
[]
[]
[]
[]
[]
[]
[]
[]
[]
[]
[]
[]
[]
[]
[]
[]
[]
[]
[]
[]
[]
[]
[]
[]
[]
[]
[]
[]
[]
[]
[]
[]
[]
[]
[]
[]
[]
[]
[]
[]
[]
[]
[]
[]
[]
[]
[]
[]
[]
[]
[]
[]
[]
[]
[]
[]
[]
[]
[]
[]
[]
[]
[]
[]
[]
[]
[]
[]
[]
[]
[]
[]
[]
[]
[]
[]
[]
[]
[]
[]
[]
[]
[]
[]
[]
[]
[]
[]
[]
[]
[]
[]
[]
[]
[]
[]
[]
[]
[]
[]
[]
[]
[]
[]
[]
[]
[]
[]
[]
[]
[]
[]
[]
[]
[]
[]
[]
[]
[]
[]
[]
[]
[]
[]
[]
[]
[]
[]
[]
[]
[]
[]
[]
[]
[]
[]
[]
[]
[]
[]
[]
[]
[]
[]
[]
[]
[]
[]
[]
[]
[]
[]
[]
[]
[]
[]
[]
[]
[]
[]
[]
[]
[]
[]
[]
[]
[]
[]
[]
[]
[]
[]
[]
[]
[]
[]
[]
[]
[]
[]
[]
[]
[]
[]
[]
[]
[]
[]
[]
[]
[]
[]
[]
[]
[]
[]
[]
[]
[]
[]
[]
[]
[]
[]
[]
[]
[]
[]
[]
[]
[]
[]
[]
[]
[]
[]
[]
[]
[]
[]
[]
[]
[]
[]
[]
[]
[]
[]
[]
[]
[]
[]
[]
[]
[]
[]
[]
[]
[]
[]
[]
[]
[]
[]
[]
[]
[]
[]
[]
[]
[]
[]
[]
[]
[]
[]
[]
[]
[]
[]
[]
[]
[]
[]
[]
[]
[]
[]
[]
[]
[]
[]
[]
[]
[]
[]
[]
[]
[]
[]
[]
[]
[]
[]
[]
[]
[]
[]
[]
[]
[]
[]
[]
[]
[]
[]
[]
[]
[]
[]
[]
[]
[]
[]
[]
[]
[]
[]
[]
[]
[]
[]
[]
[]
[]
[]
[]
[]
[]
[]
[]
[]
[]
[]
[]
[]
[]
[]
[]
[]
[]
[]
[]
[]
[]
[]
[]
[]
[]
[]
[]
[]
[]
[]
[]
[]
[]
[]
[]
[]
[]
[]
[]
[]
[]
[]
[]
[]
[]
[]
[]
[]
[]
[]
[]
[]
[]
[]
[]
[]
[]
[]
[]
[]
[]
[]
[]
[]
[]
[]
[]
[]
[]
[]
[]
[]
[]
[]
[]
[]
[]
[]
[]
[]
[]
[]
[]
[]
[]
[]
[]
[]
[]
[]
[]
[]
[]
[]
[]
[]
[]
[]
[]
[]
[]
[]
[]
[]
[]
[]
[]
[]
[]
[]
[]
[]
[]
[]
[]
[]
[]
[]
[]
[]
[]
[]
[]
[]
[]
[]
[]
[]
[]
[]
[]
[]
[]
[]
[]
[]
[]
[]
[]
[]
[]
[]
[]
[]
[]
[]
[]
[]
[]
[]
[]
[]
[]
[]
[]
[]
[]
[]
[]
[]
[]
[]
[]
[]
[]
[]
[]
[]
[]
[]
[]
[]
[]
[]
[]
[]
[]
[]
[]
[]
[]
[]
[]
[]
[]
[]
[]
[]
[]
[]
[]
[]
[]
[]
[]
[]
[]
[]
[]
[]
[]
[]
[]
[]
[]
[]
[]
[]
[]
[]
[]
[]
[]
[]
[]
[]
[]
[]
[]
[]
[]
[]
[]
[]
[]
[]
[]
[]
[]
[]
[]
[]
[]
[]
[]
[]
[]
[]
[]
[]
[]
[]
[]
[]
[]
[]
[]
[]
[]
[]
[]
[]
[]
[]
[]
[]
[]
[]
[]
[]
[]
[]
[]
[]
[]
[]
[]
[]
[]
[]
[]
[]
[]
[]
[]
[]
[]
[]
[]
[]
[]
[]
[]
[]
[]
[]
[]
[]
[]
[]
[]
[]
[]
[]
[]
[]
[]
[]
[]
[]
[]
[]
[]
[]
[]
[]
[]
[]
[]
[]
[]
[]
[]
[]
[]
[]
[]
[]
[]
[]
[]
[]
[]
[]
[]
[]
[]
[]
[]
[]
[]
[]
[]
[]
[]
[]
[]
[]
[]
[]
[]
[]
[]
[]
[]
[]
[]
[]
[]
[]
[]
[]
[]
[]
[]
[]
[]
[]
[]
[]
[]
[]
[]
[]
[]
[]
[]
[]
[]
[]
[]
[]
[]
[]
[]
[]
[]
[]
[]
[]
[]
[]
[]
[]
[]
[]
[]
[]
[]
[]
[]
[]
[]
[]
[]
[]
[]
[]
[]
[]
[]
[]
[]
[]
[]
[]
[]
[]
[]
[]
[]
[]
[]
[]
[]
[]
[]
[]
[]
[]
[]
[]
[]
[]
[]
[]
[]
[]
[]
[]
[]
[]
[]
[]
[]
[]
[]
[]
[]
[]
[]
[]
[]
[]
[]
[]
[]
[]
[]
[]
[]
[]
[]
[]
[]
[]
[]
[]
[]
[]
[]
[]
[]
[]
[]
[]
[]
[]
[]
[]
[]
[]
[]
[]
[]
[]
[]
[]
[]
[]
[]
[]
[]
[]
[]
[]
[]
[]
[]
[]
[]
[]
[]
[]
[]
[]
[]
[]
[]
[]
[]
[]
[]
[]
[]
[]
[]
[]
[]
[]
[]
[]
[]
[]
[]
[]
[]
[]
[]
[]
[]
[]
[]
[]
[]
[]
[]
[]
[]
[]
[]
[]
[]
[]
[]
[]
[]
[]
[]
[]
[]
[]
[]
[]
[]
[]
[]
[]
[]
[]
[]
[]
[]
[]
[]
[]
[]
[]
[]
[]
[]
[]
[]
[]
[]
[]
[]
[]
[]
[]
[]
[]
[]
[]
[]
[]
[]
[]
[]
[]
[]
[]
[]
[]
[]
[]
[]
[]
[]
[]
[]
[]
[]
[]
[]
[]
[]
[]
[]
[]
[]
[]
[]
[]
[]
[]
[]
[]
[]
[]
[]
[]
[]
[]
[]
[]
[]
[]
[]
[]
[]
[]
[]
[]
[]
[]
[]
[]
[]
[]
[]
[]
[]
[]
[]
[]
[]
[]
[]
[]
[]
[]
[]
[]
[]
[]
[]
[]
[]
[]
[]
[]
[]
[]
[]
[]
[]
[]
[]
[]
[]
[]
[]
[]
[]
[]
[]
[]
[]
[]
[]
[]
[]
[]
[]
[]
[]
[]
[]
[]
[]
[]
[]
[]
[]
[]
[]
[]
[]
[]
[]
[]
[]
[]
[]
[]
[]
[]
[]
[]
[]
[]
[]
[]
[]
[]
[]
[]
[]
[]
[]
[]
[]
[]
[]
[]
[]
[]
[]
[]
[]
[]
[]
[]
[]
[]
[]
[]
[]
[]
[]
[]
[]
[]
[]
[]
[]
[]
[]
[]
[]
[]
[]
[]
[]
[]
[]
[]
[]
[]
[]
[]
[]
[]
[]
[]
[]
[]
[]
[]
[]
[]
[]
[]
[]
[]
[]
[]
[]
[]
[]
[]
[]
[]
[]
[]
[]
[]
[]
[]
[]
[]
[]
[]
[]
[]
[]
[]
[]
[]
[]
[]
[]
[]
[]
[]
[]
[]
[]
[]
[]
[]
[]
[]
[]
[]
[]
[]
[]
[]
[]
[]
[]
[]
[]
[]
[]
[]
[]
[]
[]
[]
[]
[]
[]
[]
[]
[]
[]
[]
[]
[]
[]
[]
[]
[]
[]
[]
[]
[]
[]
[]
[]
[]
[]
[]
[]
[]
[]
[]
[]
[]
[]
[]
[]
[]
[]
[]
[]
[]
[]
[]
[]
[]
[]
[]
[]
[]
[]
[]
[]
[]
[]
[]
[]
[]
[]
[]
[]
[]
[]
[]
[]
[]
[]
[]
[]
[]
[]
[]
[]
[]
[]
[]
[]
[]
[]
[]
[]
[]
[]
[]
[]
[]
[]
[]
[]
[]
[]
[]
[]
[]
[]
[]
[]
[]
[]
[]
[]
[]
[]
[]
[]
[]
[]
[]
[]
[]
[]
[]
[]
[]
[]
[]
[]
[]
[]
[]
[]
[]
[]
[]
[]
[]
[]
[]
[]
[]
[]
[]
[]
[]
[]
[]
[]
[]
[]
[]
[]
[]
[]
[]
[]
[]
[]
[]
[]
[]
[]
[]
[]
[]
[]
[]
[]
[]
[]
[]
[]
[]
[]
[]
[]
[]
[]
[]
[]
[]
[]
[]
[]
[]
[]
[]
[]
[]
[]
[]
[]
[]
[]
[]
[]
[]
[]
[]
[]
[]
[]
[]
[]
[]
[]
[]
[]
[]
[]
[]
[]
[]
[]
[]
[]
[]
[]
[]
[]
[]
[]
[]
[]
[]
[]
[]
[]
[]
[]
[]
[]
[]
[]
[]
[]
[]
[]
[]
[]
[]
[]
[]
[]
[]
[]
[]
[]
[]
[]
[]
[]
[]
[]
[]
[]
[]
[]
[]
[]
[]
[]
[]
[]
[]
[]
[]
[]
[]
[]
[]
[]
[]
[]
[]
[]
[]
[]
[]
[]
[]
[]
[]
[]
[]
[]
[]
[]
[]
[]
[]
[]
[]
[]
[]
[]
[]
[]
[]
[]
[]
[]
[]
[]
[]
[]
[]
[]
[]
[]
[]
[]
[]
[]
[]
[]
[]
[]
[]
[]
[]
[]
[]
[]
[]
[]
[]
[]
[]
[]
[]
[]
[]
[]
[]
[]
[]
[]
[]
[]
[]
[]
[]
[]
[]
[]
[]
[]
[]
[]
[]
[]
[]
[]
[]
[]
[]
[]
[]
[]
[]
[]
[]
[]
[]
[]
[]
[]
[]
[]
[]
[]
[]
[]
[]
[]
[]
[]
[]
[]
[]
[]
[]
[]
[]
[]
[]
[]
[]
[]
[]
[]
[]
[]
[]
[]
[]
[]
[]
[]
[]
[]
[]
[]
[]
[]
[]
[]
[]
[]
[]
[]
[]
[]
[]
[]
[]
[]
[]
[]
[]
[]
[]
[]
[]
[]
[]
[]
[]
[]
[]
[]
[]
[]
[]
[]
[]
[]
[]
[]
[]
[]
[]
[]
[]
[]
[]
[]
[]
[]
[]
[]
[]
[]
[]
[]
[]
[]
[]
[]
[]
[]
[]
[]
[]
[]
[]
[]
[]
[]
[]
[]
[]
[]
[]
[]
[]
[]
[]
[]
[]
[]
[]
[]
[]
[]
[]
[]
[]
[]
[]
[]
[]
[]
[]
[]
[]
[]
[]
[]
[]
[]
[]
[]
[]
[]
[]
[]
[]
[]
[]
[]
[]
[]
[]
[]
[]
[]
[]
[]
[]
[]
[]
[]
[]
[]
[]
[]
[]
[]
[]
[]
[]
[]
[]
[]
[]
[]
[]
[]
[]
[]
[]
[]
[]
[]
[]
[]
[]
[]
[]
[]
[]
[]
[]
[]
[]
[]
[]
[]
[]
[]
[]
[]
[]
[]
[]
[]
[]
[]
[]
[]
[]
[]
[]
[]
[]
[]
[]
[]
[]
[]
[]
[]
[]
[]
[]
[]
[]
[]
[]
[]
[]
[]
[]
[]
[]
[]
[]
[]
[]
[]
[]
[]
[]
[]
[]
[]
[]
[]
[]
[]
[]
[]
[]
[]
[]
[]
[]
[]
[]
[]
[]
[]
[]
[]
[]
[]
[]
[]
[]
[]
[]
[]
[]
[]
[]
[]
[]
[]
[]
[]
[]
[]
[]
[]
[]
[]
[]
[]
[]
[]
[]
[]
[]
[]
[]
[]
[]
[]
[]
[]
[]
[]
[]
[]
[]
[]
[]
[]
[]
[]
[]
[]
[]
[]
[]
[]
[]
[]
[]
[]
[]
[]
[]
[]
[]
[]
[]
[]
[]
[]
[]
[]
[]
[]
[]
[]
[]
[]
[]
[]
[]
[]
[]
[]
[]
[]
[]
[]
[]
[]
[]
[]
[]
[]
[]
[]
[]
[]
[]
[]
[]
[]
[]
[]
[]
[]
[]
[]
[]
[]
[]
[]
[]
[]
[]
[]
[]
[]
[]
[]
[]
[]
[]
[]
[]
[]
[]
[]
[]
[]
[]
[]
[]
[]
[]
[]
[]
[]
[]
[]
[]
[]
[]
[]
[]
[]
[]
[]
[]
[]
[]
[]
[]
[]
[]
[]
[]
[]
[]
[]
[]
[]
[]
[]
[]
[]
[]
[]
[]
[]
[]
[]
[]
[]
[]
[]
[]
[]
[]
[]
[]
[]
[]
[]
[]
[]
[]
[]
[]
[]
[]
[]
[]
[]
[]
[]
[]
[]
[]
[]
[]
[]
[]
[]
[]
[]
[]
[]
[]
[]
[]
[]
[]
[]
[]
[]
[]
[]
[]
[]
[]
[]
[]
[]
[]
[]
[]
[]
[]
[]
[]
[]
[]
[]
[]
[]
[]
[]
[]
[]
[]
[]
[]
[]
[]
[]
[]
[]
[]
[]
[]
[]
[]
[]
[]
[]
[]
[]
[]
[]
[]
[]
[]
[]
[]
[]
[]
[]
[]
[]
[]
[]
[]
[]
[]
[]
[]
[]
[]
[]
[]
[]
[]
[]
[]
[]
[]
[]
[]
[]
[]
[]
[]
[]
[]
[]
[]
[]
[]
[]
[]
[]
[]
[]
[]
[]
[]
[]
[]
[]
[]
[]
[]
[]
[]
[]
[]
[]
[]
[]
[]
[]
[]
[]
[]
[]
[]
[]
[]
[]
[]
[]
[]
[]
[]
[]
[]
[]
[]
[]
[]
[]
[]
[]
[]
[]
[]
[]
[]
[]
[]
[]
[]
[]
[]
[]
[]
[]
[]
[]
[]
[]
[]
[]
[]
[]
[]
[]
[]
[]
[]
[]
[]
[]
[]
[]
[]
[]
[]
[]
[]
[]
[]
[]
[]
[]
[]
[]
[]
[]
[]
[]
[]
[]
[]
[]
[]
[]
[]
[]
[]
[]
[]
[]
[]
[]
[]
[]
[]
[]
[]
[]
[]
[]
[]
[]
[]
[]
[]
[]
[]
[]
[]
[]
[]
[]
[]
[]
[]
[]
[]
[]
[]
[]
[]
[]
[]
[]
[]
[]
[]
[]
[]
[]
[]
[]
[]
[]
[]
[]
[]
[]
[]
[]
[]
[]
[]
[]
[]
[]
[]
[]
[]
[]
[]
[]
[]
[]
[]
[]
[]
[]
[]
[]
[]
[]
[]
[]
[]
[]
[]
[]
[]
[]
[]
[]
[]
[]
[]
[]
[]
[]
[]
[]
[]
[]
[]
[]
[]
[]
[]
[]
[]
[]
[]
[]
[]
[]
[]
[]
[]
[]
[]
[]
[]
[]
[]
[]
[]
[]
[]
[]
[]
[]
[]
[]
[]
[]
[]
[]
[]
[]
[]
[]
[]
[]
[]
[]
[]
[]
[]
[]
[]
[]
[]
[]
[]
[]
[]
[]
[]
[]
[]
[]
[]
[]
[]
[]
[]
[]
[]
[]
[]
[]
[]
[]
[]
[]
[]
[]
[]
[]
[]
[]
[]
[]
[]
[]
[]
[]
[]
[]
[]
[]
[]
[]
[]
[]
[]
[]
[]
[]
[]
[]
[]
[]
[]
[]
[]
[]
[]
[]
[]
[]
[]
[]
[]
[]
[]
[]
[]
[]
[]
[]
[]
[]
[]
[]
[]
[]
[]
[]
[]
[]
[]
[]
[]
[]
[]
[]
[]
[]
[]
[]
[]
[]
[]
[]
[]
[]
[]
[]
[]
[]
[]
[]
[]
[]
[]
[]
[]
[]
[]
[]
[]
[]
[]
[]
[]
[]
[]
[]
[]
[]
[]
[]
[]
[]
[]
[]
[]
[]
[]
[]
[]
[]
[]
[]
[]
[]
[]
[]
[]
[]
[]
[]
[]
[]
[]
[]
[]
[]
[]
[]
[]
[]
[]
[]
[]
[]
[]
[]
[]
[]
[]
[]
[]
[]
[]
[]
[]
[]
[]
[]
[]
[]
[]
[]
[]
[]
[]
[]
[]
[]
[]
[]
[]
[]
[]
[]
[]
[]
[]
[]
[]
[]
[]
[]
[]
[]
[]
[]
[]
[]
[]
[]
[]
[]
[]
[]
[]
[]
[]
[]
[]
[]
[]
[]
[]
[]
[]
[]
[]
[]
[]
[]
[]
[]
[]
[]
[]
[]
[]
[]
[]
[]
[]
[]
[]
[]
[]
[]
[]
[]
[]
[]
[]
[]
[]
[]
[]
[]
[]
[]
[]
[]
[]
[]
[]
[]
[]
[]
[]
[]
[]
[]
[]
[]
[]
[]
[]
[]
[]
[]
[]
[]
[]
[]
[]
[]
[]
[]
[]
[]
[]
[]
[]
[]
[]
[]
[]
[]
[]
[]
[]
[]
[]
[]
[]
[]
[]
[]
[]
[]
[]
[]
[]
[]
[]
[]
[]
[]
[]
[]
[]
[]
[]
[]
[]
[]
[]
[]
[]
[]
[]
[]
[]
[]
[]
[]
[]
[]
[]
[]
[]
[]
[]
[]
[]
[]
[]
[]
[]
[]
[]
[]
[]
[]
[]
[]
[]
[]
[]
[]
[]
[]
[]
[]
[]
[]
[]
[]
[]
[]
[]
[]
[]
[]
[]
[]
[]
[]
[]
[]
[]
[]
[]
[]
[]
[]
[]
[]
[]
[]
[]
[]
[]
[]
[]
[]
[]
[]
[]
[]
[]
[]
[]
[]
[]
[]
[]
[]
[]
[]
[]
[]
[]
[]
[]
[]
[]
[]
[]
[]
[]
[]
[]
[]
[]
[]
[]
[]
[]
[]
[]
[]
[]
[]
[]
[]
[]
[]
[]
[]
[]
[]
[]
[]
[]
[]
[]
[]
[]
[]
[]
[]
[]
[]
[]
[]
[]
[]
[]
[]
[]
[]
[]
[]
[]
[]
[]
[]
[]
[]
[]
[]
[]
[]
[]
[]
[]
[]
[]
[]
[]
[]
[]
[]
[]
[]
[]
[]
[]
[]
[]
[]
[]
[]
[]
[]
[]
[]
[]
[]
[]
[]
[]
[]
[]
[]
[]
[]
[]
[]
[]
[]
[]
[]
[]
[]
[]
[]
[]
[]
[]
[]
[]
[]
[]
[]
[]
[]
[]
[]
[]
[]
[]
[]
[]
[]
[]
[]
[]
[]
[]
[]
[]
[]
[]
[]
[]
[]
[]
[]
[]
[]
[]
[]
[]
[]
[]
[]
[]
[]
[]
[]
[]
[]
[]
[]
[]
[]
[]
[]
[]
[]
[]
[]
[]
[]
[]
[]
[]
[]
[]
[]
[]
[]
[]
[]
[]
[]
[]
[]
[]
[]
[]
[]
[]
[]
[]
[]
[]
[]
[]
[]
[]
[]
[]
[]
[]
[]
[]
[]
[]
[]
[]
[]
[]
[]
[]
[]
[]
[]
[]
[]
[]
[]
[]
[]
[]
[]
[]
[]
[]
[]
[]
[]
[]
[]
[]
[]
[]
[]
[]
[]
[]
[]
[]
[]
[]
[]
[]
[]
[]
[]
[]
[]
[]
[]
[]
[]
[]
[]
[]
[]
[]
[]
[]
[]
[]
[]
[]
[]
[]
[]
[]
[]
[]
[]
[]
[]
[]
[]
[]
[]
[]
[]
[]
[]
[]
[]
[]
[]
[]
[]
[]
[]
[]
[]
[]
[]
[]
[]
[]
[]
[]
[]
[]
[]
[]
[]
[]
[]
[]
[]
[]
[]
[]
[]
[]
[]
[]
[]
[]
[]
[]
[]
[]
[]
[]
[]
[]
[]
[]
[]
[]
[]
[]
[]
[]
[]
[]
[]
[]
[]
[]
[]
[]
[]
[]
[]
[]
[]
[]
[]
[]
[]
[]
[]
[]
[]
[]
[]
[]
[]
[]
[]
[]
[]
[]
[]
[]
[]
[]
[]
[]
[]
[]
[]
[]
[]
[]
[]
[]
[]
[]
[]
[]
[]
[]
[]
[]
[]
[]
[]
[]
[]
[]
[]
[]
[]
[]
[]
[]
[]
[]
[]
[]
[]
[]
[]
[]
[]
[]
[]
[]
[]
[]
[]
[]
[]
[]
[]
[]
[]
[]
[]
[]
[]
[]
[]
[]
[]
[]
[]
[]
[]
[]
[]
[]
[]
[]
[]
[]
[]
[]
[]
[]
[]
[]
[]
[]
[]
[]
[]
[]
[]
[]
[]
[]
[]
[]
[]
[]
[]
[]
[]
[]
[]
[]
[]
[]
[]
[]
[]
[]
[]
[]
[]
[]
[]
[]
[]
[]
[]
[]
[]
[]
[]
[]
[]
[]
[]
[]
[]
[]
[]
[]
[]
[]
[]
[]
[]
[]
[]
[]
[]
[]
[]
[]
[]
[]
[]
[]
[]
[]
[]
[]
[]
[]
[]
[]
[]
[]
[]
[]
[]
[]
[]
[]
[]
[]
[]
[]
[]
[]
[]
[]
[]
[]
[]
[]
[]
[]
[]
[]
[]
[]
[]
[]
[]
[]
[]
[]
[]
[]
[]
[]
[]
[]
[]
[]
[]
[]
[]
[]
[]
[]
[]
[]
[]
[]
[]
[]
[]
[]
[]
[]
[]
[]
[]
[]
[]
[]
[]
[]
[]
[]
[]
[]
[]
[]
[]
[]
[]
[]
[]
[]
[]
[]
[]
[]
[]
[]
[]
[]
[]
[]
[]
[]
[]
[]
[]
[]
[]
[]
[]
[]
[]
[]
[]
[]
[]
[]
[]
[]
[]
[]
[]
[]
[]
[]
[]
[]
[]
[]
[]
[]
[]
[]
[]
[]
[]
[]
[]
[]
[]
[]
[]
[]
[]
[]
[]
[]
[]
[]
[]
[]
[]
[]
[]
[]
[]
[]
[]
[]
[]
[]
[]
[]
[]
[]
[]
[]
[]
[]
[]
[]
[]
[]
[]
[]
[]
[]
[]
[]
[]
[]
[]
[]
[]
[]
[]
[]
[]
[]
[]
[]
[]
[]
[]
[]
[]
[]
[]
[]
[]
[]
[]
[]
[]
[]
[]
[]
[]
[]
[]
[]
[]
[]
[]
[]
[]
[]
[]
[]
[]
[]
[]
[]
[]
[]
[]
[]
[]
[]
[]
[]
[]
[]
[]
[]
[]
[]
[]
[]
[]
[]
[]
[]
[]
[]
[]
[]
[]
[]
[]
[]
[]
[]
[]
[]
[]
[]
[]
[]
[]
[]
[]
[]
[]
[]
[]
[]
[]
[]
[]
[]
[]
[]
[]
[]
[]
[]
[]
[]
[]
[]
[]
[]
[]
[]
[]
[]
[]
[]
[]
[]
[]
[]
[]
[]
[]
[]
[]
[]
[]
[]
[]
[]
[]
[]
[]
[]
[]
[]
[]
[]
[]
[]
[]
[]
[]
[]
[]
[]
[]
[]
[]
[]
[]
[]
[]
[]
[]
[]
[]
[]
[]
[]
[]
[]
[]
[]
[]
[]
[]
[]
[]
[]
[]
[]
[]
[]
[]
[]
[]
[]
[]
[]
[]
[]
[]
[]
[]
[]
[]
[]
[]
[]
[]
[]
[]
[]
[]
[]
[]
[]
[]
[]
[]
[]
[]
[]
[]
[]
[]
[]
[]
[]
[]
[]
[]
[]
[]
[]
[]
[]
[]
[]
[]
[]
[]
[]
[]
[]
[]
[]
[]
[]
[]
[]
[]
[]
[]
[]
[]
[]
[]
[]
[]
[]
[]
[]
[]
[]
[]
[]
[]
[]
[]
[]
[]
[]
[]
[]
[]
[]
[]
[]
[]
[]
[]
[]
[]
[]
[]
[]
[]
[]
[]
[]
[]
[]
[]
[]
[]
[]
[]
[]
[]
[]
[]
[]
[]
[]
[]
[]
[]
[]
[]
[]
[]
[]
[]
[]
[]
[]
[]
[]
[]
[]
[]
[]
[]
[]
[]
[]
[]
[]
[]
[]
[]
[]
[]
[]
[]
[]
[]
[]
[]
[]
[]
[]
[]
[]
[]
[]
[]
[]
[]
[]
[]
[]
[]
[]
[]
[]
[]
[]
[]
[]
[]
[]
[]
[]
[]
[]
[]
[]
[]
[]
[]
[]
[]
[]
[]
[]
[]
[]
[]
[]
[]
[]
[]
[]
[]
[]
[]
[]
[]
[]
[]
[]
[]
[]
[]
[]
[]
[]
[]
[]
[]
[]
[]
[]
[]
[]
[]
[]
[]
[]
[]
[]
[]
[]
[]
[]
[]
[]
[]
[]
[]
[]
[]
[]
[]
[]
[]
[]
[]
[]
[]
[]
[]
[]
[]
[]
[]
[]
[]
[]
[]
[]
[]
[]
[]
[]
[]
[]
[]
[]
[]
[]
[]
[]
[]
[]
[]
[]
[]
[]
[]
[]
[]
[]
[]
[]
[]
[]
[]
[]
[]
[]
[]
[]
[]
[]
[]
[]
[]
[]
[]
[]
[]
[]
[]
[]
[]
[]
[]
[]
[]
[]
[]
[]
[]
[]
[]
[]
[]
[]
[]
[]
[]
[]
[]
[]
[]
[]
[]
[]
[]
[]
[]
[]
[]
[]
[]
[]
[]
[]
[]
[]
[]
[]
[]
[]
[]
[]
[]
[]
[]
[]
[]
[]
[]
[]
[]
[]
[]
[]
[]
[]
[]
[]
[]
[]
[]
[]
[]
[]
[]
[]
[]
[]
[]
[]
[]
[]
[]
[]
[]
[]
[]
[]
[]
[]
[]
[]
[]
[]
[]
[]
[]
[]
[]
[]
[]
[]
[]
[]
[]
[]
[]
[]
[]
[]
[]
[]
[]
[]
[]
[]
[]
[]
[]
[]
[]
[]
[]
[]
[]
[]
[]
[]
[]
[]
[]
[]
[]
[]
[]
[]
[]
[]
[]
[]
[]
[]
[]
[]
[]
[]
[]
[]
[]
[]
[]
[]
[]
[]
[]
[]
[]
[]
[]
[]
[]
[]
[]
[]
[]
[]
[]
[]
[]
[]
[]
[]
[]
[]
[]
[]
[]
[]
[]
[]
[]
[]
[]
[]
[]
[]
[]
[]
[]
[]
[]
[]
[]
[]
[]
[]
[]
[]
[]
[]
[]
[]
[]
[]
[]
[]
[]
[]
[]
[]
[]
[]
[]
[]
[]
[]
[]
[]
[]
[]
[]
[]
[]
[]
[]
[]
[]
[]
[]
[]
[]
[]
[]
[]
[]
[]
[]
[]
[]
[]
[]
[]
[]
[]
[]
[]
[]
[]
[]
[]
[]
[]
[]
[]
[]
[]
[]
[]
[]
[]
[]
[]
[]
[]
[]
[]
[]
[]
[]
[]
[]
[]
[]
[]
[]
[]
[]
[]
[]
[]
[]
[]
[]
[]
[]
[]
[]
[]
[]
[]
[]
[]
[]
[]
[]
[]
[]
[]
[]
[]
[]
[]
[]
[]
[]
[]
[]
[]
[]
[]
[]
[]
[]
[]
[]
[]
[]
[]
[]
[]
[]
[]
[]
[]
[]
[]
[]
[]
[]
[]
[]
[]
[]
[]
[]
[]
[]
[]
[]
[]
[]
[]
[]
[]
[]
[]
[]
[]
[]
[]
[]
[]
[]
[]
[]
[]
[]
[]
[]
[]
[]
[]
[]
[]
[]
[]
[]
[]
[]
[]
[]
[]
[]
[]
[]
[]
[]
[]
[]
[]
[]
[]
[]
[]
[]
[]
[]
[]
[]
[]
[]
[]
[]
[]
[]
[]
[]
[]
[]
[]
[]
[]
[]
[]
[]
[]
[]
[]
[]
[]
[]
[]
[]
[]
[]
[]
[]
[]
[]
[]
[]
[]
[]
[]
[]
[]
[]
[]
[]
[]
[]
[]
[]
[]
[]
[]
[]
[]
[]
[]
[]
[]
[]
[]
[]
[]
[]
[]
[]
[]
[]
[]
[]
[]
[]
[]
[]
[]
[]
[]
[]
[]
[]
[]
[]
[]
[]
[]
[]
[]
[]
[]
[]
[]
[]
[]
[]
[]
[]
[]
[]
[]
[]
[]
[]
[]
[]
[]
[]
[]
[]
[]
[]
[]
[]
[]
[]
[]
[]
[]
[]
[]
[]
[]
[]
[]
[]
[]
[]
[]
[]
[]
[]
[]
[]
[]
[]
[]
[]
[]
[]
[]
[]
[]
[]
[]
[]
[]
[]
[]
[]
[]
[]
[]
[]
[]
[]
[]
[]
[]
[]
[]
[]
[]
[]
[]
[]
[]
[]
[]
[]
[]
[]
[]
[]
[]
[]
[]
[]
[]
[]
[]
[]
[]
[]
[]
[]
[]
[]
[]
[]
[]
[]
[]
[]
[]
[]
[]
[]
[]
[]
[]
[]
[]
[]
[]
[]
[]
[]
[]
[]
[]
[]
[]
[]
[]
[]
[]
[]
[]
[]
[]
[]
[]
[]
[]
[]
[]
[]
[]
[]
[]
[]
[]
[]
[]
[]
[]
[]
[]
[]
[]
[]
[]
[]
[]
[]
[]
[]
[]
[]
[]
[]
[]
[]
[]
[]
[]
[]
[]
[]
[]
[]
[]
[]
[]
[]
[]
[]
[]
[]
[]
[]
[]
[]
[]
[]
[]
[]
[]
[]
[]
[]
[]
[]
[]
[]
[]
[]
[]
[]
[]
[]
[]
[]
[]
[]
[]
[]
[]
[]
[]
[]
[]
[]
[]
[]
[]
[]
[]
[]
[]
[]
[]
[]
[]
[]
[]
[]
[]
[]
[]
[]
[]
[]
[]
[]
[]
[]
[]
[]
[]
[]
[]
[]
[]
[]
[]
[]
[]
[]
[]
[]
[]
[]
[]
[]
[]
[]
[]
[]
[]
[]
[]
[]
[]
[]
[]
[]
[]
[]
[]
[]
[]
[]
[]
[]
[]
[]
[]
[]
[]
[]
[]
[]
[]
[]
[]
[]
[]
[]
[]
[]
[]
[]
[]
[]
[]
[]
[]
[]
[]
[]
[]
[]
[]
[]
[]
[]
[]
[]
[]
[]
[]
[]
[]
[]
[]
[]
[]
[]
[]
[]
[]
[]
[]
[]
[]
[]
[]
[]
[]
[]
[]
[]
[]
[]
[]
[]
[]
[]
[]
[]
[]
[]
[]
[]
[]
[]
[]
[]
[]
[]
[]
[]
[]
[]
[]
[]
[]
[]
[]
[]
[]
[]
[]
[]
[]
[]
[]
[]
[]
[]
[]
[]
[]
[]
[]
[]
[]
[]
[]
[]
[]
[]
[]
[]
[]
[]
[]
[]
[]
[]
[]
[]
[]
[]
[]
[]
[]
[]
[]
[]
[]
[]
[]
[]
[]
[]
[]
[]
[]
[]
[]
[]
[]
[]
[]
[]
[]
[]
[]
[]
[]
[]
[]
[]
[]
[]
[]
[]
[]
[]
[]
[]
[]
[]
[]
[]
[]
[]
[]
[]
[]
[]
[]
[]
[]
[]
[]
[]
[]
[]
[]
[]
[]
[]
[]
[]
[]
[]
[]
[]
[]
[]
[]
[]
[]
[]
[]
[]
[]
[]
[]
[]
[]
[]
[]
[]
[]
[]
[]
[]
[]
[]
[]
[]
[]
[]
[]
[]
[]
[]
[]
[]
[]
[]
[]
[]
[]
[]
[]
[]
[]
[]
[]
[]
[]
[]
[]
[]
[]
[]
[]
[]
[]
[]
[]
[]
[]
[]
[]
[]
[]
[]
[]
[]
[]
[]
[]
[]
[]
[]
[]
[]
[]
[]
[]
[]
[]
[]
[]
[]
[]
[]
[]
[]
[]
[]
[]
[]
[]
[]
[]
[]
[]
[]
[]
[]
[]
[]
[]
[]
[]
[]
[]
[]
[]
[]
[]
[]
[]
[]
[]
[]
[]
[]
[]
[]
[]
[]
[]
[]
[]
[]
[]
[]
[]
[]
[]
[]
[]
[]
[]
[]
[]
[]
[]
[]
[]
[]
[]
[]
[]
[]
[]
[]
[]
[]
[]
[]
[]
[]
[]
[]
[]
[]
[]
[]
[]
[]
[]
[]
[]
[]
[]
[]
[]
[]
[]
[]
[]
[]
[]
[]
[]
[]
[]
[]
[]
[]
[]
[]
[]
[]
[]
[]
[]
[]
[]
[]
[]
[]
[]
[]
[]
[]
[]
[]
[]
[]
[]
[]
[]
[]
[]
[]
[]
[]
[]
[]
[]
[]
[]
[]
[]
[]
[]
[]
[]
[]
[]
[]
[]
[]
[]
[]
[]
[]
[]
[]
[]
[]
[]
[]
[]
[]
[]
[]
[]
[]
[]
[]
[]
[]
[]
[]
[]
[]
[]
[]
[]
[]
[]
[]
[]
[]
[]
[]
[]
[]
[]
[]
[]
[]
[]
[]
[]
[]
[]
[]
[]
[]
[]
[]
[]
[]
[]
[]
[]
[]
[]
[]
[]
[]
[]
[]
[]
[]
[]
[]
[]
[]
[]
[]
[]
[]
[]
[]
[]
[]
[]
[]
[]
[]
[]
[]
[]
[]
[]
[]
[]
[]
[]
[]
[]
[]
[]
[]
[]
[]
[]
[]
[]
[]
[]
[]
[]
[]
[]
[]
[]
[]
[]
[]
[]
[]
[]
[]
[]
[]
[]
[]
[]
[]
[]
[]
[]
[]
[]
[]
[]
[]
[]
[]
[]
[]
[]
[]
[]
[]
[]
[]
[]
[]
[]
[]
[]
[]
[]
[]
[]
[]
[]
[]
[]
[]
[]
[]
[]
[]
[]
[]
[]
[]
[]
[]
[]
[]
[]
[]
[]
[]
[]
[]
[]
[]
[]
[]
[]
[]
[]
[]
[]
[]
[]
[]
[]
[]
[]
[]
[]
[]
[]
[]
[]
[]
[]
[]
[]
[]
[]
[]
[]
[]
[]
[]
[]
[]
[]
[]
[]
[]
[]
[]
[]
[]
[]
[]
[]
[]
[]
[]
[]
[]
[]
[]
[]
[]
[]
[]
[]
[]
[]
[]
[]
[]
[]
[]
[]
[]
[]
[]
[]
[]
[]
[]
[]
[]
[]
[]
[]
[]
[]
[]
[]
[]
[]
[]
[]
[]
[]
[]
[]
[]
[]
[]
[]
[]
[]
[]
[]
[]
[]
[]
[]
[]
[]
[]
[]
[]
[]
[]
[]
[]
[]
[]
[]
[]
[]
[]
[]
[]
[]
[]
[]
[]
[]
[]
[]
[]
[]
[]
[]
[]
[]
[]
[]
[]
[]
[]
[]
[]
[]
[]
[]
[]
[]
[]
[]
[]
[]
[]
[]
[]
[]
[]
[]
[]
[]
[]
[]
[]
[]
[]
[]
[]
[]
[]
[]
[]
[]
[]
[]
[]
[]
[]
[]
[]
[]
[]
[]
[]
[]
[]
[]
[]
[]
[]
[]
[]
[]
[]
[]
[]
[]
[]
[]
[]
[]
[]
[]
[]
[]
[]
[]
[]
[]
[]
[]
[]
[]
[]
[]
[]
[]
[]
[]
[]
[]
[]
[]
[]
[]
[]
[]
[]
[]
[]
[]
[]
[]
[]
[]
[]
[]
[]
[]
[]
[]
[]
[]
[]
[]
[]
[]
[]
[]
[]
[]
[]
[]
[]
[]
[]
[]
[]
[]
[]
[]
[]
[]
[]
[]
[]
[]
[]
[]
[]
[]
[]
[]
[]
[]
[]
[]
[]
[]
[]
[]
[]
[]
[]
[]
[]
[]
[]
[]
[]
[]
[]
[]
[]
[]
[]
[]
[]
[]
[]
[]
[]
[]
[]
[]
[]
[]
[]
[]
[]
[]
[]
[]
[]
[]
[]
[]
[]
[]
[]
[]
[]
[]
[]
[]
[]
[]
[]
[]
[]
[]
[]
[]
[]
[]
[]
[]
[]
[]
[]
[]
[]
[]
[]
[]
[]
[]
[]
[]
[]
[]
[]
[]
[]
[]
[]
[]
[]
[]
[]
[]
[]
[]
[]
[]
[]
[]
[]
[]
[]
[]
[]
[]
[]
[]
[]
[]
[]
[]
[]
[]
[]
[]
[]
[]
[]
[]
[]
[]
[]
[]
[]
[]
[]
[]
[]
[]
[]
[]
[]
[]
[]
[]
[]
[]
[]
[]
[]
[]
[]
[]
[]
[]
[]
[]
[]
[]
[]
[]
[]
[]
[]
[]
[]
[]
[]
[]
[]
[]
[]
[]
[]
[]
[]
[]
[]
[]
[]
[]
[]
[]
[]
[]
[]
[]
[]
[]
[]
[]
[]
[]
[]
[]
[]
[]
[]
[]
[]
[]
[]
[]
[]
[]
[]
[]
[]
[]
[]
[]
[]
[]
[]
[]
[]
[]
[]
[]
[]
[]
[]
[]
[]
[]
[]
[]
[]
[]
[]
[]
[]
[]
[]
[]
[]
[]
[]
[]
[]
[]
[]
[]
[]
[]
[]
[]
[]
[]
[]
[]
[]
[]
[]
[]
[]
[]
[]
[]
[]
[]
[]
[]
[]
[]
[]
[]
[]
[]
[]
[]
[]
[]
[]
[]
[]
[]
[]
[]
[]
[]
[]
[]
[]
[]
[]
[]
[]
[]
[]
[]
[]
[]
[]
[]
[]
[]
[]
[]
[]
[]
[]
[]
[]
[]
[]
[]
[]
[]
[]
[]
[]
[]
[]
[]
[]
[]
[]
[]
[]
[]
[]
[]
[]
[]
[]
[]
[]
[]
[]
[]
[]
[]
[]
[]
[]
[]
[]
[]
[]
[]
[]
[]
[]
[]
[]
[]
[]
[]
[]
[]
[]
[]
[]
[]
[]
[]
[]
[]
[]
[]
[]
[]
[]
[]
[]
[]
[]
[]
[]
[]
[]
[]
[]
[]
[]
[]
[]
[]
[]
[]
[]
[]
[]
[]
[]
[]
[]
[]
[]
[]
[]
[]
[]
[]
[]
[]
[]
[]
[]
[]
[]
[]
[]
[]
[]
[]
[]
[]
[]
[]
[]
[]
[]
[]
[]
[]
[]
[]
[]
[]
[]
[]
[]
[]
[]
[]
[]
[]
[]
[]
[]
[]
[]
[]
[]
[]
[]
[]
[]
[]
[]
[]
[]
[]
[]
[]
[]
[]
[]
[]
[]
[]
[]
[]
[]
[]
[]
[]
[]
[]
[]
[]
[]
[]
[]
[]
[]
[]
[]
[]
[]
[]
[]
[]
[]
[]
[]
[]
[]
[]
[]
[]
[]
[]
[]
[]
[]
[]
[]
[]
[]
[]
[]
[]
[]
[]
[]
[]
[]
[]
[]
[]
[]
[]
[]
[]
[]
[]
[]
[]
[]
[]
[]
[]
[]
[]
[]
[]
[]
[]
[]
[]
[]
[]
[]
[]
[]
[]
[]
[]
[]
[]
[]
[]
[]
[]
[]
[]
[]
[]
[]
[]
[]
[]
[]
[]
[]
[]
[]
[]
[]
[]
[]
[]
[]
[]
[]
[]
[]
[]
[]
[]
[]
[]
[]
[]
[]
[]
[]
[]
[]
[]
[]
[]
[]
[]
[]
[]
[]
[]
[]
[]
[]
[]
[]
[]
[]
[]
[]
[]
[]
[]
[]
[]
[]
[]
[]
[]
[]
[]
[]
[]
[]
[]
[]
[]
[]
[]
[]
[]
[]
[]
[]
[]
[]
[]
[]
[]
[]
[]
[]
[]
[]
[]
[]
[]
[]
[]
[]
[]
[]
[]
[]
[]
[]
[]
[]
[]
[]
[]
[]
[]
[]
[]
[]
[]
[]
[]
[]
[]
[]
[]
[]
[]
[]
[]
[]
[]
[]
[]
[]
[]
[]
[]
[]
[]
[]
[]
[]
[]
[]
[]
[]
[]
[]
[]
[]
[]
[]
[]
[]
[]
[]
[]
[]
[]
[]
[]
[]
[]
[]
[]
[]
[]
[]
[]
[]
[]
[]
[]
[]
[]
[]
[]
[]
[]
[]
[]
[]
[]
[]
[]
[]
[]
[]
[]
[]
[]
[]
[]
[]
[]
[]
[]
[]
[]
[]
[]
[]
[]
[]
[]
[]
[]
[]
[]
[]
[]
[]
[]
[]
[]
[]
[]
[]
[]
[]
[]
[]
[]
[]
[]
[]
[]
[]
[]
[]
[]
[]
[]
[]
[]
[]
[]
[]
[]
[]
[]
[]
[]
[]
[]
[]
[]
[]
[]
[]
[]
[]
[]
[]
[]
[]
[]
[]
[]
[]
[]
[]
[]
[]
[]
[]
[]
[]
[]
[]
[]
[]
[]
[]
[]
[]
[]
[]
[]
[]
[]
[]
[]
[]
[]
[]
[]
[]
[]
[]
[]
[]
[]
[]
[]
[]
[]
[]
[]
[]
[]
[]
[]
[]
[]
[]
[]
[]
[]
[]
[]
[]
[]
[]
[]
[]
[]
[]
[]
[]
[]
[]
[]
[]
[]
[]
[]
[]
[]
[]
[]
[]
[]
[]
[]
[]
[]
[]
[]
[]
[]
[]
[]
[]
[]
[]
[]
[]
[]
[]
[]
[]
[]
[]
[]
[]
[]
[]
[]
[]
[]
[]
[]
[]
[]
[]
[]
[]
[]
[]
[]
[]
[]
[]
[]
[]
[]
[]
[]
[]
[]
[]
[]
[]
[]
[]
[]
[]
[]
[]
[]
[]
[]
[]
[]
[]
[]
[]
[]
[]
[]
[]
[]
[]
[]
[]
[]
[]
[]
[]
[]
[]
[]
[]
[]
[]
[]
[]
[]
[]
[]
[]
[]
[]
[]
[]
[]
[]
[]
[]
[]
[]
[]
[]
[]
[]
[]
[]
[]
[]
[]
[]
[]
[]
[]
[]
[]
[]
[]
[]
[]
[]
[]
[]
[]
[]
[]
[]
[]
[]
[]
[]
[]
[]
[]
[]
[]
[]
[]
[]
[]
[]
[]
[]
[]
[]
[]
[]
[]
[]
[]
[]
[]
[]
[]
[]
[]
[]
[]
[]
[]
[]
[]
[]
[]
[]
[]
[]
[]
[]
[]
[]
[]
[]
[]
[]
[]
[]
[]
[]
[]
[]
[]
[]
[]
[]
[]
[]
[]
[]
[]
[]
[]
[]
[]
[]
[]
[]
[]
[]
[]
[]
[]
[]
[]
[]
[]
[]
[]
[]
[]
[]
[]
[]
[]
[]
[]
[]
[]
[]
[]
[]
[]
[]
[]
[]
[]
[]
[]
[]
[]
[]
[]
[]
[]
[]
[]
[]
[]
[]
[]
[]
[]
[]
[]
[]
[]
[]
[]
[]
[]
[]
[]
[]
[]
[]
[]
[]
[]
[]
[]
[]
[]
[]
[]
[]
[]
[]
[]
[]
[]
[]
[]
[]
[]
[]
[]
[]
[]
[]
[]
[]
[]
[]
[]
[]
[]
[]
[]
[]
[]
[]
[]
[]
[]
[]
[]
[]
[]
[]
[]
[]
[]
[]
[]
[]
[]
[]
[]
[]
[]
[]
[]
[]
[]
[]
[]
[]
[]
[]
[]
[]
[]
[]
[]
[]
[]
[]
[]
[]
[]
[]
[]
[]
[]
[]
[]
[]
[]
[]
[]
[]
[]
[]
[]
[]
[]
[]
[]
[]
[]
[]
[]
[]
[]
[]
[]
[]
[]
[]
[]
[]
[]
[]
[]
[]
[]
[]
[]
[]
[]
[]
[]
[]
[]
[]
[]
[]
[]
[]
[]
[]
[]
[]
[]
[]
[]
[]
[]
[]
[]
[]
[]
[]
[]
[]
[]
[]
[]
[]
[]
[]
[]
[]
[]
[]
[]
[]
[]
[]
[]
[]
[]
[]
[]
[]
[]
[]
[]
[]
[]
[]
[]
[]
[]
[]
[]
[]
[]
[]
[]
[]
[]
[]
[]
[]
[]
[]
[]
[]
[]
[]
[]
[]
[]
[]
[]
[]
[]
[]
[]
[]
[]
[]
[]
[]
[]
[]
[]
[]
[]
[]
[]
[]
[]
[]
[]
[]
[]
[]
[]
[]
[]
[]
[]
[]
[]
[]
[]
[]
[]
[]
[]
[]
[]
[]
[]
[]
[]
[]
[]
[]
[]
[]
[]
[]
[]
[]
[]
[]
[]
[]
[]
[]
[]
[]
[]
[]
[]
[]
[]
[]
[]
[]
[]
[]
[]
[]
[]
[]
[]
[]
[]
[]
[]
[]
[]
[]
[]
[]
[]
[]
[]
[]
[]
[]
[]
[]
[]
[]
[]
[]
[]
[]
[]
[]
[]
[]
[]
[]
[]
[]
[]
[]
[]
[]
[]
[]
[]
[]
[]
[]
[]
[]
[]
[]
[]
[]
[]
[]
[]
[]
[]
[]
[]
[]
[]
[]
[]
[]
[]
[]
[]
[]
[]
[]
[]
[]
[]
[]
[]
[]
[]
[]
[]
[]
[]
[]
[]
[]
[]
[]
[]
[]
[]
[]
[]
[]
[]
[]
[]
[]
[]
[]
[]
[]
[]
[]
[]
[]
[]
[]
[]
[]
[]
[]
[]
[]
[]
[]
[]
[]
[]
[]
[]
[]
[]
[]
[]
[]
[]
[]
[]
[]
[]
[]
[]
[]
[]
[]
[]
[]
[]
[]
[]
[]
[]
[]
[]
[]
[]
[]
[]
[]
[]
[]
[]
[]
[]
[]
[]
[]
[]
[]
[]
[]
[]
[]
[]
[]
[]
[]
[]
[]
[]
[]
[]
[]
[]
[]
[]
[]
[]
[]
[]
[]
[]
[]
[]
[]
[]
[]
[]
[]
[]
[]
[]
[]
[]
[]
[]
[]
[]
[]
[]
[]
[]
[]
[]
[]
[]
[]
[]
[]
[]
[]
[]
[]
[]
[]
[]
[]
[]
[]
[]
[]
[]
[]
[]
[]
[]
[]
[]
[]
[]
[]
[]
[]
[]
[]
[]
[]
[]
[]
[]
[]
[]
[]
[]
[]
[]
[]
[]
[]
[]
[]
[]
[]
[]
[]
[]
[]
[]
[]
[]
[]
[]
[]
[]
[]
[]
[]
[]
[]
[]
[]
[]
[]
[]
[]
[]
[]
[]
[]
[]
[]
[]
[]
[]
[]
[]
[]
[]
[]
[]
[]
[]
[]
[]
[]
[]
[]
[]
[]
[]
[]
[]
[]
[]
[]
[]
[]
[]
[]
[]
[]
[]
[]
[]
[]
[]
[]
[]
[]
[]
[]
[]
[]
[]
[]
[]
[]
[]
[]
[]
[]
[]
[]
[]
[]
[]
[]
[]
[]
[]
[]
[]
[]
[]
[]
[]
[]
[]
[]
[]
[]
[]
[]
[]
[]
[]
[]
[]
[]
[]
[]
[]
[]
[]
[]
[]
[]
[]
[]
[]
[]
[]
[]
[]
[]
[]
[]
[]
[]
[]
[]
[]
[]
[]
[]
[]
[]
[]
[]
[]
[]
[]
[]
[]
[]
[]
[]
[]
[]
[]
[]
[]
[]
[]
[]
[]
[]
[]
[]
[]
[]
[]
[]
[]
[]
[]
[]
[]
[]
[]
[]
[]
[]
[]
[]
[]
[]
[]
[]
[]
[]
[]
[]
[]
[]
[]
[]
[]
[]
[]
[]
[]
[]
[]
[]
[]
[]
[]
[]
[]
[]
[]
[]
[]
[]
[]
[]
[]
[]
[]
[]
[]
[]
[]
[]
[]
[]
[]
[]
[]
[]
[]
[]
[]
[]
[]
[]
[]
[]
[]
[]
[]
[]
[]
[]
[]
[]
[]
[]
[]
[]
[]
[]
[]
[]
[]
[]
[]
[]
[]
[]
[]
[]
[]
[]
[]
[]
[]
[]
[]
[]
[]
[]
[]
[]
[]
[]
[]
[]
[]
[]
[]
[]
[]
[]
[]
[]
[]
[]
[]
[]
[]
[]
[]
[]
[]
[]
[]
[]
[]
[]
[]
[]
[]
[]
[]
[]
[]
[]
[]
[]
[]
[]
[]
[]
[]
[]
[]
[]
[]
[]
[]
[]
[]
[]
[]
[]
[]
[]
[]
[]
[]
[]
[]
[]
[]
[]
[]
[]
[]
[]
[]
[]
[]
[]
[]
[]
[]
[]
[]
[]
[]
[]
[]
[]
[]
[]
[]
[]
[]
[]
[]
[]
[]
[]
[]
[]
[]
[]
[]
[]
[]
[]
[]
[]
[]
[]
[]
[]
[]
[]
[]
[]
[]
[]
[]
[]
[]
[]
[]
[]
[]
[]
[]
[]
[]
[]
[]
[]
[]
[]
[]
[]
[]
[]
[]
[]
[]
[]
[]
[]
[]
[]
[]
[]
[]
[]
[]
[]
[]
[]
[]
[]
[]
[]
[]
[]
[]
[]
[]
[]
[]
[]
[]
[]
[]
[]
[]
[]
[]
[]
[]
[]
[]
[]
[]
[]
[]
[]
[]
[]
[]
[]
[]
[]
[]
[]
[]
[]
[]
[]
[]
[]
[]
[]
[]
[]
[]
[]
[]
[]
[]
[]
[]
[]
[]
[]
[]
[]
[]
[]
[]
[]
[]
[]
[]
[]
[]
[]
[]
[]
[]
[]
[]
[]
[]
[]
[]
[]
[]
[]
[]
[]
[]
[]
[]
[]
[]
[]
[]
[]
[]
[]
[]
[]
[]
[]
[]
[]
[]
[]
[]
[]
[]
[]
[]
[]
[]
[]
[]
[]
[]
[]
[]
[]
[]
[]
[]
[]
[]
[]
[]
[]
[]
[]
[]
[]
[]
[]
[]
[]
[]
[]
[]
[]
[]
[]
[]
[]
[]
[]
[]
[]
[]
[]
[]
[]
[]
[]
[]
[]
[]
[]
[]
[]
[]
[]
[]
[]
[]
[]
[]
[]
[]
[]
[]
[]
[]
[]
[]
[]
[]
[]
[]
[]
[]
[]
[]
[]
[]
[]
[]
[]
[]
[]
[]
[]
[]
[]
[]
[]
[]
[]
[]
[]
[]
[]
[]
[]
[]
[]
[]
[]
[]
[]
[]
[]
[]
[]
[]
[]
[]
[]
[]
[]
[]
[]
[]
[]
[]
[]
[]
[]
[]
[]
[]
[]
[]
[]
[]
[]
[]
[]
[]
[]
[]
[]
[]
[]
[]
[]
[]
[]
[]
[]
[]
[]
[]
[]
[]
[]
[]
[]
[]
[]
[]
[]
[]
[]
[]
[]
[]
[]
[]
[]
[]
[]
[]
[]
[]
[]
[]
[]
[]
[]
[]
[]
[]
[]
[]
[]
[]
[]
[]
[]
[]
[]
[]
[]
[]
[]
[]
[]
[]
[]
[]
[]
[]
[]
[]
[]
[]
[]
[]
[]
[]
[]
[]
[]
[]
[]
[]
[]
[]
[]
[]
[]
[]
[]
[]
[]
[]
[]
[]
[]
[]
[]
[]
[]
[]
[]
[]
[]
[]
[]
[]
[]
[]
[]
[]
[]
[]
[]
[]
[]
[]
[]
[]
[]
[]
[]
[]
[]
[]
[]
[]
[]
[]
[]
[]
[]
[]
[]
[]
[]
[]
[]
[]
[]
[]
[]
[]
[]
[]
[]
[]
[]
[]
[]
[]
[]
[]
[]
[]
[]
[]
[]
[]
[]
[]
[]
[]
[]
[]
[]
[]
[]
[]
[]
[]
[]
[]
[]
[]
[]
[]
[]
[]
[]
[]
[]
[]
[]
[]
[]
[]
[]
[]
[]
[]
[]
[]
[]
[]
[]
[]
[]
[]
[]
[]
[]
[]
[]
[]
[]
[]
[]
[]
[]
[]
[]
[]
[]
[]
[]
[]
[]
[]
[]
[]
[]
[]
[]
[]
[]
[]
[]
[]
[]
[]
[]
[]
[]
[]
[]
[]
[]
[]
[]
[]
[]
[]
[]
[]
[]
[]
[]
[]
[]
[]
[]
[]
[]
[]
[]
[]
[]
[]
[]
[]
[]
[]
[]
[]
[]
[]
[]
[]
[]
[]
[]
[]
[]
[]
[]
[]
[]
[]
[]
[]
[]
[]
[]
[]
[]
[]
[]
[]
[]
[]
[]
[]
[]
[]
[]
[]
[]
[]
[]
[]
[]
[]
[]
[]
[]
[]
[]
[]
[]
[]
[]
[]
[]
[]
[]
[]
[]
[]
[]
[]
[]
[]
[]
[]
[]
[]
[]
[]
[]
[]
[]
[]
[]
[]
[]
[]
[]
[]
[]
[]
[]
[]
[]
[]
[]
[]
[]
[]
[]
[]
[]
[]
[]
[]
[]
[]
[]
[]
[]
[]
[]
[]
[]
[]
[]
[]
[]
[]
[]
[]
[]
[]
[]
[]
[]
[]
[]
[]
[]
[]
[]
[]
[]
[]
[]
[]
[]
[]
[]
[]
[]
[]
[]
[]
[]
[]
[]
[]
[]
[]
[]
[]
[]
[]
[]
[]
[]
[]
[]
[]
[]
[]
[]
[]
[]
[]
[]
[]
[]
[]
[]
[]
[]
[]
[]
[]
[]
[]
[]
[]
[]
[]
[]
[]
[]
[]
[]
[]
[]
[]
[]
[]
[]
[]
[]
[]
[]
[]
[]
[]
[]
[]
[]
[]
[]
[]
[]
[]
[]
[]
[]
[]
[]
[]
[]
[]
[]
[]
[]
[]
[]
[]
[]
[]
[]
[]
[]
[]
[]
[]
[]
[]
[]
[]
[]
[]
[]
[]
[]
[]
[]
[]
[]
[]
[]
[]
[]
[]
[]
[]
[]
[]
[]
[]
[]
[]
[]
[]
[]
[]
[]
[]
[]
[]
[]
[]
[]
[]
[]
[]
[]
[]
[]
[]
[]
[]
[]
[]
[]
[]
[]
[]
[]
[]
[]
[]
[]
[]
[]
[]
[]
[]
[]
[]
[]
[]
[]
[]
[]
[]
[]
[]
[]
[]
[]
[]
[]
[]
[]
[]
[]
[]
[]
[]
[]
[]
[]
[]
[]
[]
[]
[]
[]
[]
[]
[]
[]
[]
[]
[]
[]
[]
[]
[]
[]
[]
[]
[]
[]
[]
[]
[]
[]
[]
[]
[]
[]
[]
[]
[]
[]
[]
[]
[]
[]
[]
[]
[]
[]
[]
[]
[]
[]
[]
[]
[]
[]
[]
[]
[]
[]
[]
[]
[]
[]
[]
[]
[]
[]
[]
[]
[]
[]
[]
[]
[]
[]
[]
[]
[]
[]
[]
[]
[]
[]
[]
[]
[]
[]
[]
[]
[]
[]
[]
[]
[]
[]
[]
[]
[]
[]
[]
[]
[]
[]
[]
[]
[]
[]
[]
[]
[]
[]
[]
[]
[]
[]
[]
[]
[]
[]
[]
[]
[]
[]
[]
[]
[]
[]
[]
[]
[]
[]
[]
[]
[]
[]
[]
[]
[]
[]
[]
[]
[]
[]
[]
[]
[]
[]
[]
[]
[]
[]
[]
[]
[]
[]
[]
[]
[]
[]
[]
[]
[]
[]
[]
[]
[]
[]
[]
[]
[]
[]
[]
[]
[]
[]
[]
[]
[]
[]
[]
[]
[]
[]
[]
[]
[]
[]
[]
[]
[]
[]
[]
[]
[]
[]
[]
[]
[]
[]
[]
[]
[]
[]
[]
[]
[]
[]
[]
[]
[]
[]
[]
[]
[]
[]
[]
[]
[]
[]
[]
[]
[]
[]
[]
[]
[]
[]
[]
[]
[]
[]
[]
[]
[]
[]
[]
[]
[]
[]
[]
[]
[]
[]
[]
[]
[]
[]
[]
[]
[]
[]
[]
[]
[]
[]
[]
[]
[]
[]
[]
[]
[]
[]
[]
[]
[]
[]
[]
[]
[]
[]
[]
[]
[]
[]
[]
[]
[]
[]
[]
[]
[]
[]
[]
[]
[]
[]
[]
[]
[]
[]
[]
[]
[]
[]
[]
[]
[]
[]
[]
[]
[]
[]
[]
[]
[]
[]
[]
[]
[]
[]
[]
[]
[]
[]
[]
[]
[]
[]
[]
[]
[]
[]
[]
[]
[]
[]
[]
[]
[]
[]
[]
[]
[]
[]
[]
[]
[]
[]
[]
[]
[]
[]
[]
[]
[]
[]
[]
[]
[]
[]
[]
[]
[]
[]
[]
[]
[]
[]
[]
[]
[]
[]
[]
[]
[]
[]
[]
[]
[]
[]
[]
[]
[]
[]
[]
[]
[]
[]
[]
[]
[]
[]
[]
[]
[]
[]
[]
[]
[]
[]
[]
[]
[]
[]
[]
[]
[]
[]
[]
[]
[]
[]
[]
[]
[]
[]
[]
[]
[]
[]
[]
[]
[]
[]
[]
[]
[]
[]
[]
[]
[]
[]
[]
[]
[]
[]
[]
[]
[]
[]
[]
[]
[]
[]
[]
[]
[]
[]
[]
[]
[]
[]
[]
[]
[]
[]
[]
[]
[]
[]
[]
[]
[]
[]
[]
[]
[]
[]
[]
[]
[]
[]
[]
[]
[]
[]
[]
[]
[]
[]
[]
[]
[]
[]
[]
[]
[]
[]
[]
[]
[]
[]
[]
[]
[]
[]
[]
[]
[]
[]
[]
[]
[]
[]
[]
[]
[]
[]
[]
[]
[]
[]
[]
[]
[]
[]
[]
[]
[]
[]
[]
[]
[]
[]
[]
[]
[]
[]
[]
[]
[]
[]
[]
[]
[]
[]
[]
[]
[]
[]
[]
[]
[]
[]
[]
[]
[]
[]
[]
[]
[]
[]
[]
[]
[]
[]
[]
[]
[]
[]
[]
[]
[]
[]
[]
[]
[]
[]
[]
[]
[]
[]
[]
[]
[]
[]
[]
[]
[]
[]
[]
[]
[]
[]
[]
[]
[]
[]
[]
[]
[]
[]
[]
[]
[]
[]
[]
[]
[]
[]
[]
[]
[]
[]
[]
[]
[]
[]
[]
[]
[]
[]
[]
[]
[]
[]
[]
[]
[]
[]
[]
[]
[]
[]
[]
[]
[]
[]
[]
[]
[]
[]
[]
[]
[]
[]
[]
[]
[]
[]
[]
[]
[]
[]
[]
[]
[]
[]
[]
[]
[]
[]
[]
[]
[]
[]
[]
[]
[]
[]
[]
[]
[]
[]
[]
[]
[]
[]
[]
[]
[]
[]
[]
[]
[]
[]
[]
[]
[]
[]
[]
[]
[]
[]
[]
[]
[]
[]
[]
[]
[]
[]
[]
[]
[]
[]
[]
[]
[]
[]
[]
[]
[]
[]
[]
[]
[]
[]
[]
[]
[]
[]
[]
[]
[]
[]
[]
[]
[]
[]
[]
[]
[]
[]
[]
[]
[]
[]
[]
[]
[]
[]
[]
[]
[]
[]
[]
[]
[]
[]
[]
[]
[]
[]
[]
[]
[]
[]
[]
[]
[]
[]
[]
[]
[]
[]
[]
[]
[]
[]
[]
[]
[]
[]
[]
[]
[]
[]
[]
[]
[]
[]
[]
[]
[]
[]
[]
[]
[]
[]
[]
[]
[]
[]
[]
[]
[]
[]
[]
[]
[]
[]
[]
[]
[]
[]
[]
[]
[]
[]
[]
[]
[]
[]
[]
[]
[]
[]
[]
[]
[]
[]
[]
[]
[]
[]
[]
[]
[]
[]
[]
[]
[]
[]
[]
[]
[]
[]
[]
[]
[]
[]
[]
[]
[]
[]
[]
[]
[]
[]
[]
[]
[]
[]
[]
[]
[]
[]
[]
[]
[]
[]
[]
[]
[]
[]
[]
[]
[]
[]
[]
[]
[]
[]
[]
[]
[]
[]
[]
[]
[]
[]
[]
[]
[]
[]
[]
[]
[]
[]
[]
[]
[]
[]
[]
[]
[]
[]
[]
[]
[]
[]
[]
[]
[]
[]
[]
[]
[]
[]
[]
[]
[]
[]
[]
[]
[]
[]
[]
[]
[]
[]
[]
[]
[]
[]
[]
[]
[]
[]
[]
[]
[]
[]
[]
[]
[]
[]
[]
[]
[]
[]
[]
[]
[]
[]
[]
[]
[]
[]
[]
[]
[]
[]
[]
[]
[]
[]
[]
[]
[]
[]
[]
[]
[]
[]
[]
[]
[]
[]
[]
[]
[]
[]
[]
[]
[]
[]
[]
[]
[]
[]
[]
[]
[]
[]
[]
[]
[]
[]
[]
[]
[]
[]
[]
[]
[]
[]
[]
[]
[]
[]
[]
[]
[]
[]
[]
[]
[]
[]
[]
[]
[]
[]
[]
[]
[]
[]
[]
[]
[]
[]
[]
[]
[]
[]
[]
[]
[]
[]
[]
[]
[]
[]
[]
[]
[]
[]
[]
[]
[]
[]
[]
[]
[]
[]
[]
[]
[]
[]
[]
[]
[]
[]
[]
[]
[]
[]
[]
[]
[]
[]
[]
[]
[]
[]
[]
[]
[]
[]
[]
[]
[]
[]
[]
[]
[]
[]
[]
[]
[]
[]
[]
[]
[]
[]
[]
[]
[]
[]
[]
[]
[]
[]
[]
[]
[]
[]
[]
[]
[]
[]
[]
[]
[]
[]
[]
[]
[]
[]
[]
[]
[]
[]
[]
[]
[]
[]
[]
[]
[]
[]
[]
[]
[]
[]
[]
[]
[]
[]
[]
[]
[]
[]
[]
[]
[]
[]
[]
[]
[]
[]
[]
[]
[]
[]
[]
[]
[]
[]
[]
[]
[]
[]
[]
[]
[]
[]
[]
[]
[]
[]
[]
[]
[]
[]
[]
[]
[]
[]
[]
[]
[]
[]
[]
[]
[]
[]
[]
[]
[]
[]
[]
[]
[]
[]
[]
[]
[]
[]
[]
[]
[]
[]
[]
[]
[]
[]
[]
[]
[]
[]
[]
[]
[]
[]
[]
[]
[]
[]
[]
[]
[]
[]
[]
[]
[]
[]
[]
[]
[]
[]
[]
[]
[]
[]
[]
[]
[]
[]
[]
[]
[]
[]
[]
[]
[]
[]
[]
[]
[]
[]
[]
[]
[]
[]
[]
[]
[]
[]
[]
[]
[]
[]
[]
[]
[]
[]
[]
[]
[]
[]
[]
[]
[]
[]
[]
[]
[]
[]
[]
[]
[]
[]
[]
[]
[]
[]
[]
[]
[]
[]
[]
[]
[]
[]
[]
[]
[]
[]
[]
[]
[]
[]
[]
[]
[]
[]
[]
[]
[]
[]
[]
[]
[]
[]
[]
[]
[]
[]
[]
[]
[]
[]
[]
[]
[]
[]
[]
[]
[]
[]
[]
[]
[]
[]
[]
[]
[]
[]
[]
[]
[]
[]
[]
[]
[]
[]
[]
[]
[]
[]
[]
[]
[]
[]
[]
[]
[]
[]
[]
[]
[]
[]
[]
[]
[]
[]
[]
[]
[]
[]
[]
[]
[]
[]
[]
[]
[]
[]
[]
[]
[]
[]
[]
[]
[]
[]
[]
[]
[]
[]
[]
[]
[]
[]
[]
[]
[]
[]
[]
[]
[]
[]
[]
[]
[]
[]
[]
[]
[]
[]
[]
[]
[]
[]
[]
[]
[]
[]
[]
[]
[]
[]
[]
[]
[]
[]
[]
[]
[]
[]
[]
[]
[]
[]
[]
[]
[]
[]
[]
[]
[]
[]
[]
[]
[]
[]
[]
[]
[]
[]
[]
[]
[]
[]
[]
[]
[]
[]
[]
[]
[]
[]
[]
[]
[]
[]
[]
[]
[]
[]
[]
[]
[]
[]
[]
[]
[]
[]
[]
[]
[]
[]
[]
[]
[]
[]
[]
[]
[]
[]
[]
[]
[]
[]
[]
[]
[]
[]
[]
[]
[]
[]
[]
[]
[]
[]
[]
[]
[]
[]
[]
[]
[]
[]
[]
[]
[]
[]
[]
[]
[]
[]
[]
[]
[]
[]
[]
[]
[]
[]
[]
[]
[]
[]
[]
[]
[]
[]
[]
[]
[]
[]
[]
[]
[]
[]
[]
[]
[]
[]
[]
[]
[]
[]
[]
[]
[]
[]
[]
[]
[]
[]
[]
[]
[]
[]
[]
[]
[]
[]
[]
[]
[]
[]
[]
[]
[]
[]
[]
[]
[]
[]
[]
[]
[]
[]
[]
[]
[]
[]
[]
[]
[]
[]
[]
[]
[]
[]
[]
[]
[]
[]
[]
[]
[]
[]
[]
[]
[]
[]
[]
[]
[]
[]
[]
[]
[]
[]
[]
[]
[]
[]
[]
[]
[]
[]
[]
[]
[]
[]
[]
[]
[]
[]
[]
[]
[]
[]
[]
[]
[]
[]
[]
[]
[]
[]
[]
[]
[]
[]
[]
[]
[]
[]
[]
[]
[]
[]
[]
[]
[]
[]
[]
[]
[]
[]
[]
[]
[]
[]
[]
[]
[]
[]
[]
[]
[]
[]
[]
[]
[]
[]
[]
[]
[]
[]
[]
[]
[]
[]
[]
[]
[]
[]
[]
[]
[]
[]
[]
[]
[]
[]
[]
[]
[]
[]
[]
[]
[]
[]
[]
[]
[]
[]
[]
[]
[]
[]
[]
[]
[]
[]
[]
[]
[]
[]
[]
[]
[]
[]
[]
[]
[]
[]
[]
[]
[]
[]
[]
[]
[]
[]
[]
[]
[]
[]
[]
[]
[]
[]
[]
[]
[]
[]
[]
[]
[]
[]
[]
[]
[]
[]
[]
[]
[]
[]
[]
[]
[]
[]
[]
[]
[]
[]
[]
[]
[]
[]
[]
[]
[]
[]
[]
[]
[]
[]
[]
[]
[]
[]
[]
[]
[]
[]
[]
[]
[]
[]
[]
[]
[]
[]
[]
[]
[]
[]
[]
[]
[]
[]
[]
[]
[]
[]
[]
[]
[]
[]
[]
[]
[]
[]
[]
[]
[]
[]
[]
[]
[]
[]
[]
[]
[]
[]
[]
[]
[]
[]
[]
[]
[]
[]
[]
[]
[]
[]
[]
[]
[]
[]
[]
[]
[]
[]
[]
[]
[]
[]
[]
[]
[]
[]
[]
[]
[]
[]
[]
[]
[]
[]
[]
[]
[]
[]
[]
[]
[]
[]
[]
[]
[]
[]
[]
[]
[]
[]
[]
[]
[]
[]
[]
[]
[]
[]
[]
[]
[]
[]
[]
[]
[]
[]
[]
[]
[]
[]
[]
[]
[]
[]
[]
[]
[]
[]
[]
[]
[]
[]
[]
[]
[]
[]
[]
[]
[]
[]
[]
[]
[]
[]
[]
[]
[]
[]
[]
[]
[]
[]
[]
[]
[]
[]
[]
[]
[]
[]
[]
[]
[]
[]
[]
[]
[]
[]
[]
[]
[]
[]
[]
[]
[]
[]
[]
[]
[]
[]
[]
[]
[]
[]
[]
[]
[]
[]
[]
[]
[]
[]
[]
[]
[]
[]
[]
[]
[]
[]
[]
[]
[]
[]
[]
[]
[]
[]
[]
[]
[]
[]
[]
[]
[]
[]
[]
[]
[]
[]
[]
[]
[]
[]
[]
[]
[]
[]
[]
[]
[]
[]
[]
[]
[]
[]
[]
[]
[]
[]
[]
[]
[]
[]
[]
[]
[]
[]
[]
[]
[]
[]
[]
[]
[]
[]
[]
[]
[]
[]
[]
[]
[]
[]
[]
[]
[]
[]
[]
[]
[]
[]
[]
[]
[]
[]
[]
[]
[]
[]
[]
[]
[]
[]
[]
[]
[]
[]
[]
[]
[]
[]
[]
[]
[]
[]
[]
[]
[]
[]
[]
[]
[]
[]
[]
[]
[]
[]
[]
[]
[]
[]
[]
[]
[]
[]
[]
[]
[]
[]
[]
[]
[]
[]
[]
[]
[]
[]
[]
[]
[]
[]
[]
[]
[]
[]
[]
[]
[]
[]
[]
[]
[]
[]
[]
[]
[]
[]
[]
[]
[]
[]
[]
[]
[]
[]
[]
[]
[]
[]
[]
[]
[]
[]
[]
[]
[]
[]
[]
[]
[]
[]
[]
[]
[]
[]
[]
[]
[]
[]
[]
[]
[]
[]
[]
[]
[]
[]
[]
[]
[]
[]
[]
[]
[]
[]
[]
[]
[]
[]
[]
[]
[]
[]
[]
[]
[]
[]
[]
[]
[]
[]
[]
[]
[]
[]
[]
[]
[]
[]
[]
[]
[]
[]
[]
[]
[]
[]
[]
[]
[]
[]
[]
[]
[]
[]
[]
[]
[]
[]
[]
[]
[]
[]
[]
[]
[]
[]
[]
[]
[]
[]
[]
[]
[]
[]
[]
[]
[]
[]
[]
[]
[]
[]
[]
[]
[]
[]
[]
[]
[]
[]
[]
[]
[]
[]
[]
[]
[]
[]
[]
[]
[]
[]
[]
[]
[]
[]
[]
[]
[]
[]
[]
[]
[]
[]
[]
[]
[]
[]
[]
[]
[]
[]
[]
[]
[]
[]
[]
[]
[]
[]
[]
[]
[]
[]
[]
[]
[]
[]
[]
[]
[]
[]
[]
[]
[]
[]
[]
[]
[]
[]
[]
[]
[]
[]
[]
[]
[]
[]
[]
[]
[]
[]
[]
[]
[]
[]
[]
[]
[]
[]
[]
[]
[]
[]
[]
[]
[]
[]
[]
[]
[]
[]
[]
[]
[]
[]
[]
[]
[]
[]
[]
[]
[]
[]
[]
[]
[]
[]
[]
[]
[]
[]
[]
[]
[]
[]
[]
[]
[]
[]
[]
[]
[]
[]
[]
[]
[]
[]
[]
[]
[]
[]
[]
[]
[]
[]
[]
[]
[]
[]
[]
[]
[]
[]
[]
[]
[]
[]
[]
[]
[]
[]
[]
[]
[]
[]
[]
[]
[]
[]
[]
[]
[]
[]
[]
[]
[]
[]
[]
[]
[]
[]
[]
[]
[]
[]
[]
[]
[]
[]
[]
[]
[]
[]
[]
[]
[]
[]
[]
[]
[]
[]
[]
[]
[]
[]
[]
[]
[]
[]
[]
[]
[]
[]
[]
[]
[]
[]
[]
[]
[]
[]
[]
[]
[]
[]
[]
[]
[]
[]
[]
[]
[]
[]
[]
[]
[]
[]
[]
[]
[]
[]
[]
[]
[]
[]
[]
[]
[]
[]
[]
[]
[]
[]
[]
[]
[]
[]
[]
[]
[]
[]
[]
[]
[]
[]
[]
[]
[]
[]
[]
[]
[]
[]
[]
[]
[]
[]
[]
[]
[]
[]
[]
[]
[]
[]
[]
[]
[]
[]
[]
[]
[]
[]
[]
[]
[]
[]
[]
[]
[]
[]
[]
[]
[]
[]
[]
[]
[]
[]
[]
[]
[]
[]
[]
[]
[]
[]
[]
[]
[]
[]
[]
[]
[]
[]
[]
[]
[]
[]
[]
[]
[]
[]
[]
[]
[]
[]
[]
[]
[]
[]
[]
[]
[]
[]
[]
[]
[]
[]
[]
[]
[]
[]
[]
[]
[]
[]
[]
[]
[]
[]
[]
[]
[]
[]
[]
[]
[]
[]
[]
[]
[]
[]
[]
[]
[]
[]
[]
[]
[]
[]
[]
[]
[]
[]
[]
[]
[]
[]
[]
[]
[]
[]
[]
[]
[]
[]
[]
[]
[]
[]
[]
[]
[]
[]
[]
[]
[]
[]
[]
[]
[]
[]
[]
[]
[]
[]
[]
[]
[]
[]
[]
[]
[]
[]
[]
[]
[]
[]
[]
[]
[]
[]
[]
[]
[]
[]
[]
[]
[]
[]
[]
[]
[]
[]
[]
[]
[]
[]
[]
[]
[]
[]
[]
[]
[]
[]
[]
[]
[]
[]
[]
[]
[]
[]
[]
[]
[]
[]
[]
[]
[]
[]
[]
[]
[]
[]
[]
[]
[]
[]
[]
[]
[]
[]
[]
[]
[]
[]
[]
[]
[]
[]
[]
[]
[]
[]
[]
[]
[]
[]
[]
[]
[]
[]
[]
[]
[]
[]
[]
[]
[]
[]
[]
[]
[]
[]
[]
[]
[]
[]
[]
[]
[]
[]
[]
[]
[]
[]
[]
[]
[]
[]
[]
[]
[]
[]
[]
[]
[]
[]
[]
[]
[]
[]
[]
[]
[]
[]
[]
[]
[]
[]
[]
[]
[]
[]
[]
[]
[]
[]
[]
[]
[]
[]
[]
[]
[]
[]
[]
[]
[]
[]
[]
[]
[]
[]
[]
[]
[]
[]
[]
[]
[]
[]
[]
[]
[]
[]
[]
[]
[]
[]
[]
[]
[]
[]
[]
[]
[]
[]
[]
[]
[]
[]
[]
[]
[]
[]
[]
[]
[]
[]
[]
[]
[]
[]
[]
[]
[]
[]
[]
[]
[]
[]
[]
[]
[]
[]
[]
[]
[]
[]
[]
[]
[]
[]
[]
[]
[]
[]
[]
[]
[]
[]
[]
[]
[]
[]
[]
[]
[]
[]
[]
[]
[]
[]
[]
[]
[]
[]
[]
[]
[]
[]
[]
[]
[]
[]
[]
[]
[]
[]
[]
[]
[]
[]
[]
[]
[]
[]
[]
[]
[]
[]
[]
[]
[]
[]
[]
[]
[]
[]
[]
[]
[]
[]
[]
[]
[]
[]
[]
[]
[]
[]
[]
[]
[]
[]
[]
[]
[]
[]
[]
[]
[]
[]
[]
[]
[]
[]
[]
[]
[]
[]
[]
[]
[]
[]
[]
[]
[]
[]
[]
[]
[]
[]
[]
[]
[]
[]
[]
[]
[]
[]
[]
[]
[]
[]
[]
[]
[]
[]
[]
[]
[]
[]
[]
[]
[]
[]
[]
[]
[]
[]
[]
[]
[]
[]
[]
[]
[]
[]
[]
[]
[]
[]
[]
[]
[]
[]
[]
[]
[]
[]
[]
[]
[]
[]
[]
[]
[]
[]
[]
[]
[]
[]
[]
[]
[]
[]
[]
[]
[]
[]
[]
[]
[]
[]
[]
[]
[]
[]
[]
[]
[]
[]
[]
[]
[]
[]
[]
[]
[]
[]
[]
[]
[]
[]
[]
[]
[]
[]
[]
[]
[]
[]
[]
[]
[]
[]
[]
[]
[]
[]
[]
[]
[]
[]
[]
[]
[]
[]
[]
[]
[]
[]
[]
[]
[]
[]
[]
[]
[]
[]
[]
[]
[]
[]
[]
[]
[]
[]
[]
[]
[]
[]
[]
[]
[]
[]
[]
[]
[]
[]
[]
[]
[]
[]
[]
[]
[]
[]
[]
[]
[]
[]
[]
[]
[]
[]
[]
[]
[]
[]
[]
[]
[]
[]
[]
[]
[]
[]
[]
[]
[]
[]
[]
[]
[]
[]
[]
[]
[]
[]
[]
[]
[]
[]
[]
[]
[]
[]
[]
[]
[]
[]
[]
[]
[]
[]
[]
[]
[]
[]
[]
[]
[]
[]
[]
[]
[]
[]
[]
[]
[]
[]
[]
[]
[]
[]
[]
[]
[]
[]
[]
[]
[]
[]
[]
[]
[]
[]
[]
[]
[]
[]
[]
[]
[]
[]
[]
[]
[]
[]
[]
[]
[]
[]
[]
[]
[]
[]
[]
[]
[]
[]
[]
[]
[]
[]
[]
[]
[]
[]
[]
[]
[]
[]
[]
[]
[]
[]
[]
[]
[]
[]
[]
[]
[]
[]
[]
[]
[]
[]
[]
[]
[]
[]
[]
[]
[]
[]
[]
[]
[]
[]
[]
[]
[]
[]
[]
[]
[]
[]
[]
[]
[]
[]
[]
[]
[]
[]
[]
[]
[]
[]
[]
[]
[]
[]
[]
[]
[]
[]
[]
[]
[]
[]
[]
[]
[]
[]
[]
[]
[]
[]
[]
[]
[]
[]
[]
[]
[]
[]
[]
[]
[]
[]
[]
[]
[]
[]
[]
[]
[]
[]
[]
[]
[]
[]
[]
[]
[]
[]
[]
[]
[]
[]
[]
[]
[]
[]
[]
[]
[]
[]
[]
[]
[]
[]
[]
[]
[]
[]
[]
[]
[]
[]
[]
[]
[]
[]
[]
[]
[]
[]
[]
[]
[]
[]
[]
[]
[]
[]
[]
[]
[]
[]
[]
[]
[]
[]
[]
[]
[]
[]
[]
[]
[]
[]
[]
[]
[]
[]
[]
[]
[]
[]
[]
[]
[]
[]
[]
[]
[]
[]
[]
[]
[]
[]
[]
[]
[]
[]
[]
[]
[]
[]
[]
[]
[]
[]
[]
[]
[]
[]
[]
[]
[]
[]
[]
[]
[]
[]
[]
[]
[]
[]
[]
[]
[]
[]
[]
[]
[]
[]
[]
[]
[]
[]
[]
[]
[]
[]
[]
[]
[]
[]
[]
[]
[]
[]
[]
[]
[]
[]
[]
[]
[]
[]
[]
[]
[]
[]
[]
[]
[]
[]
[]
[]
[]
[]
[]
[]
[]
[]
[]
[]
[]
[]
[]
[]
[]
[]
[]
[]
[]
[]
[]
[]
[]
[]
[]
[]
[]
[]
[]
[]
[]
[]
[]
[]
[]
[]
[]
[]
[]
[]
[]
[]
[]
[]
[]
[]
[]
[]
[]
[]
[]
[]
[]
[]
[]
[]
[]
[]
[]
[]
[]
[]
[]
[]
[]
[]
[]
[]
[]
[]
[]
[]
[]
[]
[]
[]
[]
[]
[]
[]
[]
[]
[]
[]
[]
[]
[]
[]
[]
[]
[]
[]
[]
[]
[]
[]
[]
[]
[]
[]
[]
[]
[]
[]
[]
[]
[]
[]
[]
[]
[]
[]
[]
[]
[]
[]
[]
[]
[]
[]
[]
[]
[]
[]
[]
[]
[]
[]
[]
[]
[]
[]
[]
[]
[]
[]
[]
[]
[]
[]
[]
[]
[]
[]
[]
[]
[]
[]
[]
[]
[]
[]
[]
[]
[]
[]
[]
[]
[]
[]
[]
[]
[]
[]
[]
[]
[]
[]
[]
[]
[]
[]
[]
[]
[]
[]
[]
[]
[]
[]
[]
[]
[]
[]
[]
[]
[]
[]
[]
[]
[]
[]
[]
[]
[]
[]
[]
[]
[]
[]
[]
[]
[]
[]
[]
[]
[]
[]
[]
[]
[]
[]
[]
[]
[]
[]
[]
[]
[]
[]
[]
[]
[]
[]
[]
[]
[]
[]
[]
[]
[]
[]
[]
[]
[]
[]
[]
[]
[]
[]
[]
[]
[]
[]
[]
[]
[]
[]
[]
[]
[]
[]
[]
[]
[]
[]
[]
[]
[]
[]
[]
[]
[]
[]
[]
[]
[]
[]
[]
[]
[]
[]
[]
[]
[]
[]
[]
[]
[]
[]
[]
[]
[]
[]
[]
[]
[]
[]
[]
[]
[]
[]
[]
[]
[]
[]
[]
[]
[]
[]
[]
[]
[]
[]
[]
[]
[]
[]
[]
[]
[]
[]
[]
[]
[]
[]
[]
[]
[]
[]
[]
[]
[]
[]
[]
[]
[]
[]
[]
[]
[]
[]
[]
[]
[]
[]
[]
[]
[]
[]
[]
[]
[]
[]
[]
[]
[]
[]
[]
[]
[]
[]
[]
[]
[]
[]
[]
[]
[]
[]
[]
[]
[]
[]
[]
[]
[]
[]
[]
[]
[]
[]
[]
[]
[]
[]
[]
[]
[]
[]
[]
[]
[]
[]
[]
[]
[]
[]
[]
[]
[]
[]
[]
[]
[]
[]
[]
[]
[]
[]
[]
[]
[]
[]
[]
[]
[]
[]
[]
[]
[]
[]
[]
[]
[]
[]
[]
[]
[]
[]
[]
[]
[]
[]
[]
[]
[]
[]
[]
[]
[]
[]
[]
[]
[]
[]
[]
[]
[]
[]
[]
[]
[]
[]
[]
[]
[]
[]
[]
[]
[]
[]
[]
[]
[]
[]
[]
[]
[]
[]
[]
[]
[]
[]
[]
[]
[]
[]
[]
[]
[]
[]
[]
[]
[]
[]
[]
[]
[]
[]
[]
[]
[]
[]
[]
[]
[]
[]
[]
[]
[]
[]
[]
[]
[]
[]
[]
[]
[]
[]
[]
[]
[]
[]
[]
[]
[]
[]
[]
[]
[]
[]
[]
[]
[]
[]
[]
[]
[]
[]
[]
[]
[]
[]
[]
[]
[]
[]
[]
[]
[]
[]
[]
[]
[]
[]
[]
[]
[]
[]
[]
[]
[]
[]
[]
[]
[]
[]
[]
[]
[]
[]
[]
[]
[]
[]
[]
[]
[]
[]
[]
[]
[]
[]
[]
[]
[]
[]
[]
[]
[]
[]
[]
[]
[]
[]
[]
[]
[]
[]
[]
[]
[]
[]
[]
[]
[]
[]
[]
[]
[]
[]
[]
[]
[]
[]
[]
[]
[]
[]
[]
[]
[]
[]
[]
[]
[]
[]
[]
[]
[]
[]
[]
[]
[]
[]
[]
[]
[]
[]
[]
[]
[]
[]
[]
[]
[]
[]
[]
[]
[]
[]
[]
[]
[]
[]
[]
[]
[]
[]
[]
[]
[]
[]
[]
[]
[]
[]
[]
[]
[]
[]
[]
[]
[]
[]
[]
[]
[]
[]
[]
[]
[]
[]
[]
[]
[]
[]
[]
[]
[]
[]
[]
[]
[]
[]
[]
[]
[]
[]
[]
[]
[]
[]
[]
[]
[]
[]
[]
[]
[]
[]
[]
[]
[]
[]
[]
[]
[]
[]
[]
[]
[]
[]
[]
[]
[]
[]
[]
[]
[]
[]
[]
[]
[]
[]
[]
[]
[]
[]
[]
[]
[]
[]
[]
[]
[]
[]
[]
[]
[]
[]
[]
[]
[]
[]
[]
[]
[]
[]
[]
[]
[]
[]
[]
[]
[]
[]
[]
[]
[]
[]
[]
[]
[]
[]
[]
[]
[]
[]
[]
[]
[]
[]
[]
[]
[]
[]
[]
[]
[]
[]
[]
[]
[]
[]
[]
[]
[]
[]
[]
[]
[]
[]
[]
[]
[]
[]
[]
[]
[]
[]
[]
[]
[]
[]
[]
[]
[]
[]
[]
[]
[]
[]
[]
[]
[]
[]
[]
[]
[]
[]
[]
[]
[]
[]
[]
[]
[]
[]
[]
[]
[]
[]
[]
[]
[]
[]
[]
[]
[]
[]
[]
[]
[]
[]
[]
[]
[]
[]
[]
[]
[]
[]
[]
[]
[]
[]
[]
[]
[]
[]
[]
[]
[]
[]
[]
[]
[]
[]
[]
[]
[]
[]
[]
[]
[]
[]
[]
[]
[]
[]
[]
[]
[]
[]
[]
[]
[]
[]
[]
[]
[]
[]
[]
[]
[]
[]
[]
[]
[]
[]
[]
[]
[]
[]
[]
[]
[]
[]
[]
[]
[]
[]
[]
[]
[]
[]
[]
[]
[]
[]
[]
[]
[]
[]
[]
[]
[]
[]
[]
[]
[]
[]
[]
[]
[]
[]
[]
[]
[]
[]
[]
[]
[]
[]
[]
[]
[]
[]
[]
[]
[]
[]
[]
[]
[]
[]
[]
[]
[]
[]
[]
[]
[]
[]
[]
[]
[]
[]
[]
[]
[]
[]
[]
[]
[]
[]
[]
[]
[]
[]
[]
[]
[]
[]
[]
[]
[]
[]
[]
[]
[]
[]
[]
[]
[]
[]
[]
[]
[]
[]
[]
[]
[]
[]
[]
[]
[]
[]
[]
[]
[]
[]
[]
[]
[]
[]
[]
[]
[]
[]
[]
[]
[]
[]
[]
[]
[]
[]
[]
[]
[]
[]
[]
[]
[]
[]
[]
[]
[]
[]
[]
[]
[]
[]
[]
[]
[]
[]
[]
[]
[]
[]
[]
[]
[]
[]
[]
[]
[]
[]
[]
[]
[]
[]
[]
[]
[]
[]
[]
[]
[]
[]
[]
[]
[]
[]
[]
[]
[]
[]
[]
[]
[]
[]
[]
[]
[]
[]
[]
[]
[]
[]
[]
[]
[]
[]
[]
[]
[]
[]
[]
[]
[]
[]
[]
[]
[]
[]
[]
[]
[]
[]
[]
[]
[]
[]
[]
[]
[]
[]
[]
[]
[]
[]
[]
[]
[]
[]
[]
[]
[]
[]
[]
[]
[]
[]
[]
[]
[]
[]
[]
[]
[]
[]
[]
[]
[]
[]
[]
[]
[]
[]
[]
[]
[]
[]
[]
[]
[]
[]
[]
[]
[]
[]
[]
[]
[]
[]
[]
[]
[]
[]
[]
[]
[]
[]
[]
[]
[]
[]
[]
[]
[]
[]
[]
[]
[]
[]
[]
[]
[]
[]
[]
[]
[]
[]
[]
[]
[]
[]
[]
[]
[]
[]
[]
[]
[]
[]
[]
[]
[]
[]
[]
[]
[]
[]
[]
[]
[]
[]
[]
[]
[]
[]
[]
[]
[]
[]
[]
[]
[]
[]
[]
[]
[]
[]
[]
[]
[]
[]
[]
[]
[]
[]
[]
[]
[]
[]
[]
[]
[]
[]
[]
[]
[]
[]
[]
[]
[]
[]
[]
[]
[]
[]
[]
[]
[]
[]
[]
[]
[]
[]
[]
[]
[]
[]
[]
[]
[]
[]
[]
[]
[]
[]
[]
[]
[]
[]
[]
[]
[]
[]
[]
[]
[]
[]
[]
[]
[]
[]
[]
[]
[]
[]
[]
[]
[]
[]
[]
[]
[]
[]
[]
[]
[]
[]
[]
[]
[]
[]
[]
[]
[]
[]
[]
[]
[]
[]
[]
[]
[]
[]
[]
[]
[]
[]
[]
[]
[]
[]
[]
[]
[]
[]
[]
[]
[]
[]
[]
[]
[]
[]
[]
[]
[]
[]
[]
[]
[]
[]
[]
[]
[]
[]
[]
[]
[]
[]
[]
[]
[]
[]
[]
[]
[]
[]
[]
[]
[]
[]
[]
[]
[]
[]
[]
[]
[]
[]
[]
[]
[]
[]
[]
[]
[]
[]
[]
[]
[]
[]
[]
[]
[]
[]
[]
[]
[]
[]
[]
[]
[]
[]
[]
[]
[]
[]
[]
[]
[]
[]
[]
[]
[]
[]
[]
[]
[]
[]
[]
[]
[]
[]
[]
[]
[]
[]
[]
[]
[]
[]
[]
[]
[]
[]
[]
[]
[]
[]
[]
[]
[]
[]
[]
[]
[]
[]
[]
[]
[]
[]
[]
[]
[]
[]
[]
[]
[]
[]
[]
[]
[]
[]
[]
[]
[]
[]
[]
[]
[]
[]
[]
[]
[]
[]
[]
[]
[]
[]
[]
[]
[]
[]
[]
[]
[]
[]
[]
[]
[]
[]
[]
[]
[]
[]
[]
[]
[]
[]
[]
[]
[]
[]
[]
[]
[]
[]
[]
[]
[]
[]
[]
[]
[]
[]
[]
[]
[]
[]
[]
[]
[]
[]
[]
[]
[]
[]
[]
[]
[]
[]
[]
[]
[]
[]
[]
[]
[]
[]
[]
[]
[]
[]
[]
[]
[]
[]
[]
[]
[]
[]
[]
[]
[]
[]
[]
[]
[]
[]
[]
[]
[]
[]
[]
[]
[]
[]
[]
[]
[]
[]
[]
[]
[]
[]
[]
[]
[]
[]
[]
[]
[]
[]
[]
[]
[]
[]
[]
[]
[]
[]
[]
[]
[]
[]
[]
[]
[]
[]
[]
[]
[]
[]
[]
[]
[]
[]
[]
[]
[]
[]
[]
[]
[]
[]
[]
[]
[]
[]
[]
[]
[]
[]
[]
[]
[]
[]
[]
[]
[]
[]
[]
[]
[]
[]
[]
[]
[]
[]
[]
[]
[]
[]
[]
[]
[]
[]
[]
[]
[]
[]
[]
[]
[]
[]
[]
[]
[]
[]
[]
[]
[]
[]
[]
[]
[]
[]
[]
[]
[]
[]
[]
[]
[]
[]
[]
[]
[]
[]
[]
[]
[]
[]
[]
[]
[]
[]
[]
[]
[]
[]
[]
[]
[]
[]
[]
[]
[]
[]
[]
[]
[]
[]
[]
[]
[]
[]
[]
[]
[]
[]
[]
[]
[]
[]
[]
[]
[]
[]
[]
[]
[]
[]
[]
[]
[]
[]
[]
[]
[]
[]
[]
[]
[]
[]
[]
[]
[]
[]
[]
[]
[]
[]
[]
[]
[]
[]
[]
[]
[]
[]
[]
[]
[]
[]
[]
[]
[]
[]
[]
[]
[]
[]
[]
[]
[]
[]
[]
[]
[]
[]
[]
[]
[]
[]
[]
[]
[]
[]
[]
[]
[]
[]
[]
[]
[]
[]
[]
[]
[]
[]
[]
[]
[]
[]
[]
[]
[]
[]
[]
[]
[]
[]
[]
[]
[]
[]
[]
[]
[]
[]
[]
[]
[]
[]
[]
[]
[]
[]
[]
[]
[]
[]
[]
[]
[]
[]
[]
[]
[]
[]
[]
[]
[]
[]
[]
[]
[]
[]
[]
[]
[]
[]
[]
[]
[]
[]
[]
[]
[]
[]
[]
[]
[]
[]
[]
[]
[]
[]
[]
[]
[]
[]
[]
[]
[]
[]
[]
[]
[]
[]
[]
[]
[]
[]
[]
[]
[]
[]
[]
[]
[]
[]
[]
[]
[]
[]
[]
[]
[]
[]
[]
[]
[]
[]
[]
[]
[]
[]
[]
[]
[]
[]
[]
[]
[]
[]
[]
[]
[]
[]
[]
[]
[]
[]
[]
[]
[]
[]
[]
[]
[]
[]
[]
[]
[]
[]
[]
[]
[]
[]
[]
[]
[]
[]
[]
[]
[]
[]
[]
[]
[]
[]
[]
[]
[]
[]
[]
[]
[]
[]
[]
[]
[]
[]
[]
[]
[]
[]
[]
[]
[]
[]
[]
[]
[]
[]
[]
[]
[]
[]
[]
[]
[]
[]
[]
[]
[]
[]
[]
[]
[]
[]
[]
[]
[]
[]
[]
[]
[]
[]
[]
[]
[]
[]
[]
[]
[]
[]
[]
[]
[]
[]
[]
[]
[]
[]
[]
[]
[]
[]
[]
[]
[]
[]
[]
[]
[]
[]
[]
[]
[]
[]
[]
[]
[]
[]
[]
[]
[]
[]
[]
[]
[]
[]
[]
[]
[]
[]
[]
[]
[]
[]
[]
[]
[]
[]
[]
[]
[]
[]
[]
[]
[]
[]
[]
[]
[]
[]
[]
[]
[]
[]
[]
[]
[]
[]
[]
[]
[]
[]
[]
[]
[]
[]
[]
[]
[]
[]
[]
[]
[]
[]
[]
[]
[]
[]
[]
[]
[]
[]
[]
[]
[]
[]
[]
[]
[]
[]
[]
[]
[]
[]
[]
[]
[]
[]
[]
[]
[]
[]
[]
[]
[]
[]
[]
[]
[]
[]
[]
[]
[]
[]
[]
[]
[]
[]
[]
[]
[]
[]
[]
[]
[]
[]
[]
[]
[]
[]
[]
[]
[]
[]
[]
[]
[]
[]
[]
[]
[]
[]
[]
[]
[]
[]
[]
[]
[]
[]
[]
[]
[]
[]
[]
[]
[]
[]
[]
[]
[]
[]
[]
[]
[]
[]
[]
[]
[]
[]
[]
[]
[]
[]
[]
[]
[]
[]
[]
[]
[]
[]
[]
[]
[]
[]
[]
[]
[]
[]
[]
[]
[]
[]
[]
[]
[]
[]
[]
[]
[]
[]
[]
[]
[]
[]
[]
[]
[]
[]
[]
[]
[]
[]
[]
[]
[]
[]
[]
[]
[]
[]
[]
[]
[]
[]
[]
[]
[]
[]
[]
[]
[]
[]
[]
[]
[]
[]
[]
[]
[]
[]
[]
[]
[]
[]
[]
[]
[]
[]
[]
[]
[]
[]
[]
[]
[]
[]
[]
[]
[]
[]
[]
[]
[]
[]
[]
[]
[]
[]
[]
[]
[]
[]
[]
[]
[]
[]
[]
[]
[]
[]
[]
[]
[]
[]
[]
[]
[]
[]
[]
[]
[]
[]
[]
[]
[]
[]
[]
[]
[]
[]
[]
[]
[]
[]
[]
[]
[]
[]
[]
[]
[]
[]
[]
[]
[]
[]
[]
[]
[]
[]
[]
[]
[]
[]
[]
[]
[]
[]
[]
[]
[]
[]
[]
[]
[]
[]
[]
[]
[]
[]
[]
[]
[]
[]
[]
[]
[]
[]
[]
[]
[]
[]
[]
[]
[]
[]
[]
[]
[]
[]
[]
[]
[]
[]
[]
[]
[]
[]
[]
[]
[]
[]
[]
[]
[]
[]
[]
[]
[]
[]
[]
[]
[]
[]
[]
[]
[]
[]
[]
[]
[]
[]
[]
[]
[]
[]
[]
[]
[]
[]
[]
[]
[]
[]
[]
[]
[]
[]
[]
[]
[]
[]
[]
[]
[]
[]
[]
[]
[]
[]
[]
[]
[]
[]
[]
[]
[]
[]
[]
[]
[]
[]
[]
[]
[]
[]
[]
[]
[]
[]
[]
[]
[]
[]
[]
[]
[]
[]
[]
[]
[]
[]
[]
[]
[]
[]
[]
[]
[]
[]
[]
[]
[]
[]
[]
[]
[]
[]
[]
[]
[]
[]
[]
[]
[]
[]
[]
[]
[]
[]
[]
[]
[]
[]
[]
[]
[]
[]
[]
[]
[]
[]
[]
[]
[]
[]
[]
[]
[]
[]
[]
[]
[]
[]
[]
[]
[]
[]
[]
[]
[]
[]
[]
[]
[]
[]
[]
[]
[]
[]
[]
[]
[]
[]
[]
[]
[]
[]
[]
[]
[]
[]
[]
[]
[]
[]
[]
[]
[]
[]
[]
[]
[]
[]
[]
[]
[]
[]
[]
[]
[]
[]
[]
[]
[]
[]
[]
[]
[]
[]
[]
[]
[]
[]
[]
[]
[]
[]
[]
[]
[]
[]
[]
[]
[]
[]
[]
[]
[]
[]
[]
[]
[]
[]
[]
[]
[]
[]
[]
[]
[]
[]
[]
[]
[]
[]
[]
[]
[]
[]
[]
[]
[]
[]
[]
[]
[]
[]
[]
[]
[]
[]
[]
[]
[]
[]
[]
[]
[]
[]
[]
[]
[]
[]
[]
[]
[]
[]
[]
[]
[]
[]
[]
[]
[]
[]
[]
[]
[]
[]
[]
[]
[]
[]
[]
[]
[]
[]
[]
[]
[]
[]
[]
[]
[]
[]
[]
[]
[]
[]
[]
[]
[]
[]
[]
[]
[]
[]
[]
[]
[]
[]
[]
[]
[]
[]
[]
[]
[]
[]
[]
[]
[]
[]
[]
[]
[]
[]
[]
[]
[]
[]
[]
[]
[]
[]
[]
[]
[]
[]
[]
[]
[]
[]
[]
[]
[]
[]
[]
[]
[]
[]
[]
[]
[]
[]
[]
[]
[]
[]
[]
[]
[]
[]
[]
[]
[]
[]
[]
[]
[]
[]
[]
[]
[]
[]
[]
[]
[]
[]
[]
[]
[]
[]
[]
[]
[]
[]
[]
[]
[]
[]
[]
[]
[]
[]
[]
[]
[]
[]
[]
[]
[]
[]
[]
[]
[]
[]
[]
[]
[]
[]
[]
[]
[]
[]
[]
[]
[]
[]
[]
[]
[]
[]
[]
[]
[]
[]
[]
[]
[]
[]
[]
[]
[]
[]
[]
[]
[]
[]
[]
[]
[]
[]
[]
[]
[]
[]
[]
[]
[]
[]
[]
[]
[]
[]
[]
[]
[]
[]
[]
[]
[]
[]
[]
[]
[]
[]
[]
[]
[]
[]
[]
[]
[]
[]
[]
[]
[]
[]
[]
[]
[]
[]
[]
[]
[]
[]
[]
[]
[]
[]
[]
[]
[]
[]
[]
[]
[]
[]
[]
[]
[]
[]
[]
[]
[]
[]
[]
[]
[]
[]
[]
[]
[]
[]
[]
[]
[]
[]
[]
[]
[]
[]
[]
[]
[]
[]
[]
[]
[]
[]
[]
[]
[]
[]
[]
[]
[]
[]
[]
[]
[]
[]
[]
[]
[]
[]
[]
[]
[]
[]
[]
[]
[]
[]
[]
[]
[]
[]
[]
[]
[]
[]
[]
[]
[]
[]
[]
[]
[]
[]
[]
[]
[]
[]
[]
[]
[]
[]
[]
[]
[]
[]
[]
[]
[]
[]
[]
[]
[]
[]
[]
[]
[]
[]
[]
[]
[]
[]
[]
[]
[]
[]
[]
[]
[]
[]
[]
[]
[]
[]
[]
[]
[]
[]
[]
[]
[]
[]
[]
[]
[]
[]
[]
[]
[]
[]
[]
[]
[]
[]
[]
[]
[]
[]
[]
[]
[]
[]
[]
[]
[]
[]
[]
[]
[]
[]
[]
[]
[]
[]
[]
[]
[]
[]
[]
[]
[]
[]
[]
[]
[]
[]
[]
[]
[]
[]
[]
[]
[]
[]
[]
[]
[]
[]
[]
[]
[]
[]
[]
[]
[]
[]
[]
[]
[]
[]
[]
[]
[]
[]
[]
[]
[]
[]
[]
[]
[]
[]
[]
[]
[]
[]
[]
[]
[]
[]
[]
[]
[]
[]
[]
[]
[]
[]
[]
[]
[]
[]
[]
[]
[]
[]
[]
[]
[]
[]
[]
[]
[]
[]
[]
[]
[]
[]
[]
[]
[]
[]
[]
[]
[]
[]
[]
[]
[]
[]
[]
[]
[]
[]
[]
[]
[]
[]
[]
[]
[]
[]
[]
[]
[]
[]
[]
[]
[]
[]
[]
[]
[]
[]
[]
[]
[]
[]
[]
[]
[]
[]
[]
[]
[]
[]
[]
[]
[]
[]
[]
[]
[]
[]
[]
[]
[]
[]
[]
[]
[]
[]
[]
[]
[]
[]
[]
[]
[]
[]
[]
[]
[]
[]
[]
[]
[]
[]
[]
[]
[]
[]
[]
[]
[]
[]
[]
[]
[]
[]
[]
[]
[]
[]
[]
[]
[]
[]
[]
[]
[]
[]
[]
[]
[]
[]
[]
[]
[]
[]
[]
[]
[]
[]
[]
[]
[]
[]
[]
[]
[]
[]
[]
[]
[]
[]
[]
[]
[]
[]
[]
[]
[]
[]
[]
[]
[]
[]
[]
[]
[]
[]
[]
[]
[]
[]
[]
[]
[]
[]
[]
[]
[]
[]
[]
[]
[]
[]
[]
[]
[]
[]
[]
[]
[]
[]
[]
[]
[]
[]
[]
[]
[]
[]
[]
[]
[]
[]
[]
[]
[]
[]
[]
[]
[]
[]
[]
[]
[]
[]
[]
[]
[]
[]
[]
[]
[]
[]
[]
[]
[]
[]
[]
[]
[]
[]
[]
[]
[]
[]
[]
[]
[]
[]
[]
[]
[]
[]
[]
[]
[]
[]
[]
[]
[]
[]
[]
[]
[]
[]
[]
[]
[]
[]
[]
[]
[]
[]
[]
[]
[]
[]
[]
[]
[]
[]
[]
[]
[]
[]
[]
[]
[]
[]
[]
[]
[]
[]
[]
[]
[]
[]
[]
[]
[]
[]
[]
[]
[]
[]
[]
[]
[]
[]
[]
[]
[]
[]
[]
[]
[]
[]
[]
[]
[]
[]
[]
[]
[]
[]
[]
[]
[]
[]
[]
[]
[]
[]
[]
[]
[]
[]
[]
[]
[]
[]
[]
[]
[]
[]
[]
[]
[]
[]
[]
[]
[]
[]
[]
[]
[]
[]
[]
[]
[]
[]
[]
[]
[]
[]
[]
[]
[]
[]
[]
[]
[]
[]
[]
[]
[]
[]
[]
[]
[]
[]
[]
[]
[]
[]
[]
[]
[]
[]
[]
[]
[]
[]
[]
[]
[]
[]
[]
[]
[]
[]
[]
[]
[]
[]
[]
[]
[]
[]
[]
[]
[]
[]
[]
[]
[]
[]
[]
[]
[]
[]
[]
[]
[]
[]
[]
[]
[]
[]
[]
[]
[]
[]
[]
[]
[]
[]
[]
[]
[]
[]
[]
[]
[]
[]
[]
[]
[]
[]
[]
[]
[]
[]
[]
[]
[]
[]
[]
[]
[]
[]
[]
[]
[]
[]
[]
[]
[]
[]
[]
[]
[]
[]
[]
[]
[]
[]
[]
[]
[]
[]
[]
[]
[]
[]
[]
[]
[]
[]
[]
[]
[]
[]
[]
[]
[]
[]
[]
[]
[]
[]
[]
[]
[]
[]
[]
[]
[]
[]
[]
[]
[]
[]
[]
[]
[]
[]
[]
[]
[]
[]
[]
[]
[]
[]
[]
[]
[]
[]
[]
[]
[]
[]
[]
[]
[]
[]
[]
[]
[]
[]
[]
[]
[]
[]
[]
[]
[]
[]
[]
[]
[]
[]
[]
[]
[]
[]
[]
[]
[]
[]
[]
[]
[]
[]
[]
[]
[]
[]
[]
[]
[]
[]
[]
[]
[]
[]
[]
[]
[]
[]
[]
[]
[]
[]
[]
[]
[]
[]
[]
[]
[]
[]
[]
[]
[]
[]
[]
[]
[]
[]
[]
[]
[]
[]
[]
[]
[]
[]
[]
[]
[]
[]
[]
[]
[]
[]
[]
[]
[]
[]
[]
[]
[]
[]
[]
[]
[]
[]
[]
[]
[]
[]
[]
[]
[]
[]
[]
[]
[]
[]
[]
[]
[]
[]
[]
[]
[]
[]
[]
[]
[]
[]
[]
[]
[]
[]
[]
[]
[]
[]
[]
[]
[]
[]
[]
[]
[]
[]
[]
[]
[]
[]
[]
[]
[]
[]
[]
[]
[]
[]
[]
[]
[]
[]
[]
[]
[]
[]
[]
[]
[]
[]
[]
[]
[]
[]
[]
[]
[]
[]
[]
[]
[]
[]
[]
[]
[]
[]
[]
[]
[]
[]
[]
[]
[]
[]
[]
[]
[]
[]
[]
[]
[]
[]
[]
[]
[]
[]
[]
[]
[]
[]
[]
[]
[]
[]
[]
[]
[]
[]
[]
[]
[]
[]
[]
[]
[]
[]
[]
[]
[]
[]
[]
[]
[]
[]
[]
[]
[]
[]
[]
[]
[]
[]
[]
[]
[]
[]
[]
[]
[]
[]
[]
[]
[]
[]
[]
[]
[]
[]
[]
[]
[]
[]
[]
[]
[]
[]
[]
[]
[]
[]
[]
[]
[]
[]
[]
[]
[]
[]
[]
[]
[]
[]
[]
[]
[]
[]
[]
[]
[]
[]
[]
[]
[]
[]
[]
[]
[]
[]
[]
[]
[]
[]
[]
[]
[]
[]
[]
[]
[]
[]
[]
[]
[]
[]
[]
[]
[]
[]
[]
[]
[]
[]
[]
[]
[]
[]
[]
[]
[]
[]
[]
[]
[]
[]
[]
[]
[]
[]
[]
[]
[]
[]
[]
[]
[]
[]
[]
[]
[]
[]
[]
[]
[]
[]
[]
[]
[]
[]
[]
[]
[]
[]
[]
[]
[]
[]
[]
[]
[]
[]
[]
[]
[]
[]
[]
[]
[]
[]
[]
[]
[]
[]
[]
[]
[]
[]
[]
[]
[]
[]
[]
[]
[]
[]
[]
[]
[]
[]
[]
[]
[]
[]
[]
[]
[]
[]
[]
[]
[]
[]
[]
[]
[]
[]
[]
[]
[]
[]
[]
[]
[]
[]
[]
[]
[]
[]
[]
[]
[]
[]
[]
[]
[]
[]
[]
[]
[]
[]
[]
[]
[]
[]
[]
[]
[]
[]
[]
[]
[]
[]
[]
[]
[]
[]
[]
[]
[]
[]
[]
[]
[]
[]
[]
[]
[]
[]
[]
[]
[]
[]
[]
[]
[]
[]
[]
[]
[]
[]
[]
[]
[]
[]
[]
[]
[]
[]
[]
[]
[]
[]
[]
[]
[]
[]
[]
[]
[]
[]
[]
[]
[]
[]
[]
[]
[]
[]
[]
[]
[]
[]
[]
[]
[]
[]
[]
[]
[]
[]
[]
[]
[]
[]
[]
[]
[]
[]
[]
[]
[]
[]
[]
[]
[]
[]
[]
[]
[]
[]
[]
[]
[]
[]
[]
[]
[]
[]
[]
[]
[]
[]
[]
[]
[]
[]
[]
[]
[]
[]
[]
[]
[]
[]
[]
[]
[]
[]
[]
[]
[]
[]
[]
[]
[]
[]
[]
[]
[]
[]
[]
[]
[]
[]
[]
[]
[]
[]
[]
[]
[]
[]
[]
[]
[]
[]
[]
[]
[]
[]
[]
[]
[]
[]
[]
[]
[]
[]
[]
[]
[]
[]
[]
[]
[]
[]
[]
[]
[]
[]
[]
[]
[]
[]
[]
[]
[]
[]
[]
[]
[]
[]
[]
[]
[]
[]
[]
[]
[]
[]
[]
[]
[]
[]
[]
[]
[]
[]
[]
[]
[]
[]
[]
[]
[]
[]
[]
[]
[]
[]
[]
[]
[]
[]
[]
[]
[]
[]
[]
[]
[]
[]
[]
[]
[]
[]
[]
[]
[]
[]
[]
[]
[]
[]
[]
[]
[]
[]
[]
[]
[]
[]
[]
[]
[]
[]
[]
[]
[]
[]
[]
[]
[]
[]
[]
[]
[]
[]
[]
[]
[]
[]
[]
[]
[]
[]
[]
[]
[]
[]
[]
[]
[]
[]
[]
[]
[]
[]
[]
[]
[]
[]
[]
[]
[]
[]
[]
[]
[]
[]
[]
[]
[]
[]
[]
[]
[]
[]
[]
[]
[]
[]
[]
[]
[]
[]
[]
[]
[]
[]
[]
[]
[]
[]
[]
[]
[]
[]
[]
[]
[]
[]
[]
[]
[]
[]
[]
[]
[]
[]
[]
[]
[]
[]
[]
[]
[]
[]
[]
[]
[]
[]
[]
[]
[]
[]
[]
[]
[]
[]
[]
[]
[]
[]
[]
[]
[]
[]
[]
[]
[]
[]
[]
[]
[]
[]
[]
[]
[]
[]
[]
[]
[]
[]
[]
[]
[]
[]
[]
[]
[]
[]
[]
[]
[]
[]
[]
[]
[]
[]
[]
[]
[]
[]
[]
[]
[]
[]
[]
[]
[]
[]
[]
[]
[]
[]
[]
[]
[]
[]
[]
[]
[]
[]
[]
[]
[]
[]
[]
[]
[]
[]
[]
[]
[]
[]
[]
[]
[]
[]
[]
[]
[]
[]
[]
[]
[]
[]
[]
[]
[]
[]
[]
[]
[]
[]
[]
[]
[]
[]
[]
[]
[]
[]
[]
[]
[]
[]
[]
[]
[]
[]
[]
[]
[]
[]
[]
[]
[]
[]
[]
[]
[]
[]
[]
[]
[]
[]
[]
[]
[]
[]
[]
[]
[]
[]
[]
[]
[]
[]
[]
[]
[]
[]
[]
[]
[]
[]
[]
[]
[]
[]
[]
[]
[]
[]
[]
[]
[]
[]
[]
[]
[]
[]
[]
[]
[]
[]
[]
[]
[]
[]
[]
[]
[]
[]
[]
[]
[]
[]
[]
[]
[]
[]
[]
[]
[]
[]
[]
[]
[]
[]
[]
[]
[]
[]
[]
[]
[]
[]
[]
[]
[]
[]
[]
[]
[]
[]
[]
[]
[]
[]
[]
[]
[]
[]
[]
[]
[]
[]
[]
[]
[]
[]
[]
[]
[]
[]
[]
[]
[]
[]
[]
[]
[]
[]
[]
[]
[]
[]
[]
[]
[]
[]
[]
[]
[]
[]
[]
[]
[]
[]
[]
[]
[]
[]
[]
[]
[]
[]
[]
[]
[]
[]
[]
[]
[]
[]
[]
[]
[]
[]
[]
[]
[]
[]
[]
[]
[]
[]
[]
[]
[]
[]
[]
[]
[]
[]
[]
[]
[]
[]
[]
[]
[]
[]
[]
[]
[]
[]
[]
[]
[]
[]
[]
[]
[]
[]
[]
[]
[]
[]
[]
[]
[]
[]
[]
[]
[]
[]
[]
[]
[]
[]
[]
[]
[]
[]
[]
[]
[]
[]
[]
[]
[]
[]
[]
[]
[]
[]
[]
[]
[]
[]
[]
[]
[]
[]
[]
[]
[]
[]
[]
[]
[]
[]
[]
[]
[]
[]
[]
[]
[]
[]
[]
[]
[]
[]
[]
[]
[]
[]
[]
[]
[]
[]
[]
[]
[]
[]
[]
[]
[]
[]
[]
[]
[]
[]
[]
[]
[]
[]
[]
[]
[]
[]
[]
[]
[]
[]
[]
[]
[]
[]
[]
[]
[]
[]
[]
[]
[]
[]
[]
[]
[]
[]
[]
[]
[]
[]
[]
[]
[]
[]
[]
[]
[]
[]
[]
[]
[]
[]
[]
[]
[]
[]
[]
[]
[]
[]
[]
[]
[]
[]
[]
[]
[]
[]
[]
[]
[]
[]
[]
[]
[]
[]
[]
[]
[]
[]
[]
[]
[]
[]
[]
[]
[]
[]
[]
[]
[]
[]
[]
[]
[]
[]
[]
[]
[]
[]
[]
[]
[]
[]
[]
[]
[]
[]
[]
[]
[]
[]
[]
[]
[]
[]
[]
[]
[]
[]
[]
[]
[]
[]
[]
[]
[]
[]
[]
[]
[]
[]
[]
[]
[]
[]
[]
[]
[]
[]
[]
[]
[]
[]
[]
[]
[]
[]
[]
[]
[]
[]
[]
[]
[]
[]
[]
[]
[]
[]
[]
[]
[]
[]
[]
[]
[]
[]
[]
[]
[]
[]
[]
[]
[]
[]
[]
[]
[]
[]
[]
[]
[]
[]
[]
[]
[]
[]
[]
[]
[]
[]
[]
[]
[]
[]
[]
[]
[]
[]
[]
[]
[]
[]
[]
[]
[]
[]
[]
[]
[]
[]
[]
[]
[]
[]
[]
[]
[]
[]
[]
[]
[]
[]
[]
[]
[]
[]
[]
[]
[]
[]
[]
[]
[]
[]
[]
[]
[]
[]
[]
[]
[]
[]
[]
[]
[]
[]
[]
[]
[]
[]
[]
[]
[]
[]
[]
[]
[]
[]
[]
[]
[]
[]
[]
[]
[]
[]
[]
[]
[]
[]
[]
[]
[]
[]
[]
[]
[]
[]
[]
[]
[]
[]
[]
[]
[]
[]
[]
[]
[]
[]
[]
[]
[]
[]
[]
[]
[]
[]
[]
[]
[]
[]
[]
[]
[]
[]
[]
[]
[]
[]
[]
[]
[]
[]
[]
[]
[]
[]
[]
[]
[]
[]
[]
[]
[]
[]
[]
[]
[]
[]
[]
[]
[]
[]
[]
[]
[]
[]
[]
[]
[]
[]
[]
[]
[]
[]
[]
[]
[]
[]
[]
[]
[]
[]
[]
[]
[]
[]
[]
[]
[]
[]
[]
[]
[]
[]
[]
[]
[]
[]
[]
[]
[]
[]
[]
[]
[]
[]
[]
[]
[]
[]
[]
[]
[]
[]
[]
[]
[]
[]
[]
[]
[]
[]
[]
[]
[]
[]
[]
[]
[]
[]
[]
[]
[]
[]
[]
[]
[]
[]
[]
[]
[]
[]
[]
[]
[]
[]
[]
[]
[]
[]
[]
[]
[]
[]
[]
[]
[]
[]
[]
[]
[]
[]
[]
[]
[]
[]
[]
[]
[]
[]
[]
[]
[]
[]
[]
[]
[]
[]
[]
[]
[]
[]
[]
[]
[]
[]
[]
[]
[]
[]
[]
[]
[]
[]
[]
[]
[]
[]
[]
[]
[]
[]
[]
[]
[]
[]
[]
[]
[]
[]
[]
[]
[]
[]
[]
[]
[]
[]
[]
[]
[]
[]
[]
[]
[]
[]
[]
[]
[]
[]
[]
[]
[]
[]
[]
[]
[]
[]
[]
[]
[]
[]
[]
[]
[]
[]
[]
[]
[]
[]
[]
[]
[]
[]
[]
[]
[]
[]
[]
[]
[]
[]
[]
[]
[]
[]
[]
[]
[]
[]
[]
[]
[]
[]
[]
[]
[]
[]
[]
[]
[]
[]
[]
[]
[]
[]
[]
[]
[]
[]
[]
[]
[]
[]
[]
[]
[]
[]
[]
[]
[]
[]
[]
[]
[]
[]
[]
[]
[]
[]
[]
[]
[]
[]
[]
[]
[]
[]
[]
[]
[]
[]
[]
[]
[]
[]
[]
[]
[]
[]
[]
[]
[]
[]
[]
[]
[]
[]
[]
[]
[]
[]
[]
[]
[]
[]
[]
[]
[]
[]
[]
[]
[]
[]
[]
[]
[]
[]
[]
[]
[]
[]
[]
[]
[]
[]
[]
[]
[]
[]
[]
[]
[]
[]
[]
[]
[]
[]
[]
[]
[]
[]
[]
[]
[]
[]
[]
[]
[]
[]
[]
[]
[]
[]
[]
[]
[]
[]
[]
[]
[]
[]
[]
[]
[]
[]
[]
[]
[]
[]
[]
[]
[]
[]
[]
[]
[]
[]
[]
[]
[]
[]
[]
[]
[]
[]
[]
[]
[]
[]
[]
[]
[]
[]
[]
[]
[]
[]
[]
[]
[]
[]
[]
[]
[]
[]
[]
[]
[]
[]
[]
[]
[]
[]
[]
[]
[]
[]
[]
[]
[]
[]
[]
[]
[]
[]
[]
[]
[]
[]
[]
[]
[]
[]
[]
[]
[]
[]
[]
[]
[]
[]
[]
[]
[]
[]
[]
[]
[]
[]
[]
[]
[]
[]
[]
[]
[]
[]
[]
[]
[]
[]
[]
[]
[]
[]
[]
[]
[]
[]
[]
[]
[]
[]
[]
[]
[]
[]
[]
[]
[]
[]
[]
[]
[]
[]
[]
[]
[]
[]
[]
[]
[]
[]
[]
[]
[]
[]
[]
[]
[]
[]
[]
[]
[]
[]
[]
[]
[]
[]
[]
[]
[]
[]
[]
[]
[]
[]
[]
[]
[]
[]
[]
[]
[]
[]
[]
[]
[]
[]
[]
[]
[]
[]
[]
[]
[]
[]
[]
[]
[]
[]
[]
[]
[]
[]
[]
[]
[]
[]
[]
[]
[]
[]
[]
[]
[]
[]
[]
[]
[]
[]
[]
[]
[]
[]
[]
[]
[]
[]
[]
[]
[]
[]
[]
[]
[]
[]
[]
[]
[]
[]
[]
[]
[]
[]
[]
[]
[]
[]
[]
[]
[]
[]
[]
[]
[]
[]
[]
[]
[]
[]
[]
[]
[]
[]
[]
[]
[]
[]
[]
[]
[]
[]
[]
[]
[]
[]
[]
[]
[]
[]
[]
[]
[]
[]
[]
[]
[]
[]
[]
[]
[]
[]
[]
[]
[]
[]
[]
[]
[]
[]
[]
[]
[]
[]
[]
[]
[]
[]
[]
[]
[]
[]
[]
[]
[]
[]
[]
[]
[]
[]
[]
[]
[]
[]
[]
[]
[]
[]
[]
[]
[]
[]
[]
[]
[]
[]
[]
[]
[]
[]
[]
[]
[]
[]
[]
[]
[]
[]
[]
[]
[]
[]
[]
[]
[]
[]
[]
[]
[]
[]
[]
[]
[]
[]
[]
[]
[]
[]
[]
[]
[]
[]
[]
[]
[]
[]
[]
[]
[]
[]
[]
[]
[]
[]
[]
[]
[]
[]
[]
[]
[]
[]
[]
[]
[]
[]
[]
[]
[]
[]
[]
[]
[]
[]
[]
[]
[]
[]
[]
[]
[]
[]
[]
[]
[]
[]
[]
[]
[]
[]
[]
[]
[]
[]
[]
[]
[]
[]
[]
[]
[]
[]
[]
[]
[]
[]
[]
[]
[]
[]
[]
[]
[]
[]
[]
[]
[]
[]
[]
[]
[]
[]
[]
[]
[]
[]
[]
[]
[]
[]
[]
[]
[]
[]
[]
[]
[]
[]
[]
[]
[]
[]
[]
[]
[]
[]
[]
[]
[]
[]
[]
[]
[]
[]
[]
[]
[]
[]
[]
[]
[]
[]
[]
[]
[]
[]
[]
[]
[]
[]
[]
[]
[]
[]
[]
[]
[]
[]
[]
[]
[]
[]
[]
[]
[]
[]
[]
[]
[]
[]
[]
[]
[]
[]
[]
[]
[]
[]
[]
[]
[]
[]
[]
[]
[]
[]
[]
[]
[]
[]
[]
[]
[]
[]
[]
[]
[]
[]
[]
[]
[]
[]
[]
[]
[]
[]
[]
[]
[]
[]
[]
[]
[]
[]
[]
[]
[]
[]
[]
[]
[]
[]
[]
[]
[]
[]
[]
[]
[]
[]
[]
[]
[]
[]
[]
[]
[]
[]
[]
[]
[]
[]
[]
[]
[]
[]
[]
[]
[]
[]
[]
[]
[]
[]
[]
[]
[]
[]
[]
[]
[]
[]
[]
[]
[]
[]
[]
[]
[]
[]
[]
[]
[]
[]
[]
[]
[]
[]
[]
[]
[]
[]
[]
[]
[]
[]
[]
[]
[]
[]
[]
[]
[]
[]
[]
[]
[]
[]
[]
[]
[]
[]
[]
[]
[]
[]
[]
[]
[]
[]
[]
[]
[]
[]
[]
[]
[]
[]
[]
[]
[]
[]
[]
[]
[]
[]
[]
[]
[]
[]
[]
[]
[]
[]
[]
[]
[]
[]
[]
[]
[]
[]
[]
[]
[]
[]
[]
[]
[]
[]
[]
[]
[]
[]
[]
[]
[]
[]
[]
[]
[]
[]
[]
[]
[]
[]
[]
[]
[]
[]
[]
[]
[]
[]
[]
[]
[]
[]
[]
[]
[]
[]
[]
[]
[]
[]
[]
[]
[]
[]
[]
[]
[]
[]
[]
[]
[]
[]
[]
[]
[]
[]
[]
[]
[]
[]
[]
[]
[]
[]
[]
[]
[]
[]
[]
[]
[]
[]
[]
[]
[]
[]
[]
[]
[]
[]
[]
[]
[]
[]
[]
[]
[]
[]
[]
[]
[]
[]
[]
[]
[]
[]
[]
[]
[]
[]
[]
[]
[]
[]
[]
[]
[]
[]
[]
[]
[]
[]
[]
[]
[]
[]
[]
[]
[]
[]
[]
[]
[]
[]
[]
[]
[]
[]
[]
[]
[]
[]
[]
[]
[]
[]
[]
[]
[]
[]
[]
[]
[]
[]
[]
[]
[]
[]
[]
[]
[]
[]
[]
[]
[]
[]
[]
[]
[]
[]
[]
[]
[]
[]
[]
[]
[]
[]
[]
[]
[]
[]
[]
[]
[]
[]
[]
[]
[]
[]
[]
[]
[]
[]
[]
[]
[]
[]
[]
[]
[]
[]
[]
[]
[]
[]
[]
[]
[]
[]
[]
[]
[]
[]
[]
[]
[]
[]
[]
[]
[]
[]
[]
[]
[]
[]
[]
[]
[]
[]
[]
[]
[]
[]
[]
[]
[]
[]
[]
[]
[]
[]
[]
[]
[]
[]
[]
[]
[]
[]
[]
[]
[]
[]
[]
[]
[]
[]
[]
[]
[]
[]
[]
[]
[]
[]
[]
[]
[]
[]
[]
[]
[]
[]
[]
[]
[]
[]
[]
[]
[]
[]
[]
[]
[]
[]
[]
[]
[]
[]
[]
[]
[]
[]
[]
[]
[]
[]
[]
[]
[]
[]
[]
[]
[]
[]
[]
[]
[]
[]
[]
[]
[]
[]
[]
[]
[]
[]
[]
[]
[]
[]
[]
[]
[]
[]
[]
[]
[]
[]
[]
[]
[]
[]
[]
[]
[]
[]
[]
[]
[]
[]
[]
[]
[]
[]
[]
[]
[]
[]
[]
[]
[]
[]
[]
[]
[]
[]
[]
[]
[]
[]
[]
[]
[]
[]
[]
[]
[]
[]
[]
[]
[]
[]
[]
[]
[]
[]
[]
[]
[]
[]
[]
[]
[]
[]
[]
[]
[]
[]
[]
[]
[]
[]
[]
[]
[]
[]
[]
[]
[]
[]
[]
[]
[]
[]
[]
[]
[]
[]
[]
[]
[]
[]
[]
[]
[]
[]
[]
[]
[]
[]
[]
[]
[]
[]
[]
[]
[]
[]
[]
[]
[]
[]
[]
[]
[]
[]
[]
[]
[]
[]
[]
[]
[]
[]
[]
[]
[]
[]
[]
[]
[]
[]
[]
[]
[]
[]
[]
[]
[]
[]
[]
[]
[]
[]
[]
[]
[]
[]
[]
[]
[]
[]
[]
[]
[]
[]
[]
[]
[]
[]
[]
[]
[]
[]
[]
[]
[]
[]
[]
[]
[]
[]
[]
[]
[]
[]
[]
[]
[]
[]
[]
[]
[]
[]
[]
[]
[]
[]
[]
[]
[]
[]
[]
[]
[]
[]
[]
[]
[]
[]
[]
[]
[]
[]
[]
[]
[]
[]
[]
[]
[]
[]
[]
[]
[]
[]
[]
[]
[]
[]
[]
[]
[]
[]
[]
[]
[]
[]
[]
[]
[]
[]
[]
[]
[]
[]
[]
[]
[]
[]
[]
[]
[]
[]
[]
[]
[]
[]
[]
[]
[]
[]
[]
[]
[]
[]
[]
[]
[]
[]
[]
[]
[]
[]
[]
[]
[]
[]
[]
[]
[]
[]
[]
[]
[]
[]
[]
[]
[]
[]
[]
[]
[]
[]
[]
[]
[]
[]
[]
[]
[]
[]
[]
[]
[]
[]
[]
[]
[]
[]
[]
[]
[]
[]
[]
[]
[]
[]
[]
[]
[]
[]
[]
[]
[]
[]
[]
[]
[]
[]
[]
[]
[]
[]
[]
[]
[]
[]
[]
[]
[]
[]
[]
[]
[]
[]
[]
[]
[]
[]
[]
[]
[]
[]
[]
[]
[]
[]
[]
[]
[]
[]
[]
[]
[]
[]
[]
[]
[]
[]
[]
[]
[]
[]
[]
[]
[]
[]
[]
[]
[]
[]
[]
[]
[]
[]
[]
[]
[]
[]
[]
[]
[]
[]
[]
[]
[]
[]
[]
[]
[]
[]
[]
[]
[]
[]
[]
[]
[]
[]
[]
[]
[]
[]
[]
[]
[]
[]
[]
[]
[]
[]
[]
[]
[]
[]
[]
[]
[]
[]
[]
[]
[]
[]
[]
[]
[]
[]
[]
[]
[]
[]
[]
[]
[]
[]
[]
[]
[]
[]
[]
[]
[]
[]
[]
[]
[]
[]
[]
[]
[]
[]
[]
[]
[]
[]
[]
[]
[]
[]
[]
[]
[]
[]
[]
[]
[]
[]
[]
[]
[]
[]
[]
[]
[]
[]
[]
[]
[]
[]
[]
[]
[]
[]
[]
[]
[]
[]
[]
[]
[]
[]
[]
[]
[]
[]
[]
[]
[]
[]
[]
[]
[]
[]
[]
[]
[]
[]
[]
[]
[]
[]
[]
[]
[]
[]
[]
[]
[]
[]
[]
[]
[]
[]
[]
[]
[]
[]
[]
[]
[]
[]
[]
[]
[]
[]
[]
[]
[]
[]
[]
[]
[]
[]
[]
[]
[]
[]
[]
[]
[]
[]
[]
[]
[]
[]
[]
[]
[]
[]
[]
[]
[]
[]
[]
[]
[]
[]
[]
[]
[]
[]
[]
[]
[]
[]
[]
[]
[]
[]
[]
[]
[]
[]
[]
[]
[]
[]
[]
[]
[]
[]
[]
[]
[]
[]
[]
[]
[]
[]
[]
[]
[]
[]
[]
[]
[]
[]
[]
[]
[]
[]
[]
[]
[]
[]
[]
[]
[]
[]
[]
[]
[]
[]
[]
[]
[]
[]
[]
[]
[]
[]
[]
[]
[]
[]
[]
[]
[]
[]
[]
[]
[]
[]
[]
[]
[]
[]
[]
[]
[]
[]
[]
[]
[]
[]
[]
[]
[]
[]
[]
[]
[]
[]
[]
[]
[]
[]
[]
[]
[]
[]
[]
[]
[]
[]
[]
[]
[]
[]
[]
[]
[]
[]
[]
[]
[]
[]
[]
[]
[]
[]
[]
[]
[]
[]
[]
[]
[]
[]
[]
[]
[]
[]
[]
[]
[]
[]
[]
[]
[]
[]
[]
[]
[]
[]
[]
[]
[]
[]
[]
[]
[]
[]
[]
[]
[]
[]
[]
[]
[]
[]
[]
[]
[]
[]
[]
[]
[]
[]
[]
[]
[]
[]
[]
[]
[]
[]
[]
[]
[]
[]
[]
[]
[]
[]
[]
[]
[]
[]
[]
[]
[]
[]
[]
[]
[]
[]
[]
[]
[]
[]
[]
[]
[]
[]
[]
[]
[]
[]
[]
[]
[]
[]
[]
[]
[]
[]
[]
[]
[]
[]
[]
[]
[]
[]
[]
[]
[]
[]
[]
[]
[]
[]
[]
[]
[]
[]
[]
[]
[]
[]
[]
[]
[]
[]
[]
[]
[]
[]
[]
[]
[]
[]
[]
[]
[]
[]
[]
[]
[]
[]
[]
[]
[]
[]
[]
[]
[]
[]
[]
[]
[]
[]
[]
[]
[]
[]
[]
[]
[]
[]
[]
[]
[]
[]
[]
[]
[]
[]
[]
[]
[]
[]
[]
[]
[]
[]
[]
[]
[]
[]
[]
[]
[]
[]
[]
[]
[]
[]
[]
[]
[]
[]
[]
[]
[]
[]
[]
[]
[]
[]
[]
[]
[]
[]
[]
[]
[]
[]
[]
[]
[]
[]
[]
[]
[]
[]
[]
[]
[]
[]
[]
[]
[]
[]
[]
[]
[]
[]
[]
[]
[]
[]
[]
[]
[]
[]
[]
[]
[]
[]
[]
[]
[]
[]
[]
[]
[]
[]
[]
[]
[]
[]
[]
[]
[]
[]
[]
[]
[]
[]
[]
[]
[]
[]
[]
[]
[]
[]
[]
[]
[]
[]
[]
[]
[]
[]
[]
[]
[]
[]
[]
[]
[]
[]
[]
[]
[]
[]
[]
[]
[]
[]
[]
[]
[]
[]
[]
[]
[]
[]
[]
[]
[]
[]
[]
[]
[]
[]
[]
[]
[]
[]
[]
[]
[]
[]
[]
[]
[]
[]
[]
[]
[]
[]
[]
[]
[]
[]
[]
[]
[]
[]
[]
[]
[]
[]
[]
[]
[]
[]
[]
[]
[]
[]
[]
[]
[]
[]
[]
[]
[]
[]
[]
[]
[]
[]
[]
[]
[]
[]
[]
[]
[]
[]
[]
[]
[]
[]
[]
[]
[]
[]
[]
[]
[]
[]
[]
[]
[]
[]
[]
[]
[]
[]
[]
[]
[]
[]
[]
[]
[]
[]
[]
[]
[]
[]
[]
[]
[]
[]
[]
[]
[]
[]
[]
[]
[]
[]
[]
[]
[]
[]
[]
[]
[]
[]
[]
[]
[]
[]
[]
[]
[]
[]
[]
[]
[]
[]
[]
[]
[]
[]
[]
[]
[]
[]
[]
[]
[]
[]
[]
[]
[]
[]
[]
[]
[]
[]
[]
[]
[]
[]
[]
[]
[]
[]
[]
[]
[]
[]
[]
[]
[]
[]
[]
[]
[]
[]
[]
[]
[]
[]
[]
[]
[]
[]
[]
[]
[]
[]
[]
[]
[]
[]
[]
[]
[]
[]
[]
[]
[]
[]
[]
[]
[]
[]
[]
[]
[]
[]
[]
[]
[]
[]
[]
[]
[]
[]
[]
[]
[]
[]
[]
[]
[]
[]
[]
[]
[]
[]
[]
[]
[]
[]
[]
[]
[]
[]
[]
[]
[]
[]
[]
[]
[]
[]
[]
[]
[]
[]
[]
[]
[]
[]
[]
[]
[]
[]
[]
[]
[]
[]
[]
[]
[]
[]
[]
[]
[]
[]
[]
[]
[]
[]
[]
[]
[]
[]
[]
[]
[]
[]
[]
[]
[]
[]
[]
[]
[]
[]
[]
[]
[]
[]
[]
[]
[]
[]
[]
[]
[]
[]
[]
[]
[]
[]
[]
[]
[]
[]
[]
[]
[]
[]
[]
[]
[]
[]
[]
[]
[]
[]
[]
[]
[]
[]
[]
[]
[]
[]
[]
[]
[]
[]
[]
[]
[]
[]
[]
[]
[]
[]
[]
[]
[]
[]
[]
[]
[]
[]
[]
[]
[]
[]
[]
[]
[]
[]
[]
[]
[]
[]
[]
[]
[]
[]
[]
[]
[]
[]
[]
[]
[]
[]
[]
[]
[]
[]
[]
[]
[]
[]
[]
[]
[]
[]
[]
[]
[]
[]
[]
[]
[]
[]
[]
[]
[]
[]
[]
[]
[]
[]
[]
[]
[]
[]
[]
[]
[]
[]
[]
[]
[]
[]
[]
[]
[]
[]
[]
[]
[]
[]
[]
[]
[]
[]
[]
[]
[]
[]
[]
[]
[]
[]
[]
[]
[]
[]
[]
[]
[]
[]
[]
[]
[]
[]
[]
[]
[]
[]
[]
[]
[]
[]
[]
[]
[]
[]
[]
[]
[]
[]
[]
[]
[]
[]
[]
[]
[]
[]
[]
[]
[]
[]
[]
[]
[]
[]
[]
[]
[]
[]
[]
[]
[]
[]
[]
[]
[]
[]
[]
[]
[]
[]
[]
[]
[]
[]
[]
[]
[]
[]
[]
[]
[]
[]
[]
[]
[]
[]
[]
[]
[]
[]
[]
[]
[]
[]
[]
[]
[]
[]
[]
[]
[]
[]
[]
[]
[]
[]
[]
[]
[]
[]
[]
[]
[]
[]
[]
[]
[]
[]
[]
[]
[]
[]
[]
[]
[]
[]
[]
[]
[]
[]
[]
[]
[]
[]
[]
[]
[]
[]
[]
[]
[]
[]
[]
[]
[]
[]
[]
[]
[]
[]
[]
[]
[]
[]
[]
[]
[]
[]
[]
[]
[]
[]
[]
[]
[]
[]
[]
[]
[]
[]
[]
[]
[]
[]
[]
[]
[]
[]
[]
[]
[]
[]
[]
[]
[]
[]
[]
[]
[]
[]
[]
[]
[]
[]
[]
[]
[]
[]
[]
[]
[]
[]
[]
[]
[]
[]
[]
[]
[]
[]
[]
[]
[]
[]
[]
[]
[]
[]
[]
[]
[]
[]
[]
[]
[]
[]
[]
[]
[]
[]
[]
[]
[]
[]
[]
[]
[]
[]
[]
[]
[]
[]
[]
[]
[]
[]
[]
[]
[]
[]
[]
[]
[]
[]
[]
[]
[]
[]
[]
[]
[]
[]
[]
[]
[]
[]
[]
[]
[]
[]
[]
[]
[]
[]
[]
[]
[]
[]
[]
[]
[]
[]
[]
[]
[]
[]
[]
[]
[]
[]
[]
[]
[]
[]
[]
[]
[]
[]
[]
[]
[]
[]
[]
[]
[]
[]
[]
[]
[]
[]
[]
[]
[]
[]
[]
[]
[]
[]
[]
[]
[]
[]
[]
[]
[]
[]
[]
[]
[]
[]
[]
[]
[]
[]
[]
[]
[]
[]
[]
[]
[]
[]
[]
[]
[]
[]
[]
[]
[]
[]
[]
[]
[]
[]
[]
[]
[]
[]
[]
[]
[]
[]
[]
[]
[]
[]
[]
[]
[]
[]
[]
[]
[]
[]
[]
[]
[]
[]
[]
[]
[]
[]
[]
[]
[]
[]
[]
[]
[]
[]
[]
[]
[]
[]
[]
[]
[]
[]
[]
[]
[]
[]
[]
[]
[]
[]
[]
[]
[]
[]
[]
[]
[]
[]
[]
[]
[]
[]
[]
[]
[]
[]
[]
[]
[]
[]
[]
[]
[]
[]
[]
[]
[]
[]
[]
[]
[]
[]
[]
[]
[]
[]
[]
[]
[]
[]
[]
[]
[]
[]
[]
[]
[]
[]
[]
[]
[]
[]
[]
[]
[]
[]
[]
[]
[]
[]
[]
[]
[]
[]
[]
[]
[]
[]
[]
[]
[]
[]
[]
[]
[]
[]
[]
[]
[]
[]
[]
[]
[]
[]
[]
[]
[]
[]
[]
[]
[]
[]
[]
[]
[]
[]
[]
[]
[]
[]
[]
[]
[]
[]
[]
[]
[]
[]
[]
[]
[]
[]
[]
[]
[]
[]
[]
[]
[]
[]
[]
[]
[]
[]
[]
[]
[]
[]
[]
[]
[]
[]
[]
[]
[]
[]
[]
[]
[]
[]
[]
[]
[]
[]
[]
[]
[]
[]
[]
[]
[]
[]
[]
[]
[]
[]
[]
[]
[]
[]
[]
[]
[]
[]
[]
[]
[]
[]
[]
[]
[]
[]
[]
[]
[]
[]
[]
[]
[]
[]
[]
[]
[]
[]
[]
[]
[]
[]
[]
[]
[]
[]
[]
[]
[]
[]
[]
[]
[]
[]
[]
[]
[]
[]
[]
[]
[]
[]
[]
[]
[]
[]
[]
[]
[]
[]
[]
[]
[]
[]
[]
[]
[]
[]
[]
[]
[]
[]
[]
[]
[]
[]
[]
[]
[]
[]
[]
[]
[]
[]
[]
[]
[]
[]
[]
[]
[]
[]
[]
[]
[]
[]
[]
[]
[]
[]
[]
[]
[]
[]
[]
[]
[]
[]
[]
[]
[]
[]
[]
[]
[]
[]
[]
[]
[]
[]
[]
[]
[]
[]
[]
[]
[]
[]
[]
[]
[]
[]
[]
[]
[]
[]
[]
[]
[]
[]
[]
[]
[]
[]
[]
[]
[]
[]
[]
[]
[]
[]
[]
[]
[]
[]
[]
[]
[]
[]
[]
[]
[]
[]
[]
[]
[]
[]
[]
[]
[]
[]
[]
[]
[]
[]
[]
[]
[]
[]
[]
[]
[]
[]
[]
[]
[]
[]
[]
[]
[]
[]
[]
[]
[]
[]
[]
[]
[]
[]
[]
[]
[]
[]
[]
[]
[]
[]
[]
[]
[]
[]
[]
[]
[]
[]
[]
[]
[]
[]
[]
[]
[]
[]
[]
[]
[]
[]
[]
[]
[]
[]
[]
[]
[]
[]
[]
[]
[]
[]
[]
[]
[]
[]
[]
[]
[]
[]
[]
[]
[]
[]
[]
[]
[]
[]
[]
[]
[]
[]
[]
[]
[]
[]
[]
[]
[]
[]
[]
[]
[]
[]
[]
[]
[]
[]
[]
[]
[]
[]
[]
[]
[]
[]
[]
[]
[]
[]
[]
[]
[]
[]
[]
[]
[]
[]
[]
[]
[]
[]
[]
[]
[]
[]
[]
[]
[]
[]
[]
[]
[]
[]
[]
[]
[]
[]
[]
[]
[]
[]
[]
[]
[]
[]
[]
[]
[]
[]
[]
[]
[]
[]
[]
[]
[]
[]
[]
[]
[]
[]
[]
[]
[]
[]
[]
[]
[]
[]
[]
[]
[]
[]
[]
[]
[]
[]
[]
[]
[]
[]
[]
[]
[]
[]
[]
[]
[]
[]
[]
[]
[]
[]
[]
[]
[]
[]
[]
[]
[]
[]
[]
[]
[]
[]
[]
[]
[]
[]
[]
[]
[]
[]
[]
[]
[]
[]
[]
[]
[]
[]
[]
[]
[]
[]
[]
[]
[]
[]
[]
[]
[]
[]
[]
[]
[]
[]
[]
[]
[]
[]
[]
[]
[]
[]
[]
[]
[]
[]
[]
[]
[]
[]
[]
[]
[]
[]
[]
[]
[]
[]
[]
[]
[]
[]
[]
[]
[]
[]
[]
[]
[]
[]
[]
[]
[]
[]
[]
[]
[]
[]
[]
[]
[]
[]
[]
[]
[]
[]
[]
[]
[]
[]
[]
[]
[]
[]
[]
[]
[]
[]
[]
[]
[]
[]
[]
[]
[]
[]
[]
[]
[]
[]
[]
[]
[]
[]
[]
[]
[]
[]
[]
[]
[]
[]
[]
[]
[]
[]
[]
[]
[]
[]
[]
[]
[]
[]
[]
[]
[]
[]
[]
[]
[]
[]
[]
[]
[]
[]
[]
[]
[]
[]
[]
[]
[]
[]
[]
[]
[]
[]
[]
[]
[]
[]
[]
[]
[]
[]
[]
[]
[]
[]
[]
[]
[]
[]
[]
[]
[]
[]
[]
[]
[]
[]
[]
[]
[]
[]
[]
[]
[]
[]
[]
[]
[]
[]
[]
[]
[]
[]
[]
[]
[]
[]
[]
[]
[]
[]
[]
[]
[]
[]
[]
[]
[]
[]
[]
[]
[]
[]
[]
[]
[]
[]
[]
[]
[]
[]
[]
[]
[]
[]
[]
[]
[]
[]
[]
[]
[]
[]
[]
[]
[]
[]
[]
[]
[]
[]
[]
[]
[]
[]
[]
[]
[]
[]
[]
[]
[]
[]
[]
[]
[]
[]
[]
[]
[]
[]
[]
[]
[]
[]
[]
[]
[]
[]
[]
[]
[]
[]
[]
[]
[]
[]
[]
[]
[]
[]
[]
[]
[]
[]
[]
[]
[]
[]
[]
[]
[]
[]
[]
[]
[]
[]
[]
[]
[]
[]
[]
[]
[]
[]
[]
[]
[]
[]
[]
[]
[]
[]
[]
[]
[]
[]
[]
[]
[]
[]
[]
[]
[]
[]
[]
[]
[]
[]
[]
[]
[]
[]
[]
[]
[]
[]
[]
[]
[]
[]
[]
[]
[]
[]
[]
[]
[]
[]
[]
[]
[]
[]
[]
[]
[]
[]
[]
[]
[]
[]
[]
[]
[]
[]
[]
[]
[]
[]
[]
[]
[]
[]
[]
[]
[]
[]
[]
[]
[]
[]
[]
[]
[]
[]
[]
[]
[]
[]
[]
[]
[]
[]
[]
[]
[]
[]
[]
[]
[]
[]
[]
[]
[]
[]
[]
[]
[]
[]
[]
[]
[]
[]
[]
[]
[]
[]
[]
[]
[]
[]
[]
[]
[]
[]
[]
[]
[]
[]
[]
[]
[]
[]
[]
[]
[]
[]
[]
[]
[]
[]
[]
[]
[]
[]
[]
[]
[]
[]
[]
[]
[]
[]
[]
[]
[]
[]
[]
[]
[]
[]
[]
[]
[]
[]
[]
[]
[]
[]
[]
[]
[]
[]
[]
[]
[]
[]
[]
[]
[]
[]
[]
[]
[]
[]
[]
[]
[]
[]
[]
[]
[]
[]
[]
[]
[]
[]
[]
[]
[]
[]
[]
[]
[]
[]
[]
[]
[]
[]
[]
[]
[]
[]
[]
[]
[]
[]
[]
[]
[]
[]
[]
[]
[]
[]
[]
[]
[]
[]
[]
[]
[]
[]
[]
[]
[]
[]
[]
[]
[]
[]
[]
[]
[]
[]
[]
[]
[]
[]
[]
[]
[]
[]
[]
[]
[]
[]
[]
[]
[]
[]
[]
[]
[]
[]
[]
[]
[]
[]
[]
[]
[]
[]
[]
[]
[]
[]
[]
[]
[]
[]
[]
[]
[]
[]
[]
[]
[]
[]
[]
[]
[]
[]
[]
[]
[]
[]
[]
[]
[]
[]
[]
[]
[]
[]
[]
[]
[]
[]
[]
[]
[]
[]
[]
[]
[]
[]
[]
[]
[]
[]
[]
[]
[]
[]
[]
[]
[]
[]
[]
[]
[]
[]
[]
[]
[]
[]
[]
[]
[]
[]
[]
[]
[]
[]
[]
[]
[]
[]
[]
[]
[]
[]
[]
[]
[]
[]
[]
[]
[]
[]
[]
[]
[]
[]
[]
[]
[]
[]
[]
[]
[]
[]
[]
[]
[]
[]
[]
[]
[]
[]
[]
[]
[]
[]
[]
[]
[]
[]
[]
[]
[]
[]
[]
[]
[]
[]
[]
[]
[]
[]
[]
[]
[]
[]
[]
[]
[]
[]
[]
[]
[]
[]
[]
[]
[]
[]
[]
[]
[]
[]
[]
[]
[]
[]
[]
[]
[]
[]
[]
[]
[]
[]
[]
[]
[]
[]
[]
[]
[]
[]
[]
[]
[]
[]
[]
[]
[]
[]
[]
[]
[]
[]
[]
[]
[]
[]
[]
[]
[]
[]
[]
[]
[]
[]
[]
[]
[]
[]
[]
[]
[]
[]
[]
[]
[]
[]
[]
[]
[]
[]
[]
[]
[]
[]
[]
[]
[]
[]
[]
[]
[]
[]
[]
[]
[]
[]
[]
[]
[]
[]
[]
[]
[]
[]
[]
[]
[]
[]
[]
[]
[]
[]
[]
[]
[]
[]
[]
[]
[]
[]
[]
[]
[]
[]
[]
[]
[]
[]
[]
[]
[]
[]
[]
[]
[]
[]
[]
[]
[]
[]
[]
[]
[]
[]
[]
[]
[]
[]
[]
[]
[]
[]
[]
[]
[]
[]
[]
[]
[]
[]
[]
[]
[]
[]
[]
[]
[]
[]
[]
[]
[]
[]
[]
[]
[]
[]
[]
[]
[]
[]
[]
[]
[]
[]
[]
[]
[]
[]
[]
[]
[]
[]
[]
[]
[]
[]
[]
[]
[]
[]
[]
[]
[]
[]
[]
[]
[]
[]
[]
[]
[]
[]
[]
[]
[]
[]
[]
[]
[]
[]
[]
[]
[]
[]
[]
[]
[]
[]
[]
[]
[]
[]
[]
[]
[]
[]
[]
[]
[]
[]
[]
[]
[]
[]
[]
[]
[]
[]
[]
[]
[]
[]
[]
[]
[]
[]
[]
[]
[]
[]
[]
[]
[]
[]
[]
[]
[]
[]
[]
[]
[]
[]
[]
[]
[]
[]
[]
[]
[]
[]
[]
[]
[]
[]
[]
[]
[]
[]
[]
[]
[]
[]
[]
[]
[]
[]
[]
[]
[]
[]
[]
[]
[]
[]
[]
[]
[]
[]
[]
[]
[]
[]
[]
[]
[]
[]
[]
[]
[]
[]
[]
[]
[]
[]
[]
[]
[]
[]
[]
[]
[]
[]
[]
[]
[]
[]
[]
[]
[]
[]
[]
[]
[]
[]
[]
[]
[]
[]
[]
[]
[]
[]
[]
[]
[]
[]
[]
[]
[]
[]
[]
[]
[]
[]
[]
[]
[]
[]
[]
[]
[]
[]
[]
[]
[]
[]
[]
[]
[]
[]
[]
[]
[]
[]
[]
[]
[]
[]
[]
[]
[]
[]
[]
[]
[]
[]
[]
[]
[]
[]
[]
[]
[]
[]
[]
[]
[]
[]
[]
[]
[]
[]
[]
[]
[]
[]
[]
[]
[]
[]
[]
[]
[]
[]
[]
[]
[]
[]
[]
[]
[]
[]
[]
[]
[]
[]
[]
[]
[]
[]
[]
[]
[]
[]
[]
[]
[]
[]
[]
[]
[]
[]
[]
[]
[]
[]
[]
[]
[]
[]
[]
[]
[]
[]
[]
[]
[]
[]
[]
[]
[]
[]
[]
[]
[]
[]
[]
[]
[]
[]
[]
[]
[]
[]
[]
[]
[]
[]
[]
[]
[]
[]
[]
[]
[]
[]
[]
[]
[]
[]
[]
[]
[]
[]
[]
[]
[]
[]
[]
[]
[]
[]
[]
[]
[]
[]
[]
[]
[]
[]
[]
[]
[]
[]
[]
[]
[]
[]
[]
[]
[]
[]
[]
[]
[]
[]
[]
[]
[]
[]
[]
[]
[]
[]
[]
[]
[]
[]
[]
[]
[]
[]
[]
[]
[]
[]
[]
[]
[]
[]
[]
[]
[]
[]
[]
[]
[]
[]
[]
[]
[]
[]
[]
[]
[]
[]
[]
[]
[]
[]
[]
[]
[]
[]
[]
[]
[]
[]
[]
[]
[]
[]
[]
[]
[]
[]
[]
[]
[]
[]
[]
[]
[]
[]
[]
[]
[]
[]
[]
[]
[]
[]
[]
[]
[]
[]
[]
[]
[]
[]
[]
[]
[]
[]
[]
[]
[]
[]
[]
[]
[]
[]
[]
[]
[]
[]
[]
[]
[]
[]
[]
[]
[]
[]
[]
[]
[]
[]
[]
[]
[]
[]
[]
[]
[]
[]
[]
[]
[]
[]
[]
[]
[]
[]
[]
[]
[]
[]
[]
[]
[]
[]
[]
[]
[]
[]
[]
[]
[]
[]
[]
[]
[]
[]
[]
[]
[]
[]
[]
[]
[]
[]
[]
[]
[]
[]
[]
[]
[]
[]
[]
[]
[]
[]
[]
[]
[]
[]
[]
[]
[]
[]
[]
[]
[]
[]
[]
[]
[]
[]
[]
[]
[]
[]
[]
[]
[]
[]
[]
[]
[]
[]
[]
[]
[]
[]
[]
[]
[]
[]
[]
[]
[]
[]
[]
[]
[]
[]
[]
[]
[]
[]
[]
[]
[]
[]
[]
[]
[]
[]
[]
[]
[]
[]
[]
[]
[]
[]
[]
[]
[]
[]
[]
[]
[]
[]
[]
[]
[]
[]
[]
[]
[]
[]
[]
[]
[]
[]
[]
[]
[]
[]
[]
[]
[]
[]
[]
[]
[]
[]
[]
[]
[]
[]
[]
[]
[]
[]
[]
[]
[]
[]
[]
[]
[]
[]
[]
[]
[]
[]
[]
[]
[]
[]
[]
[]
[]
[]
[]
[]
[]
[]
[]
[]
[]
[]
[]
[]
[]
[]
[]
[]
[]
[]
[]
[]
[]
[]
[]
[]
[]
[]
[]
[]
[]
[]
[]
[]
[]
[]
[]
[]
[]
[]
[]
[]
[]
[]
[]
[]
[]
[]
[]
[]
[]
[]
[]
[]
[]
[]
[]
[]
[]
[]
[]
[]
[]
[]
[]
[]
[]
[]
[]
[]
[]
[]
[]
[]
[]
[]
[]
[]
[]
[]
[]
[]
[]
[]
[]
[]
[]
[]
[]
[]
[]
[]
[]
[]
[]
[]
[]
[]
[]
[]
[]
[]
[]
[]
[]
[]
[]
[]
[]
[]
[]
[]
[]
[]
[]
[]
[]
[]
[]
[]
[]
[]
[]
[]
[]
[]
[]
[]
[]
[]
[]
[]
[]
[]
[]
[]
[]
[]
[]
[]
[]
[]
[]
[]
[]
[]
[]
[]
[]
[]
[]
[]
[]
[]
[]
[]
[]
[]
[]
[]
[]
[]
[]
[]
[]
[]
[]
[]
[]
[]
[]
[]
[]
[]
[]
[]
[]
[]
[]
[]
[]
[]
[]
[]
[]
[]
[]
[]
[]
[]
[]
[]
[]
[]
[]
[]
[]
[]
[]
[]
[]
[]
[]
[]
[]
[]
[]
[]
[]
[]
[]
[]
[]
[]
[]
[]
[]
[]
[]
[]
[]
[]
[]
[]
[]
[]
[]
[]
[]
[]
[]
[]
[]
[]
[]
[]
[]
[]
[]
[]
[]
[]
[]
[]
[]
[]
[]
[]
[]
[]
[]
[]
[]
[]
[]
[]
[]
[]
[]
[]
[]
[]
[]
[]
[]
[]
[]
[]
[]
[]
[]
[]
[]
[]
[]
[]
[]
[]
[]
[]
[]
[]
[]
[]
[]
[]
[]
[]
[]
[]
[]
[]
[]
[]
[]
[]
[]
[]
[]
[]
[]
[]
[]
[]
[]
[]
[]
[]
[]
[]
[]
[]
[]
[]
[]
[]
[]
[]
[]
[]
[]
[]
[]
[]
[]
[]
[]
[]
[]
[]
[]
[]
[]
[]
[]
[]
[]
[]
[]
[]
[]
[]
[]
[]
[]
[]
[]
[]
[]
[]
[]
[]
[]
[]
[]
[]
[]
[]
[]
[]
[]
[]
[]
[]
[]
[]
[]
[]
[]
[]
[]
[]
[]
[]
[]
[]
[]
[]
[]
[]
[]
[]
[]
[]
[]
[]
[]
[]
[]
[]
[]
[]
[]
[]
[]
[]
[]
[]
[]
[]
[]
[]
[]
[]
[]
[]
[]
[]
[]
[]
[]
[]
[]
[]
[]
[]
[]
[]
[]
[]
[]
[]
[]
[]
[]
[]
[]
[]
[]
[]
[]
[]
[]
[]
[]
[]
[]
[]
[]
[]
[]
[]
[]
[]
[]
[]
[]
[]
[]
[]
[]
[]
[]
[]
[]
[]
[]
[]
[]
[]
[]
[]
[]
[]
[]
[]
[]
[]
[]
[]
[]
[]
[]
[]
[]
[]
[]
[]
[]
[]
[]
[]
[]
[]
[]
[]
[]
[]
[]
[]
[]
[]
[]
[]
[]
[]
[]
[]
[]
[]
[]
[]
[]
[]
[]
[]
[]
[]
[]
[]
[]
[]
[]
[]
[]
[]
[]
[]
[]
[]
[]
[]
[]
[]
[]
[]
[]
[]
[]
[]
[]
[]
[]
[]
[]
[]
[]
[]
[]
[]
[]
[]
[]
[]
[]
[]
[]
[]
[]
[]
[]
[]
[]
[]
[]
[]
[]
[]
[]
[]
[]
[]
[]
[]
[]
[]
[]
[]
[]
[]
[]
[]
[]
[]
[]
[]
[]
[]
[]
[]
[]
[]
[]
[]
[]
[]
[]
[]
[]
[]
[]
[]
[]
[]
[]
[]
[]
[]
[]
[]
[]
[]
[]
[]
[]
[]
[]
[]
[]
[]
[]
[]
[]
[]
[]
[]
[]
[]
[]
[]
[]
[]
[]
[]
[]
[]
[]
[]
[]
[]
[]
[]
[]
[]
[]
[]
[]
[]
[]
[]
[]
[]
[]
[]
[]
[]
[]
[]
[]
[]
[]
[]
[]
[]
[]
[]
[]
[]
[]
[]
[]
[]
[]
[]
[]
[]
[]
[]
[]
[]
[]
[]
[]
[]
[]
[]
[]
[]
[]
[]
[]
[]
[]
[]
[]
[]
[]
[]
[]
[]
[]
[]
[]
[]
[]
[]
[]
[]
[]
[]
[]
[]
[]
[]
[]
[]
[]
[]
[]
[]
[]
[]
[]
[]
[]
[]
[]
[]
[]
[]
[]
[]
[]
[]
[]
[]
[]
[]
[]
[]
[]
[]
[]
[]
[]
[]
[]
[]
[]
[]
[]
[]
[]
[]
[]
[]
[]
[]
[]
[]
[]
[]
[]
[]
[]
[]
[]
[]
[]
[]
[]
[]
[]
[]
[]
[]
[]
[]
[]
[]
[]
[]
[]
[]
[]
[]
[]
[]
[]
[]
[]
[]
[]
[]
[]
[]
[]
[]
[]
[]
[]
[]
[]
[]
[]
[]
[]
[]
[]
[]
[]
[]
[]
[]
[]
[]
[]
[]
[]
[]
[]
[]
[]
[]
[]
[]
[]
[]
[]
[]
[]
[]
[]
[]
[]
[]
[]
[]
[]
[]
[]
[]
[]
[]
[]
[]
[]
[]
[]
[]
[]
[]
[]
[]
[]
[]
[]
[]
[]
[]
[]
[]
[]
[]
[]
[]
[]
[]
[]
[]
[]
[]
[]
[]
[]
[]
[]
[]
[]
[]
[]
[]
[]
[]
[]
[]
[]
[]
[]
[]
[]
[]
[]
[]
[]
[]
[]
[]
[]
[]
[]
[]
[]
[]
[]
[]
[]
[]
[]
[]
[]
[]
[]
[]
[]
[]
[]
[]
[]
[]
[]
[]
[]
[]
[]
[]
[]
[]
[]
[]
[]
[]
[]
[]
[]
[]
[]
[]
[]
[]
[]
[]
[]
[]
[]
[]
[]
[]
[]
[]
[]
[]
[]
[]
[]
[]
[]
[]
[]
[]
[]
[]
[]
[]
[]
[]
[]
[]
[]
[]
[]
[]
[]
[]
[]
[]
[]
[]
[]
[]
[]
[]
[]
[]
[]
[]
[]
[]
[]
[]
[]
[]
[]
[]
[]
[]
[]
[]
[]
[]
[]
[]
[]
[]
[]
[]
[]
[]
[]
[]
[]
[]
[]
[]
[]
[]
[]
[]
[]
[]
[]
[]
[]
[]
[]
[]
[]
[]
[]
[]
[]
[]
[]
[]
[]
[]
[]
[]
[]
[]
[]
[]
[]
[]
[]
[]
[]
[]
[]
[]
[]
[]
[]
[]
[]
[]
[]
[]
[]
[]
[]
[]
[]
[]
[]
[]
[]
[]
[]
[]
[]
[]
[]
[]
[]
[]
[]
[]
[]
[]
[]
[]
[]
[]
[]
[]
[]
[]
[]
[]
[]
[]
[]
[]
[]
[]
[]
[]
[]
[]
[]
[]
[]
[]
[]
[]
[]
[]
[]
[]
[]
[]
[]
[]
[]
[]
[]
[]
[]
[]
[]
[]
[]
[]
[]
[]
[]
[]
[]
[]
[]
[]
[]
[]
[]
[]
[]
[]
[]
[]
[]
[]
[]
[]
[]
[]
[]
[]
[]
[]
[]
[]
[]
[]
[]
[]
[]
[]
[]
[]
[]
[]
[]
[]
[]
[]
[]
[]
[]
[]
[]
[]
[]
[]
[]
[]
[]
[]
[]
[]
[]
[]
[]
[]
[]
[]
[]
[]
[]
[]
[]
[]
[]
[]
[]
[]
[]
[]
[]
[]
[]
[]
[]
[]
[]
[]
[]
[]
[]
[]
[]
[]
[]
[]
[]
[]
[]
[]
[]
[]
[]
[]
[]
[]
[]
[]
[]
[]
[]
[]
[]
[]
[]
[]
[]
[]
[]
[]
[]
[]
[]
[]
[]
[]
[]
[]
[]
[]
[]
[]
[]
[]
[]
[]
[]
[]
[]
[]
[]
[]
[]
[]
[]
[]
[]
[]
[]
[]
[]
[]
[]
[]
[]
[]
[]
[]
[]
[]
[]
[]
[]
[]
[]
[]
[]
[]
[]
[]
[]
[]
[]
[]
[]
[]
[]
[]
[]
[]
[]
[]
[]
[]
[]
[]
[]
[]
[]
[]
[]
[]
[]
[]
[]
[]
[]
[]
[]
[]
[]
[]
[]
[]
[]
[]
[]
[]
[]
[]
[]
[]
[]
[]
[]
[]
[]
[]
[]
[]
[]
[]
[]
[]
[]
[]
[]
[]
[]
[]
[]
[]
[]
[]
[]
[]
[]
[]
[]
[]
[]
[]
[]
[]
[]
[]
[]
[]
[]
[]
[]
[]
[]
[]
[]
[]
[]
[]
[]
[]
[]
[]
[]
[]
[]
[]
[]
[]
[]
[]
[]
[]
[]
[]
[]
[]
[]
[]
[]
[]
[]
[]
[]
[]
[]
[]
[]
[]
[]
[]
[]
[]
[]
[]
[]
[]
[]
[]
[]
[]
[]
[]
[]
[]
[]
[]
[]
[]
[]
[]
[]
[]
[]
[]
[]
[]
[]
[]
[]
[]
[]
[]
[]
[]
[]
[]
[]
[]
[]
[]
[]
[]
[]
[]
[]
[]
[]
[]
[]
[]
[]
[]
[]
[]
[]
[]
[]
[]
[]
[]
[]
[]
[]
[]
[]
[]
[]
[]
[]
[]
[]
[]
[]
[]
[]
[]
[]
[]
[]
[]
[]
[]
[]
[]
[]
[]
[]
[]
[]
[]
[]
[]
[]
[]
[]
[]
[]
[]
[]
[]
[]
[]
[]
[]
[]
[]
[]
[]
[]
[]
[]
[]
[]
[]
[]
[]
[]
[]
[]
[]
[]
[]
[]
[]
[]
[]
[]
[]
[]
[]
[]
[]
[]
[]
[]
[]
[]
[]
[]
[]
[]
[]
[]
[]
[]
[]
[]
[]
[]
[]
[]
[]
[]
[]
[]
[]
[]
[]
[]
[]
[]
[]
[]
[]
[]
[]
[]
[]
[]
[]
[]
[]
[]
[]
[]
[]
[]
[]
[]
[]
[]
[]
[]
[]
[]
[]
[]
[]
[]
[]
[]
[]
[]
[]
[]
[]
[]
[]
[]
[]
[]
[]
[]
[]
[]
[]
[]
[]
[]
[]
[]
[]
[]
[]
[]
[]
[]
[]
[]
[]
[]
[]
[]
[]
[]
[]
[]
[]
[]
[]
[]
[]
[]
[]
[]
[]
[]
[]
[]
[]
[]
[]
[]
[]
[]
[]
[]
[]
[]
[]
[]
[]
[]
[]
[]
[]
[]
[]
[]
[]
[]
[]
[]
[]
[]
[]
[]
[]
[]
[]
[]
[]
[]
[]
[]
[]
[]
[]
[]
[]
[]
[]
[]
[]
[]
[]
[]
[]
[]
[]
[]
[]
[]
[]
[]
[]
[]
[]
[]
[]
[]
[]
[]
[]
[]
[]
[]
[]
[]
[]
[]
[]
[]
[]
[]
[]
[]
[]
[]
[]
[]
[]
[]
[]
[]
[]
[]
[]
[]
[]
[]
[]
[]
[]
[]
[]
[]
[]
[]
[]
[]
[]
[]
[]
[]
[]
[]
[]
[]
[]
[]
[]
[]
[]
[]
[]
[]
[]
[]
[]
[]
[]
[]
[]
[]
[]
[]
[]
[]
[]
[]
[]
[]
[]
[]
[]
[]
[]
[]
[]
[]
[]
[]
[]
[]
[]
[]
[]
[]
[]
[]
[]
[]
[]
[]
[]
[]
[]
[]
[]
[]
[]
[]
[]
[]
[]
[]
[]
[]
[]
[]
[]
[]
[]
[]
[]
[]
[]
[]
[]
[]
[]
[]
[]
[]
[]
[]
[]
[]
[]
[]
[]
[]
[]
[]
[]
[]
[]
[]
[]
[]
[]
[]
[]
[]
[]
[]
[]
[]
[]
[]
[]
[]
[]
[]
[]
[]
[]
[]
[]
[]
[]
[]
[]
[]
[]
[]
[]
[]
[]
[]
[]
[]
[]
[]
[]
[]
[]
[]
[]
[]
[]
[]
[]
[]
[]
[]
[]
[]
[]
[]
[]
[]
[]
[]
[]
[]
[]
[]
[]
[]
[]
[]
[]
[]
[]
[]
[]
[]
[]
[]
[]
[]
[]
[]
[]
[]
[]
[]
[]
[]
[]
[]
[]
[]
[]
[]
[]
[]
[]
[]
[]
[]
[]
[]
[]
[]
[]
[]
[]
[]
[]
[]
[]
[]
[]
[]
[]
[]
[]
[]
[]
[]
[]
[]
[]
[]
[]
[]
[]
[]
[]
[]
[]
[]
[]
[]
[]
[]
[]
[]
[]
[]
[]
[]
[]
[]
[]
[]
[]
[]
[]
[]
[]
[]
[]
[]
[]
[]
[]
[]
[]
[]
[]
[]
[]
[]
[]
[]
[]
[]
[]
[]
[]
[]
[]
[]
[]
[]
[]
[]
[]
[]
[]
[]
[]
[]
[]
[]
[]
[]
[]
[]
[]
[]
[]
[]
[]
[]
[]
[]
[]
[]
[]
[]
[]
[]
[]
[]
[]
[]
[]
[]
[]
[]
[]
[]
[]
[]
[]
[]
[]
[]
[]
[]
[]
[]
[]
[]
[]
[]
[]
[]
[]
[]
[]
[]
[]
[]
[]
[]
[]
[]
[]
[]
[]
[]
[]
[]
[]
[]
[]
[]
[]
[]
[]
[]
[]
[]
[]
[]
[]
[]
[]
[]
[]
[]
[]
[]
[]
[]
[]
[]
[]
[]
[]
[]
[]
[]
[]
[]
[]
[]
[]
[]
[]
[]
[]
[]
[]
[]
[]
[]
[]
[]
[]
[]
[]
[]
[]
[]
[]
[]
[]
[]
[]
[]
[]
[]
[]
[]
[]
[]
[]
[]
[]
[]
[]
[]
[]
[]
[]
[]
[]
[]
[]
[]
[]
[]
[]
[]
[]
[]
[]
[]
[]
[]
[]
[]
[]
[]
[]
[]
[]
[]
[]
[]
[]
[]
[]
[]
[]
[]
[]
[]
[]
[]
[]
[]
[]
[]
[]
[]
[]
[]
[]
[]
[]
[]
[]
[]
[]
[]
[]
[]
[]
[]
[]
[]
[]
[]
[]
[]
[]
[]
[]
[]
[]
[]
[]
[]
[]
[]
[]
[]
[]
[]
[]
[]
[]
[]
[]
[]
[]
[]
[]
[]
[]
[]
[]
[]
[]
[]
[]
[]
[]
[]
[]
[]
[]
[]
[]
[]
[]
[]
[]
[]
[]
[]
[]
[]
[]
[]
[]
[]
[]
[]
[]
[]
[]
[]
[]
[]
[]
[]
[]
[]
[]
[]
[]
[]
[]
[]
[]
[]
[]
[]
[]
[]
[]
[]
[]
[]
[]
[]
[]
[]
[]
[]
[]
[]
[]
[]
[]
[]
[]
[]
[]
[]
[]
[]
[]
[]
[]
[]
[]
[]
[]
[]
[]
[]
[]
[]
[]
[]
[]
[]
[]
[]
[]
[]
[]
[]
[]
[]
[]
[]
[]
[]
[]
[]
[]
[]
[]
[]
[]
[]
[]
[]
[]
[]
[]
[]
[]
[]
[]
[]
[]
[]
[]
[]
[]
[]
[]
[]
[]
[]
[]
[]
[]
[]
[]
[]
[]
[]
[]
[]
[]
[]
[]
[]
[]
[]
[]
[]
[]
[]
[]
[]
[]
[]
[]
[]
[]
[]
[]
[]
[]
[]
[]
[]
[]
[]
[]
[]
[]
[]
[]
[]
[]
[]
[]
[]
[]
[]
[]
[]
[]
[]
[]
[]
[]
[]
[]
[]
[]
[]
[]
[]
[]
[]
[]
[]
[]
[]
[]
[]
[]
[]
[]
[]
[]
[]
[]
[]
[]
[]
[]
[]
[]
[]
[]
[]
[]
[]
[]
[]
[]
[]
[]
[]
[]
[]
[]
[]
[]
[]
[]
[]
[]
[]
[]
[]
[]
[]
[]
[]
[]
[]
[]
[]
[]
[]
[]
[]
[]
[]
[]
[]
[]
[]
[]
[]
[]
[]
[]
[]
[]
[]
[]
[]
[]
[]
[]
[]
[]
[]
[]
[]
[]
[]
[]
[]
[]
[]
[]
[]
[]
[]
[]
[]
[]
[]
[]
[]
[]
[]
[]
[]
[]
[]
[]
[]
[]
[]
[]
[]
[]
[]
[]
[]
[]
[]
[]
[]
[]
[]
[]
[]
[]
[]
[]
[]
[]
[]
[]
[]
[]
[]
[]
[]
[]
[]
[]
[]
[]
[]
[]
[]
[]
[]
[]
[]
[]
[]
[]
[]
[]
[]
[]
[]
[]
[]
[]
[]
[]
[]
[]
[]
[]
[]
[]
[]
[]
[]
[]
[]
[]
[]
[]
[]
[]
[]
[]
[]
[]
[]
[]
[]
[]
[]
[]
[]
[]
[]
[]
[]
[]
[]
[]
[]
[]
[]
[]
[]
[]
[]
[]
[]
[]
[]
[]
[]
[]
[]
[]
[]
[]
[]
[]
[]
[]
[]
[]
[]
[]
[]
[]
[]
[]
[]
[]
[]
[]
[]
[]
[]
[]
[]
[]
[]
[]
[]
[]
[]
[]
[]
[]
[]
[]
[]
[]
[]
[]
[]
[]
[]
[]
[]
[]
[]
[]
[]
[]
[]
[]
[]
[]
[]
[]
[]
[]
[]
[]
[]
[]
[]
[]
[]
[]
[]
[]
[]
[]
[]
[]
[]
[]
[]
[]
[]
[]
[]
[]
[]
[]
[]
[]
[]
[]
[]
[]
[]
[]
[]
[]
[]
[]
[]
[]
[]
[]
[]
[]
[]
[]
[]
[]
[]
[]
[]
[]
[]
[]
[]
[]
[]
[]
[]
[]
[]
[]
[]
[]
[]
[]
[]
[]
[]
[]
[]
[]
[]
[]
[]
[]
[]
[]
[]
[]
[]
[]
[]
[]
[]
[]
[]
[]
[]
[]
[]
[]
[]
[]
[]
[]
[]
[]
[]
[]
[]
[]
[]
[]
[]
[]
[]
[]
[]
[]
[]
[]
[]
[]
[]
[]
[]
[]
[]
[]
[]
[]
[]
[]
[]
[]
[]
[]
[]
[]
[]
[]
[]
[]
[]
[]
[]
[]
[]
[]
[]
[]
[]
[]
[]
[]
[]
[]
[]
[]
[]
[]
[]
[]
[]
[]
[]
[]
[]
[]
[]
[]
[]
[]
[]
[]
[]
[]
[]
[]
[]
[]
[]
[]
[]
[]
[]
[]
[]
[]
[]
[]
[]
[]
[]
[]
[]
[]
[]
[]
[]
[]
[]
[]
[]
[]
[]
[]
[]
[]
[]
[]
[]
[]
[]
[]
[]
[]
[]
[]
[]
[]
[]
[]
[]
[]
[]
[]
[]
[]
[]
[]
[]
[]
[]
[]
[]
[]
[]
[]
[]
[]
[]
[]
[]
[]
[]
[]
[]
[]
[]
[]
[]
[]
[]
[]
[]
[]
[]
[]
[]
[]
[]
[]
[]
[]
[]
[]
[]
[]
[]
[]
[]
[]
[]
[]
[]
[]
[]
[]
[]
[]
[]
[]
[]
[]
[]
[]
[]
[]
[]
[]
[]
[]
[]
[]
[]
[]
[]
[]
[]
[]
[]
[]
[]
[]
[]
[]
[]
[]
[]
[]
[]
[]
[]
[]
[]
[]
[]
[]
[]
[]
[]
[]
[]
[]
[]
[]
[]
[]
[]
[]
[]
[]
[]
[]
[]
[]
[]
[]
[]
[]
[]
[]
[]
[]
[]
[]
[]
[]
[]
[]
[]
[]
[]
[]
[]
[]
[]
[]
[]
[]
[]
[]
[]
[]
[]
[]
[]
[]
[]
[]
[]
[]
[]
[]
[]
[]
[]
[]
[]
[]
[]
[]
[]
[]
[]
[]
[]
[]
[]
[]
[]
[]
[]
[]
[]
[]
[]
[]
[]
[]
[]
[]
[]
[]
[]
[]
[]
[]
[]
[]
[]
[]
[]
[]
[]
[]
[]
[]
[]
[]
[]
[]
[]
[]
[]
[]
[]
[]
[]
[]
[]
[]
[]
[]
[]
[]
[]
[]
[]
[]
[]
[]
[]
[]
[]
[]
[]
[]
[]
[]
[]
[]
[]
[]
[]
[]
[]
[]
[]
[]
[]
[]
[]
[]
[]
[]
[]
[]
[]
[]
[]
[]
[]
[]
[]
[]
[]
[]
[]
[]
[]
[]
[]
[]
[]
[]
[]
[]
[]
[]
[]
[]
[]
[]
[]
[]
[]
[]
[]
[]
[]
[]
[]
[]
[]
[]
[]
[]
[]
[]
[]
[]
[]
[]
[]
[]
[]
[]
[]
[]
[]
[]
[]
[]
[]
[]
[]
[]
[]
[]
[]
[]
[]
[]
[]
[]
[]
[]
[]
[]
[]
[]
[]
[]
[]
[]
[]
[]
[]
[]
[]
[]
[]
[]
[]
[]
[]
[]
[]
[]
[]
[]
[]
[]
[]
[]
[]
[]
[]
[]
[]
[]
[]
[]
[]
[]
[]
[]
[]
[]
[]
[]
[]
[]
[]
[]
[]
[]
[]
[]
[]
[]
[]
[]
[]
[]
[]
[]
[]
[]
[]
[]
[]
[]
[]
[]
[]
[]
[]
[]
[]
[]
[]
[]
[]
[]
[]
[]
[]
[]
[]
[]
[]
[]
[]
[]
[]
[]
[]
[]
[]
[]
[]
[]
[]
[]
[]
[]
[]
[]
[]
[]
[]
[]
[]
[]
[]
[]
[]
[]
[]
[]
[]
[]
[]
[]
[]
[]
[]
[]
[]
[]
[]
[]
[]
[]
[]
[]
[]
[]
[]
[]
[]
[]
[]
[]
[]
[]
[]
[]
[]
[]
[]
[]
[]
[]
[]
[]
[]
[]
[]
[]
[]
[]
[]
[]
[]
[]
[]
[]
[]
[]
[]
[]
[]
[]
[]
[]
[]
[]
[]
[]
[]
[]
[]
[]
[]
[]
[]
[]
[]
[]
[]
[]
[]
[]
[]
[]
[]
[]
[]
[]
[]
[]
[]
[]
[]
[]
[]
[]
[]
[]
[]
[]
[]
[]
[]
[]
[]
[]
[]
[]
[]
[]
[]
[]
[]
[]
[]
[]
[]
[]
[]
[]
[]
[]
[]
[]
[]
[]
[]
[]
[]
[]
[]
[]
[]
[]
[]
[]
[]
[]
[]
[]
[]
[]
[]
[]
[]
[]
[]
[]
[]
[]
[]
[]
[]
[]
[]
[]
[]
[]
[]
[]
[]
[]
[]
[]
[]
[]
[]
[]
[]
[]
[]
[]
[]
[]
[]
[]
[]
[]
[]
[]
[]
[]
[]
[]
[]
[]
[]
[]
[]
[]
[]
[]
[]
[]
[]
[]
[]
[]
[]
[]
[]
[]
[]
[]
[]
[]
[]
[]
[]
[]
[]
[]
[]
[]
[]
[]
[]
[]
[]
[]
[]
[]
[]
[]
[]
[]
[]
[]
[]
[]
[]
[]
[]
[]
[]
[]
[]
[]
[]
[]
[]
[]
[]
[]
[]
[]
[]
[]
[]
[]
[]
[]
[]
[]
[]
[]
[]
[]
[]
[]
[]
[]
[]
[]
[]
[]
[]
[]
[]
[]
[]
[]
[]
[]
[]
[]
[]
[]
[]
[]
[]
[]
[]
[]
[]
[]
[]
[]
[]
[]
[]
[]
[]
[]
[]
[]
[]
[]
[]
[]
[]
[]
[]
[]
[]
[]
[]
[]
[]
[]
[]
[]
[]
[]
[]
[]
[]
[]
[]
[]
[]
[]
[]
[]
[]
[]
[]
[]
[]
[]
[]
[]
[]
[]
[]
[]
[]
[]
[]
[]
[]
[]
[]
[]
[]
[]
[]
[]
[]
[]
[]
[]
[]
[]
[]
[]
[]
[]
[]
[]
[]
[]
[]
[]
[]
[]
[]
[]
[]
[]
[]
[]
[]
[]
[]
[]
[]
[]
[]
[]
[]
[]
[]
[]
[]
[]
[]
[]
[]
[]
[]
[]
[]
[]
[]
[]
[]
[]
[]
[]
[]
[]
[]
[]
[]
[]
[]
[]
[]
[]
[]
[]
[]
[]
[]
[]
[]
[]
[]
[]
[]
[]
[]
[]
[]
[]
[]
[]
[]
[]
[]
[]
[]
[]
[]
[]
[]
[]
[]
[]
[]
[]
[]
[]
[]
[]
[]
[]
[]
[]
[]
[]
[]
[]
[]
[]
[]
[]
[]
[]
[]
[]
[]
[]
[]
[]
[]
[]
[]
[]
[]
[]
[]
[]
[]
[]
[]
[]
[]
[]
[]
[]
[]
[]
[]
[]
[]
[]
[]
[]
[]
[]
[]
[]
[]
[]
[]
[]
[]
[]
[]
[]
[]
[]
[]
[]
[]
[]
[]
[]
[]
[]
[]
[]
[]
[]
[]
[]
[]
[]
[]
[]
[]
[]
[]
[]
[]
[]
[]
[]
[]
[]
[]
[]
[]
[]
[]
[]
[]
[]
[]
[]
[]
[]
[]
[]
[]
[]
[]
[]
[]
[]
[]
[]
[]
[]
[]
[]
[]
[]
[]
[]
[]
[]
[]
[]
[]
[]
[]
[]
[]
[]
[]
[]
[]
[]
[]
[]
[]
[]
[]
[]
[]
[]
[]
[]
[]
[]
[]
[]
[]
[]
[]
[]
[]
[]
[]
[]
[]
[]
[]
[]
[]
[]
[]
[]
[]
[]
[]
[]
[]
[]
[]
[]
[]
[]
[]
[]
[]
[]
[]
[]
[]
[]
[]
[]
[]
[]
[]
[]
[]
[]
[]
[]
[]
[]
[]
[]
[]
[]
[]
[]
[]
[]
[]
[]
[]
[]
[]
[]
[]
[]
[]
[]
[]
[]
[]
[]
[]
[]
[]
[]
[]
[]
[]
[]
[]
[]
[]
[]
[]
[]
[]
[]
[]
[]
[]
[]
[]
[]
[]
[]
[]
[]
[]
[]
[]
[]
[]
[]
[]
[]
[]
[]
[]
[]
[]
[]
[]
[]
[]
[]
[]
[]
[]
[]
[]
[]
[]
[]
[]
[]
[]
[]
[]
[]
[]
[]
[]
[]
[]
[]
[]
[]
[]
[]
[]
[]
[]
[]
[]
[]
[]
[]
[]
[]
[]
[]
[]
[]
[]
[]
[]
[]
[]
[]
[]
[]
[]
[]
[]
[]
[]
[]
[]
[]
[]
[]
[]
[]
[]
[]
[]
[]
[]
[]
[]
[]
[]
[]
[]
[]
[]
[]
[]
[]
[]
[]
[]
[]
[]
[]
[]
[]
[]
[]
[]
[]
[]
[]
[]
[]
[]
[]
[]
[]
[]
[]
[]
[]
[]
[]
[]
[]
[]
[]
[]
[]
[]
[]
[]
[]
[]
[]
[]
[]
[]
[]
[]
[]
[]
[]
[]
[]
[]
[]
[]
[]
[]
[]
[]
[]
[]
[]
[]
[]
[]
[]
[]
[]
[]
[]
[]
[]
[]
[]
[]
[]
[]
[]
[]
[]
[]
[]
[]
[]
[]
[]
[]
[]
[]
[]
[]
[]
[]
[]
[]
[]
[]
[]
[]
[]
[]
[]
[]
[]
[]
[]
[]
[]
[]
[]
[]
[]
[]
[]
[]
[]
[]
[]
[]
[]
[]
[]
[]
[]
[]
[]
[]
[]
[]
[]
[]
[]
[]
[]
[]
[]
[]
[]
[]
[]
[]
[]
[]
[]
[]
[]
[]
[]
[]
[]
[]
[]
[]
[]
[]
[]
[]
[]
[]
[]
[]
[]
[]
[]
[]
[]
[]
[]
[]
[]
[]
[]
[]
[]
[]
[]
[]
[]
[]
[]
[]
[]
[]
[]
[]
[]
[]
[]
[]
[]
[]
[]
[]
[]
[]
[]
[]
[]
[]
[]
[]
[]
[]
[]
[]
[]
[]
[]
[]
[]
[]
[]
[]
[]
[]
[]
[]
[]
[]
[]
[]
[]
[]
[]
[]
[]
[]
[]
[]
[]
[]
[]
[]
[]
[]
[]
[]
[]
[]
[]
[]
[]
[]
[]
[]
[]
[]
[]
[]
[]
[]
[]
[]
[]
[]
[]
[]
[]
[]
[]
[]
[]
[]
[]
[]
[]
[]
[]
[]
[]
[]
[]
[]
[]
[]
[]
[]
[]
[]
[]
[]
[]
[]
[]
[]
[]
[]
[]
[]
[]
[]
[]
[]
[]
[]
[]
[]
[]
[]
[]
[]
[]
[]
[]
[]
[]
[]
[]
[]
[]
[]
[]
[]
[]
[]
[]
[]
[]
[]
[]
[]
[]
[]
[]
[]
[]
[]
[]
[]
[]
[]
[]
[]
[]
[]
[]
[]
[]
[]
[]
[]
[]
[]
[]
[]
[]
[]
[]
[]
[]
[]
[]
[]
[]
[]
[]
[]
[]
[]
[]
[]
[]
[]
[]
[]
[]
[]
[]
[]
[]
[]
[]
[]
[]
[]
[]
[]
[]
[]
[]
[]
[]
[]
[]
[]
[]
[]
[]
[]
[]
[]
[]
[]
[]
[]
[]
[]
[]
[]
[]
[]
[]
[]
[]
[]
[]
[]
[]
[]
[]
[]
[]
[]
[]
[]
[]
[]
[]
[]
[]
[]
[]
[]
[]
[]
[]
[]
[]
[]
[]
[]
[]
[]
[]
[]
[]
[]
[]
[]
[]
[]
[]
[]
[]
[]
[]
[]
[]
[]
[]
[]
[]
[]
[]
[]
[]
[]
[]
[]
[]
[]
[]
[]
[]
[]
[]
[]
[]
[]
[]
[]
[]
[]
[]
[]
[]
[]
[]
[]
[]
[]
[]
[]
[]
[]
[]
[]
[]
[]
[]
[]
[]
[]
[]
[]
[]
[]
[]
[]
[]
[]
[]
[]
[]
[]
[]
[]
[]
[]
[]
[]
[]
[]
[]
[]
[]
[]
[]
[]
[]
[]
[]
[]
[]
[]
[]
[]
[]
[]
[]
[]
[]
[]
[]
[]
[]
[]
[]
[]
[]
[]
[]
[]
[]
[]
[]
[]
[]
[]
[]
[]
[]
[]
[]
[]
[]
[]
[]
[]
[]
[]
[]
[]
[]
[]
[]
[]
[]
[]
[]
[]
[]
[]
[]
[]
[]
[]
[]
[]
[]
[]
[]
[]
[]
[]
[]
[]
[]
[]
[]
[]
[]
[]
[]
[]
[]
[]
[]
[]
[]
[]
[]
[]
[]
[]
[]
[]
[]
[]
[]
[]
[]
[]
[]
[]
[]
[]
[]
[]
[]
[]
[]
[]
[]
[]
[]
[]
[]
[]
[]
[]
[]
[]
[]
[]
[]
[]
[]
[]
[]
[]
[]
[]
[]
[]
[]
[]
[]
[]
[]
[]
[]
[]
[]
[]
[]
[]
[]
[]
[]
[]
[]
[]
[]
[]
[]
[]
[]
[]
[]
[]
[]
[]
[]
[]
[]
[]
[]
[]
[]
[]
[]
[]
[]
[]
[]
[]
[]
[]
[]
[]
[]
[]
[]
[]
[]
[]
[]
[]
[]
[]
[]
[]
[]
[]
[]
[]
[]
[]
[]
[]
[]
[]
[]
[]
[]
[]
[]
[]
[]
[]
[]
[]
[]
[]
[]
[]
[]
[]
[]
[]
[]
[]
[]
[]
[]
[]
[]
[]
[]
[]
[]
[]
[]
[]
[]
[]
[]
[]
[]
[]
[]
[]
[]
[]
[]
[]
[]
[]
[]
[]
[]
[]
[]
[]
[]
[]
[]
[]
[]
[]
[]
[]
[]
[]
[]
[]
[]
[]
[]
[]
[]
[]
[]
[]
[]
[]
[]
[]
[]
[]
[]
[]
[]
[]
[]
[]
[]
[]
[]
[]
[]
[]
[]
[]
[]
[]
[]
[]
[]
[]
[]
[]
[]
[]
[]
[]
[]
[]
[]
[]
[]
[]
[]
[]
[]
[]
[]
[]
[]
[]
[]
[]
[]
[]
[]
[]
[]
[]
[]
[]
[]
[]
[]
[]
[]
[]
[]
[]
[]
[]
[]
[]
[]
[]
[]
[]
[]
[]
[]
[]
[]
[]
[]
[]
[]
[]
[]
[]
[]
[]
[]
[]
[]
[]
[]
[]
[]
[]
[]
[]
[]
[]
[]
[]
[]
[]
[]
[]
[]
[]
[]
[]
[]
[]
[]
[]
[]
[]
[]
[]
[]
[]
[]
[]
[]
[]
[]
[]
[]
[]
[]
[]
[]
[]
[]
[]
[]
[]
[]
[]
[]
[]
[]
[]
[]
[]
[]
[]
[]
[]
[]
[]
[]
[]
[]
[]
[]
[]
[]
[]
[]
[]
[]
[]
[]
[]
[]
[]
[]
[]
[]
[]
[]
[]
[]
[]
[]
[]
[]
[]
[]
[]
[]
[]
[]
[]
[]
[]
[]
[]
[]
[]
[]
[]
[]
[]
[]
[]
[]
[]
[]
[]
[]
[]
[]
[]
[]
[]
[]
[]
[]
[]
[]
[]
[]
[]
[]
[]
[]
[]
[]
[]
[]
[]
[]
[]
[]
[]
[]
[]
[]
[]
[]
[]
[]
[]
[]
[]
[]
[]
[]
[]
[]
[]
[]
[]
[]
[]
[]
[]
[]
[]
[]
[]
[]
[]
[]
[]
[]
[]
[]
[]
[]
[]
[]
[]
[]
[]
[]
[]
[]
[]
[]
[]
[]
[]
[]
[]
[]
[]
[]
[]
[]
[]
[]
[]
[]
[]
[]
[]
[]
[]
[]
[]
[]
[]
[]
[]
[]
[]
[]
[]
[]
[]
[]
[]
[]
[]
[]
[]
[]
[]
[]
[]
[]
[]
[]
[]
[]
[]
[]
[]
[]
[]
[]
[]
[]
[]
[]
[]
[]
[]
[]
[]
[]
[]
[]
[]
[]
[]
[]
[]
[]
[]
[]
[]
[]
[]
[]
[]
[]
[]
[]
[]
[]
[]
[]
[]
[]
[]
[]
[]
[]
[]
[]
[]
[]
[]
[]
[]
[]
[]
[]
[]
[]
[]
[]
[]
[]
[]
[]
[]
[]
[]
[]
[]
[]
[]
[]
[]
[]
[]
[]
[]
[]
[]
[]
[]
[]
[]
[]
[]
[]
[]
[]
[]
[]
[]
[]
[]
[]
[]
[]
[]
[]
[]
[]
[]
[]
[]
[]
[]
[]
[]
[]
[]
[]
[]
[]
[]
[]
[]
[]
[]
[]
[]
[]
[]
[]
[]
[]
[]
[]
[]
[]
[]
[]
[]
[]
[]
[]
[]
[]
[]
[]
[]
[]
[]
[]
[]
[]
[]
[]
[]
[]
[]
[]
[]
[]
[]
[]
[]
[]
[]
[]
[]
[]
[]
[]
[]
[]
[]
[]
[]
[]
[]
[]
[]
[]
[]
[]
[]
[]
[]
[]
[]
[]
[]
[]
[]
[]
[]
[]
[]
[]
[]
[]
[]
[]
[]
[]
[]
[]
[]
[]
[]
[]
[]
[]
[]
[]
[]
[]
[]
[]
[]
[]
[]
[]
[]
[]
[]
[]
[]
[]
[]
[]
[]
[]
[]
[]
[]
[]
[]
[]
[]
[]
[]
[]
[]
[]
[]
[]
[]
[]
[]
[]
[]
[]
[]
[]
[]
[]
[]
[]
[]
[]
[]
[]
[]
[]
[]
[]
[]
[]
[]
[]
[]
[]
[]
[]
[]
[]
[]
[]
[]
[]
[]
[]
[]
[]
[]
[]
[]
[]
[]
[]
[]
[]
[]
[]
[]
[]
[]
[]
[]
[]
[]
[]
[]
[]
[]
[]
[]
[]
[]
[]
[]
[]
[]
[]
[]
[]
[]
[]
[]
[]
[]
[]
[]
[]
[]
[]
[]
[]
[]
[]
[]
[]
[]
[]
[]
[]
[]
[]
[]
[]
[]
[]
[]
[]
[]
[]
[]
[]
[]
[]
[]
[]
[]
[]
[]
[]
[]
[]
[]
[]
[]
[]
[]
[]
[]
[]
[]
[]
[]
[]
[]
[]
[]
[]
[]
[]
[]
[]
[]
[]
[]
[]
[]
[]
[]
[]
[]
[]
[]
[]
[]
[]
[]
[]
[]
[]
[]
[]
[]
[]
[]
[]
[]
[]
[]
[]
[]
[]
[]
[]
[]
[]
[]
[]
[]
[]
[]
[]
[]
[]
[]
[]
[]
[]
[]
[]
[]
[]
[]
[]
[]
[]
[]
[]
[]
[]
[]
[]
[]
[]
[]
[]
[]
[]
[]
[]
[]
[]
[]
[]
[]
[]
[]
[]
[]
[]
[]
[]
[]
[]
[]
[]
[]
[]
[]
[]
[]
[]
[]
[]
[]
[]
[]
[]
[]
[]
[]
[]
[]
[]
[]
[]
[]
[]
[]
[]
[]
[]
[]
[]
[]
[]
[]
[]
[]
[]
[]
[]
[]
[]
[]
[]
[]
[]
[]
[]
[]
[]
[]
[]
[]
[]
[]
[]
[]
[]
[]
[]
[]
[]
[]
[]
[]
[]
[]
[]
[]
[]
[]
[]
[]
[]
[]
[]
[]
[]
[]
[]
[]
[]
[]
[]
[]
[]
[]
[]
[]
[]
[]
[]
[]
[]
[]
[]
[]
[]
[]
[]
[]
[]
[]
[]
[]
[]
[]
[]
[]
[]
[]
[]
[]
[]
[]
[]
[]
[]
[]
[]
[]
[]
[]
[]
[]
[]
[]
[]
[]
[]
[]
[]
[]
[]
[]
[]
[]
[]
[]
[]
[]
[]
[]
[]
[]
[]
[]
[]
[]
[]
[]
[]
[]
[]
[]
[]
[]
[]
[]
[]
[]
[]
[]
[]
[]
[]
[]
[]
[]
[]
[]
[]
[]
[]
[]
[]
[]
[]
[]
[]
[]
[]
[]
[]
[]
[]
[]
[]
[]
[]
[]
[]
[]
[]
[]
[]
[]
[]
[]
[]
[]
[]
[]
[]
[]
[]
[]
[]
[]
[]
[]
[]
[]
[]
[]
[]
[]
[]
[]
[]
[]
[]
[]
[]
[]
[]
[]
[]
[]
[]
[]
[]
[]
[]
[]
[]
[]
[]
[]
[]
[]
[]
[]
[]
[]
[]
[]
[]
[]
[]
[]
[]
[]
[]
[]
[]
[]
[]
[]
[]
[]
[]
[]
[]
[]
[]
[]
[]
[]
[]
[]
[]
[]
[]
[]
[]
[]
[]
[]
[]
[]
[]
[]
[]
[]
[]
[]
[]
[]
[]
[]
[]
[]
[]
[]
[]
[]
[]
[]
[]
[]
[]
[]
[]
[]
[]
[]
[]
[]
[]
[]
[]
[]
[]
[]
[]
[]
[]
[]
[]
[]
[]
[]
[]
[]
[]
[]
[]
[]
[]
[]
[]
[]
[]
[]
[]
[]
[]
[]
[]
[]
[]
[]
[]
[]
[]
[]
[]
[]
[]
[]
[]
[]
[]
[]
[]
[]
[]
[]
[]
[]
[]
[]
[]
[]
[]
[]
[]
[]
[]
[]
[]
[]
[]
[]
[]
[]
[]
[]
[]
[]
[]
[]
[]
[]
[]
[]
[]
[]
[]
[]
[]
[]
[]
[]
[]
[]
[]
[]
[]
[]
[]
[]
[]
[]
[]
[]
[]
[]
[]
[]
[]
[]
[]
[]
[]
[]
[]
[]
[]
[]
[]
[]
[]
[]
[]
[]
[]
[]
[]
[]
[]
[]
[]
[]
[]
[]
[]
[]
[]
[]
[]
[]
[]
[]
[]
[]
[]
[]
[]
[]
[]
[]
[]
[]
[]
[]
[]
[]
[]
[]
[]
[]
[]
[]
[]
[]
[]
[]
[]
[]
[]
[]
[]
[]
[]
[]
[]
[]
[]
[]
[]
[]
[]
[]
[]
[]
[]
[]
[]
[]
[]
[]
[]
[]
[]
[]
[]
[]
[]
[]
[]
[]
[]
[]
[]
[]
[]
[]
[]
[]
[]
[]
[]
[]
[]
[]
[]
[]
[]
[]
[]
[]
[]
[]
[]
[]
[]
[]
[]
[]
[]
[]
[]
[]
[]
[]
[]
[]
[]
[]
[]
[]
[]
[]
[]
[]
[]
[]
[]
[]
[]
[]
[]
[]
[]
[]
[]
[]
[]
[]
[]
[]
[]
[]
[]
[]
[]
[]
[]
[]
[]
[]
[]
[]
[]
[]
[]
[]
[]
[]
[]
[]
[]
[]
[]
[]
[]
[]
[]
[]
[]
[]
[]
[]
[]
[]
[]
[]
[]
[]
[]
[]
[]
[]
[]
[]
[]
[]
[]
[]
[]
[]
[]
[]
[]
[]
[]
[]
[]
[]
[]
[]
[]
[]
[]
[]
[]
[]
[]
[]
[]
[]
[]
[]
[]
[]
[]
[]
[]
[]
[]
[]
[]
[]
[]
[]
[]
[]
[]
[]
[]
[]
[]
[]
[]
[]
[]
[]
[]
[]
[]
[]
[]
[]
[]
[]
[]
[]
[]
[]
[]
[]
[]
[]
[]
[]
[]
[]
[]
[]
[]
[]
[]
[]
[]
[]
[]
[]
[]
[]
[]
[]
[]
[]
[]
[]
[]
[]
[]
[]
[]
[]
[]
[]
[]
[]
[]
[]
[]
[]
[]
[]
[]
[]
[]
[]
[]
[]
[]
[]
[]
[]
[]
[]
[]
[]
[]
[]
[]
[]
[]
[]
[]
[]
[]
[]
[]
[]
[]
[]
[]
[]
[]
[]
[]
[]
[]
[]
[]
[]
[]
[]
[]
[]
[]
[]
[]
[]
[]
[]
[]
[]
[]
[]
[]
[]
[]
[]
[]
[]
[]
[]
[]
[]
[]
[]
[]
[]
[]
[]
[]
[]
[]
[]
[]
[]
[]
[]
[]
[]
[]
[]
[]
[]
[]
[]
[]
[]
[]
[]
[]
[]
[]
[]
[]
[]
[]
[]
[]
[]
[]
[]
[]
[]
[]
[]
[]
[]
[]
[]
[]
[]
[]
[]
[]
[]
[]
[]
[]
[]
[]
[]
[]
[]
[]
[]
[]
[]
[]
[]
[]
[]
[]
[]
[]
[]
[]
[]
[]
[]
[]
[]
[]
[]
[]
[]
[]
[]
[]
[]
[]
[]
[]
[]
[]
[]
[]
[]
[]
[]
[]
[]
[]
[]
[]
[]
[]
[]
[]
[]
[]
[]
[]
[]
[]
[]
[]
[]
[]
[]
[]
[]
[]
[]
[]
[]
[]
[]
[]
[]
[]
[]
[]
[]
[]
[]
[]
[]
[]
[]
[]
[]
[]
[]
[]
[]
[]
[]
[]
[]
[]
[]
[]
[]
[]
[]
[]
[]
[]
[]
[]
[]
[]
[]
[]
[]
[]
[]
[]
[]
[]
[]
[]
[]
[]
[]
[]
[]
[]
[]
[]
[]
[]
[]
[]
[]
[]
[]
[]
[]
[]
[]
[]
[]
[]
[]
[]
[]
[]
[]
[]
[]
[]
[]
[]
[]
[]
[]
[]
[]
[]
[]
[]
[]
[]
[]
[]
[]
[]
[]
[]
[]
[]
[]
[]
[]
[]
[]
[]
[]
[]
[]
[]
[]
[]
[]
[]
[]
[]
[]
[]
[]
[]
[]
[]
[]
[]
[]
[]
[]
[]
[]
[]
[]
[]
[]
[]
[]
[]
[]
[]
[]
[]
[]
[]
[]
[]
[]
[]
[]
[]
[]
[]
[]
[]
[]
[]
[]
[]
[]
[]
[]
[]
[]
[]
[]
[]
[]
[]
[]
[]
[]
[]
[]
[]
[]
[]
[]
[]
[]
[]
[]
[]
[]
[]
[]
[]
[]
[]
[]
[]
[]
[]
[]
[]
[]
[]
[]
[]
[]
[]
[]
[]
[]
[]
[]
[]
[]
[]
[]
[]
[]
[]
[]
[]
[]
[]
[]
[]
[]
[]
[]
[]
[]
[]
[]
[]
[]
[]
[]
[]
[]
[]
[]
[]
[]
[]
[]
[]
[]
[]
[]
[]
[]
[]
[]
[]
[]
[]
[]
[]
[]
[]
[]
[]
[]
[]
[]
[]
[]
[]
[]
[]
[]
[]
[]
[]
[]
[]
[]
[]
[]
[]
[]
[]
[]
[]
[]
[]
[]
[]
[]
[]
[]
[]
[]
[]
[]
[]
[]
[]
[]
[]
[]
[]
[]
[]
[]
[]
[]
[]
[]
[]
[]
[]
[]
[]
[]
[]
[]
[]
[]
[]
[]
[]
[]
[]
[]
[]
[]
[]
[]
[]
[]
[]
[]
[]
[]
[]
[]
[]
[]
[]
[]
[]
[]
[]
[]
[]
[]
[]
[]
[]
[]
[]
[]
[]
[]
[]
[]
[]
[]
[]
[]
[]
[]
[]
[]
[]
[]
[]
[]
[]
[]
[]
[]
[]
[]
[]
[]
[]
[]
[]
[]
[]
[]
[]
[]
[]
[]
[]
[]
[]
[]
[]
[]
[]
[]
[]
[]
[]
[]
[]
[]
[]
[]
[]
[]
[]
[]
[]
[]
[]
[]
[]
[]
[]
[]
[]
[]
[]
[]
[]
[]
[]
[]
[]
[]
[]
[]
[]
[]
[]
[]
[]
[]
[]
[]
[]
[]
[]
[]
[]
[]
[]
[]
[]
[]
[]
[]
[]
[]
[]
[]
[]
[]
[]
[]
[]
[]
[]
[]
[]
[]
[]
[]
[]
[]
[]
[]
[]
[]
[]
[]
[]
[]
[]
[]
[]
[]
[]
[]
[]
[]
[]
[]
[]
[]
[]
[]
[]
[]
[]
[]
[]
[]
[]
[]
[]
[]
[]
[]
[]
[]
[]
[]
[]
[]
[]
[]
[]
[]
[]
[]
[]
[]
[]
[]
[]
[]
[]
[]
[]
[]
[]
[]
[]
[]
[]
[]
[]
[]
[]
[]
[]
[]
[]
[]
[]
[]
[]
[]
[]
[]
[]
[]
[]
[]
[]
[]
[]
[]
[]
[]
[]
[]
[]
[]
[]
[]
[]
[]
[]
[]
[]
[]
[]
[]
[]
[]
[]
[]
[]
[]
[]
[]
[]
[]
[]
[]
[]
[]
[]
[]
[]
[]
[]
[]
[]
[]
[]
[]
[]
[]
[]
[]
[]
[]
[]
[]
[]
[]
[]
[]
[]
[]
[]
[]
[]
[]
[]
[]
[]
[]
[]
[]
[]
[]
[]
[]
[]
[]
[]
[]
[]
[]
[]
[]
[]
[]
[]
[]
[]
[]
[]
[]
[]
[]
[]
[]
[]
[]
[]
[]
[]
[]
[]
[]
[]
[]
[]
[]
[]
[]
[]
[]
[]
[]
[]
[]
[]
[]
[]
[]
[]
[]
[]
[]
[]
[]
[]
[]
[]
[]
[]
[]
[]
[]
[]
[]
[]
[]
[]
[]
[]
[]
[]
[]
[]
[]
[]
[]
[]
[]
[]
[]
[]
[]
[]
[]
[]
[]
[]
[]
[]
[]
[]
[]
[]
[]
[]
[]
[]
[]
[]
[]
[]
[]
[]
[]
[]
[]
[]
[]
[]
[]
[]
[]
[]
[]
[]
[]
[]
[]
[]
[]
[]
[]
[]
[]
[]
[]
[]
[]
[]
[]
[]
[]
[]
[]
[]
[]
[]
[]
[]
[]
[]
[]
[]
[]
[]
[]
[]
[]
[]
[]
[]
[]
[]
[]
[]
[]
[]
[]
[]
[]
[]
[]
[]
[]
[]
[]
[]
[]
[]
[]
[]
[]
[]
[]
[]
[]
[]
[]
[]
[]
[]
[]
[]
[]
[]
[]
[]
[]
[]
[]
[]
[]
[]
[]
[]
[]
[]
[]
[]
[]
[]
[]
[]
[]
[]
[]
[]
[]
[]
[]
[]
[]
[]
[]
[]
[]
[]
[]
[]
[]
[]
[]
[]
[]
[]
[]
[]
[]
[]
[]
[]
[]
[]
[]
[]
[]
[]
[]
[]
[]
[]
[]
[]
[]
[]
[]
[]
[]
[]
[]
[]
[]
[]
[]
[]
[]
[]
[]
[]
[]
[]
[]
[]
[]
[]
[]
[]
[]
[]
[]
[]
[]
[]
[]
[]
[]
[]
[]
[]
[]
[]
[]
[]
[]
[]
[]
[]
[]
[]
[]
[]
[]
[]
[]
[]
[]
[]
[]
[]
[]
[]
[]
[]
[]
[]
[]
[]
[]
[]
[]
[]
[]
[]
[]
[]
[]
[]
[]
[]
[]
[]
[]
[]
[]
[]
[]
[]
[]
[]
[]
[]
[]
[]
[]
[]
[]
[]
[]
[]
[]
[]
[]
[]
[]
[]
[]
[]
[]
[]
[]
[]
[]
[]
[]
[]
[]
[]
[]
[]
[]
[]
[]
[]
[]
[]
[]
[]
[]
[]
[]
[]
[]
[]
[]
[]
[]
[]
[]
[]
[]
[]
[]
[]
[]
[]
[]
[]
[]
[]
[]
[]
[]
[]
[]
[]
[]
[]
[]
[]
[]
[]
[]
[]
[]
[]
[]
[]
[]
[]
[]
[]
[]
[]
[]
[]
[]
[]
[]
[]
[]
[]
[]
[]
[]
[]
[]
[]
[]
[]
[]
[]
[]
[]
[]
[]
[]
[]
[]
[]
[]
[]
[]
[]
[]
[]
[]
[]
[]
[]
[]
[]
[]
[]
[]
[]
[]
[]
[]
[]
[]
[]
[]
[]
[]
[]
[]
[]
[]
[]
[]
[]
[]
[]
[]
[]
[]
[]
[]
[]
[]
[]
[]
[]
[]
[]
[]
[]
[]
[]
[]
[]
[]
[]
[]
[]
[]
[]
[]
[]
[]
[]
[]
[]
[]
[]
[]
[]
[]
[]
[]
[]
[]
[]
[]
[]
[]
[]
[]
[]
[]
[]
[]
[]
[]
[]
[]
[]
[]
[]
[]
[]
[]
[]
[]
[]
[]
[]
[]
[]
[]
[]
[]
[]
[]
[]
[]
[]
[]
[]
[]
[]
[]
[]
[]
[]
[]
[]
[]
[]
[]
[]
[]
[]
[]
[]
[]
[]
[]
[]
[]
[]
[]
[]
[]
[]
[]
[]
[]
[]
[]
[]
[]
[]
[]
[]
[]
[]
[]
[]
[]
[]
[]
[]
[]
[]
[]
[]
[]
[]
[]
[]
[]
[]
[]
[]
[]
[]
[]
[]
[]
[]
[]
[]
[]
[]
[]
[]
[]
[]
[]
[]
[]
[]
[]
[]
[]
[]
[]
[]
[]
[]
[]
[]
[]
[]
[]
[]
[]
[]
[]
[]
[]
[]
[]
[]
[]
[]
[]
[]
[]
[]
[]
[]
[]
[]
[]
[]
[]
[]
[]
[]
[]
[]
[]
[]
[]
[]
[]
[]
[]
[]
[]
[]
[]
[]
[]
[]
[]
[]
[]
[]
[]
[]
[]
[]
[]
[]
[]
[]
[]
[]
[]
[]
[]
[]
[]
[]
[]
[]
[]
[]
[]
[]
[]
[]
[]
[]
[]
[]
[]
[]
[]
[]
[]
[]
[]
[]
[]
[]
[]
[]
[]
[]
[]
[]
[]
[]
[]
[]
[]
[]
[]
[]
[]
[]
[]
[]
[]
[]
[]
[]
[]
[]
[]
[]
[]
[]
[]
[]
[]
[]
[]
[]
[]
[]
[]
[]
[]
[]
[]
[]
[]
[]
[]
[]
[]
[]
[]
[]
[]
[]
[]
[]
[]
[]
[]
[]
[]
[]
[]
[]
[]
[]
[]
[]
[]
[]
[]
[]
[]
[]
[]
[]
[]
[]
[]
[]
[]
[]
[]
[]
[]
[]
[]
[]
[]
[]
[]
[]
[]
[]
[]
[]
[]
[]
[]
[]
[]
[]
[]
[]
[]
[]
[]
[]
[]
[]
[]
[]
[]
[]
[]
[]
[]
[]
[]
[]
[]
[]
[]
[]
[]
[]
[]
[]
[]
[]
[]
[]
[]
[]
[]
[]
[]
[]
[]
[]
[]
[]
[]
[]
[]
[]
[]
[]
[]
[]
[]
[]
[]
[]
[]
[]
[]
[]
[]
[]
[]
[]
[]
[]
[]
[]
[]
[]
[]
[]
[]
[]
[]
[]
[]
[]
[]
[]
[]
[]
[]
[]
[]
[]
[]
[]
[]
[]
[]
[]
[]
[]
[]
[]
[]
[]
[]
[]
[]
[]
[]
[]
[]
[]
[]
[]
[]
[]
[]
[]
[]
[]
[]
[]
[]
[]
[]
[]
[]
[]
[]
[]
[]
[]
[]
[]
[]
[]
[]
[]
[]
[]
[]
[]
[]
[]
[]
[]
[]
[]
[]
[]
[]
[]
[]
[]
[]
[]
[]
[]
[]
[]
[]
[]
[]
[]
[]
[]
[]
[]
[]
[]
[]
[]
[]
[]
[]
[]
[]
[]
[]
[]
[]
[]
[]
[]
[]
[]
[]
[]
[]
[]
[]
[]
[]
[]
[]
[]
[]
[]
[]
[]
[]
[]
[]
[]
[]
[]
[]
[]
[]
[]
[]
[]
[]
[]
[]
[]
[]
[]
[]
[]
[]
[]
[]
[]
[]
[]
[]
[]
[]
[]
[]
[]
[]
[]
[]
[]
[]
[]
[]
[]
[]
[]
[]
[]
[]
[]
[]
[]
[]
[]
[]
[]
[]
[]
[]
[]
[]
[]
[]
[]
[]
[]
[]
[]
[]
[]
[]
[]
[]
[]
[]
[]
[]
[]
[]
[]
[]
[]
[]
[]
[]
[]
[]
[]
[]
[]
[]
[]
[]
[]
[]
[]
[]
[]
[]
[]
[]
[]
[]
[]
[]
[]
[]
[]
[]
[]
[]
[]
[]
[]
[]
[]
[]
[]
[]
[]
[]
[]
[]
[]
[]
[]
[]
[]
[]
[]
[]
[]
[]
[]
[]
[]
[]
[]
[]
[]
[]
[]
[]
[]
[]
[]
[]
[]
[]
[]
[]
[]
[]
[]
[]
[]
[]
[]
[]
[]
[]
[]
[]
[]
[]
[]
[]
[]
[]
[]
[]
[]
[]
[]
[]
[]
[]
[]
[]
[]
[]
[]
[]
[]
[]
[]
[]
[]
[]
[]
[]
[]
[]
[]
[]
[]
[]
[]
[]
[]
[]
[]
[]
[]
[]
[]
[]
[]
[]
[]
[]
[]
[]
[]
[]
[]
[]
[]
[]
[]
[]
[]
[]
[]
[]
[]
[]
[]
[]
[]
[]
[]
[]
[]
[]
[]
[]
[]
[]
[]
[]
[]
[]
[]
[]
[]
[]
[]
[]
[]
[]
[]
[]
[]
[]
[]
[]
[]
[]
[]
[]
[]
[]
[]
[]
[]
[]
[]
[]
[]
[]
[]
[]
[]
[]
[]
[]
[]
[]
[]
[]
[]
[]
[]
[]
[]
[]
[]
[]
[]
[]
[]
[]
[]
[]
[]
[]
[]
[]
[]
[]
[]
[]
[]
[]
[]
[]
[]
[]
[]
[]
[]
[]
[]
[]
[]
[]
[]
[]
[]
[]
[]
[]
[]
[]
[]
[]
[]
[]
[]
[]
[]
[]
[]
[]
[]
[]
[]
[]
[]
[]
[]
[]
[]
[]
[]
[]
[]
[]
[]
[]
[]
[]
[]
[]
[]
[]
[]
[]
[]
[]
[]
[]
[]
[]
[]
[]
[]
[]
[]
[]
[]
[]
[]
[]
[]
[]
[]
[]
[]
[]
[]
[]
[]
[]
[]
[]
[]
[]
[]
[]
[]
[]
[]
[]
[]
[]
[]
[]
[]
[]
[]
[]
[]
[]
[]
[]
[]
[]
[]
[]
[]
[]
[]
[]
[]
[]
[]
[]
[]
[]
[]
[]
[]
[]
[]
[]
[]
[]
[]
[]
[]
[]
[]
[]
[]
[]
[]
[]
[]
[]
[]
[]
[]
[]
[]
[]
[]
[]
[]
[]
[]
[]
[]
[]
[]
[]
[]
[]
[]
[]
[]
[]
[]
[]
[]
[]
[]
[]
[]
[]
[]
[]
[]
[]
[]
[]
[]
[]
[]
[]
[]
[]
[]
[]
[]
[]
[]
[]
[]
[]
[]
[]
[]
[]
[]
[]
[]
[]
[]
[]
[]
[]
[]
[]
[]
[]
[]
[]
[]
[]
[]
[]
[]
[]
[]
[]
[]
[]
[]
[]
[]
[]
[]
[]
[]
[]
[]
[]
[]
[]
[]
[]
[]
[]
[]
[]
[]
[]
[]
[]
[]
[]
[]
[]
[]
[]
[]
[]
[]
[]
[]
[]
[]
[]
[]
[]
[]
[]
[]
[]
[]
[]
[]
[]
[]
[]
[]
[]
[]
[]
[]
[]
[]
[]
[]
[]
[]
[]
[]
[]
[]
[]
[]
[]
[]
[]
[]
[]
[]
[]
[]
[]
[]
[]
[]
[]
[]
[]
[]
[]
[]
[]
[]
[]
[]
[]
[]
[]
[]
[]
[]
[]
[]
[]
[]
[]
[]
[]
[]
[]
[]
[]
[]
[]
[]
[]
[]
[]
[]
[]
[]
[]
[]
[]
[]
[]
[]
[]
[]
[]
[]
[]
[]
[]
[]
[]
[]
[]
[]
[]
[]
[]
[]
[]
[]
[]
[]
[]
[]
[]
[]
[]
[]
[]
[]
[]
[]
[]
[]
[]
[]
[]
[]
[]
[]
[]
[]
[]
[]
[]
[]
[]
[]
[]
[]
[]
[]
[]
[]
[]
[]
[]
[]
[]
[]
[]
[]
[]
[]
[]
[]
[]
[]
[]
[]
[]
[]
[]
[]
[]
[]
[]
[]
[]
[]
[]
[]
[]
[]
[]
[]
[]
[]
[]
[]
[]
[]
[]
[]
[]
[]
[]
[]
[]
[]
[]
[]
[]
[]
[]
[]
[]
[]
[]
[]
[]
[]
[]
[]
[]
[]
[]
[]
[]
[]
[]
[]
[]
[]
[]
[]
[]
[]
[]
[]
[]
[]
[]
[]
[]
[]
[]
[]
[]
[]
[]
[]
[]
[]
[]
[]
[]
[]
[]
[]
[]
[]
[]
[]
[]
[]
[]
[]
[]
[]
[]
[]
[]
[]
[]
[]
[]
[]
[]
[]
[]
[]
[]
[]
[]
[]
[]
[]
[]
[]
[]
[]
[]
[]
[]
[]
[]
[]
[]
[]
[]
[]
[]
[]
[]
[]
[]
[]
[]
[]
[]
[]
[]
[]
[]
[]
[]
[]
[]
[]
[]
[]
[]
[]
[]
[]
[]
[]
[]
[]
[]
[]
[]
[]
[]
[]
[]
[]
[]
[]
[]
[]
[]
[]
[]
[]
[]
[]
[]
[]
[]
[]
[]
[]
[]
[]
[]
[]
[]
[]
[]
[]
[]
[]
[]
[]
[]
[]
[]
[]
[]
[]
[]
[]
[]
[]
[]
[]
[]
[]
[]
[]
[]
[]
[]
[]
[]
[]
[]
[]
[]
[]
[]
[]
[]
[]
[]
[]
[]
[]
[]
[]
[]
[]
[]
[]
[]
[]
[]
[]
[]
[]
[]
[]
[]
[]
[]
[]
[]
[]
[]
[]
[]
[]
[]
[]
[]
[]
[]
[]
[]
[]
[]
[]
[]
[]
[]
[]
[]
[]
[]
[]
[]
[]
[]
[]
[]
[]
[]
[]
[]
[]
[]
[]
[]
[]
[]
[]
[]
[]
[]
[]
[]
[]
[]
[]
[]
[]
[]
[]
[]
[]
[]
[]
[]
[]
[]
[]
[]
[]
[]
[]
[]
[]
[]
[]
[]
[]
[]
[]
[]
[]
[]
[]
[]
[]
[]
[]
[]
[]
[]
[]
[]
[]
[]
[]
[]
[]
[]
[]
[]
[]
[]
[]
[]
[]
[]
[]
[]
[]
[]
[]
[]
[]
[]
[]
[]
[]
[]
[]
[]
[]
[]
[]
[]
[]
[]
[]
[]
[]
[]
[]
[]
[]
[]
[]
[]
[]
[]
[]
[]
[]
[]
[]
[]
[]
[]
[]
[]
[]
[]
[]
[]
[]
[]
[]
[]
[]
[]
[]
[]
[]
[]
[]
[]
[]
[]
[]
[]
[]
[]
[]
[]
[]
[]
[]
[]
[]
[]
[]
[]
[]
[]
[]
[]
[]
[]
[]
[]
[]
[]
[]
[]
[]
[]
[]
[]
[]
[]
[]
[]
[]
[]
[]
[]
[]
[]
[]
[]
[]
[]
[]
[]
[]
[]
[]
[]
[]
[]
[]
[]
[]
[]
[]
[]
[]
[]
[]
[]
[]
[]
[]
[]
[]
[]
[]
[]
[]
[]
[]
[]
[]
[]
[]
[]
[]
[]
[]
[]
[]
[]
[]
[]
[]
[]
[]
[]
[]
[]
[]
[]
[]
[]
[]
[]
[]
[]
[]
[]
[]
[]
[]
[]
[]
[]
[]
[]
[]
[]
[]
[]
[]
[]
[]
[]
[]
[]
[]
[]
[]
[]
[]
[]
[]
[]
[]
[]
[]
[]
[]
[]
[]
[]
[]
[]
[]
[]
[]
[]
[]
[]
[]
[]
[]
[]
[]
[]
[]
[]
[]
[]
[]
[]
[]
[]
[]
[]
[]
[]
[]
[]
[]
[]
[]
[]
[]
[]
[]
[]
[]
[]
[]
[]
[]
[]
[]
[]
[]
[]
[]
[]
[]
[]
[]
[]
[]
[]
[]
[]
[]
[]
[]
[]
[]
[]
[]
[]
[]
[]
[]
[]
[]
[]
[]
[]
[]
[]
[]
[]
[]
[]
[]
[]
[]
[]
[]
[]
[]
[]
[]
[]
[]
[]
[]
[]
[]
[]
[]
[]
[]
[]
[]
[]
[]
[]
[]
[]
[]
[]
[]
[]
[]
[]
[]
[]
[]
[]
[]
[]
[]
[]
[]
[]
[]
[]
[]
[]
[]
[]
[]
[]
[]
[]
[]
[]
[]
[]
[]
[]
[]
[]
[]
[]
[]
[]
[]
[]
[]
[]
[]
[]
[]
[]
[]
[]
[]
[]
[]
[]
[]
[]
[]
[]
[]
[]
[]
[]
[]
[]
[]
[]
[]
[]
[]
[]
[]
[]
[]
[]
[]
[]
[]
[]
[]
[]
[]
[]
[]
[]
[]
[]
[]
[]
[]
[]
[]
[]
[]
[]
[]
[]
[]
[]
[]
[]
[]
[]
[]
[]
[]
[]
[]
[]
[]
[]
[]
[]
[]
[]
[]
[]
[]
[]
[]
[]
[]
[]
[]
[]
[]
[]
[]
[]
[]
[]
[]
[]
[]
[]
[]
[]
[]
[]
[]
[]
[]
[]
[]
[]
[]
[]
[]
[]
[]
[]
[]
[]
[]
[]
[]
[]
[]
[]
[]
[]
[]
[]
[]
[]
[]
[]
[]
[]
[]
[]
[]
[]
[]
[]
[]
[]
[]
[]
[]
[]
[]
[]
[]
[]
[]
[]
[]
[]
[]
[]
[]
[]
[]
[]
[]
[]
[]
[]
[]
[]
[]
[]
[]
[]
[]
[]
[]
[]
[]
[]
[]
[]
[]
[]
[]
[]
[]
[]
[]
[]
[]
[]
[]
[]
[]
[]
[]
[]
[]
[]
[]
[]
[]
[]
[]
[]
[]
[]
[]
[]
[]
[]
[]
[]
[]
[]
[]
[]
[]
[]
[]
[]
[]
[]
[]
[]
[]
[]
[]
[]
[]
[]
[]
[]
[]
[]
[]
[]
[]
[]
[]
[]
[]
[]
[]
[]
[]
[]
[]
[]
[]
[]
[]
[]
[]
[]
[]
[]
[]
[]
[]
[]
[]
[]
[]
[]
[]
[]
[]
[]
[]
[]
[]
[]
[]
[]
[]
[]
[]
[]
[]
[]
[]
[]
[]
[]
[]
[]
[]
[]
[]
[]
[]
[]
[]
[]
[]
[]
[]
[]
[]
[]
[]
[]
[]
[]
[]
[]
[]
[]
[]
[]
[]
[]
[]
[]
[]
[]
[]
[]
[]
[]
[]
[]
[]
[]
[]
[]
[]
[]
[]
[]
[]
[]
[]
[]
[]
[]
[]
[]
[]
[]
[]
[]
[]
[]
[]
[]
[]
[]
[]
[]
[]
[]
[]
[]
[]
[]
[]
[]
[]
[]
[]
[]
[]
[]
[]
[]
[]
[]
[]
[]
[]
[]
[]
[]
[]
[]
[]
[]
[]
[]
[]
[]
[]
[]
[]
[]
[]
[]
[]
[]
[]
[]
[]
[]
[]
[]
[]
[]
[]
[]
[]
[]
[]
[]
[]
[]
[]
[]
[]
[]
[]
[]
[]
[]
[]
[]
[]
[]
[]
[]
[]
[]
[]
[]
[]
[]
[]
[]
[]
[]
[]
[]
[]
[]
[]
[]
[]
[]
[]
[]
[]
[]
[]
[]
[]
[]
[]
[]
[]
[]
[]
[]
[]
[]
[]
[]
[]
[]
[]
[]
[]
[]
[]
[]
[]
[]
[]
[]
[]
[]
[]
[]
[]
[]
[]
[]
[]
[]
[]
[]
[]
[]
[]
[]
[]
[]
[]
[]
[]
[]
[]
[]
[]
[]
[]
[]
[]
[]
[]
[]
[]
[]
[]
[]
[]
[]
[]
[]
[]
[]
[]
[]
[]
[]
[]
[]
[]
[]
[]
[]
[]
[]
[]
[]
[]
[]
[]
[]
[]
[]
[]
[]
[]
[]
[]
[]
[]
[]
[]
[]
[]
[]
[]
[]
[]
[]
[]
[]
[]
[]
[]
[]
[]
[]
[]
[]
[]
[]
[]
[]
[]
[]
[]
[]
[]
[]
[]
[]
[]
[]
[]
[]
[]
[]
[]
[]
[]
[]
[]
[]
[]
[]
[]
[]
[]
[]
[]
[]
[]
[]
[]
[]
[]
[]
[]
[]
[]
[]
[]
[]
[]
[]
[]
[]
[]
[]
[]
[]
[]
[]
[]
[]
[]
[]
[]
[]
[]
[]
[]
[]
[]
[]
[]
[]
[]
[]
[]
[]
[]
[]
[]
[]
[]
[]
[]
[]
[]
[]
[]
[]
[]
[]
[]
[]
[]
[]
[]
[]
[]
[]
[]
[]
[]
[]
[]
[]
[]
[]
[]
[]
[]
[]
[]
[]
[]
[]
[]
[]
[]
[]
[]
[]
[]
[]
[]
[]
[]
[]
[]
[]
[]
[]
[]
[]
[]
[]
[]
[]
[]
[]
[]
[]
[]
[]
[]
[]
[]
[]
[]
[]
[]
[]
[]
[]
[]
[]
[]
[]
[]
[]
[]
[]
[]
[]
[]
[]
[]
[]
[]
[]
[]
[]
[]
[]
[]
[]
[]
[]
[]
[]
[]
[]
[]
[]
[]
[]
[]
[]
[]
[]
[]
[]
[]
[]
[]
[]
[]
[]
[]
[]
[]
[]
[]
[]
[]
[]
[]
[]
[]
[]
[]
[]
[]
[]
[]
[]
[]
[]
[]
[]
[]
[]
[]
[]
[]
[]
[]
[]
[]
[]
[]
[]
[]
[]
[]
[]
[]
[]
[]
[]
[]
[]
[]
[]
[]
[]
[]
[]
[]
[]
[]
[]
[]
[]
[]
[]
[]
[]
[]
[]
[]
[]
[]
[]
[]
[]
[]
[]
[]
[]
[]
[]
[]
[]
[]
[]
[]
[]
[]
[]
[]
[]
[]
[]
[]
[]
[]
[]
[]
[]
[]
[]
[]
[]
[]
[]
[]
[]
[]
[]
[]
[]
[]
[]
[]
[]
[]
[]
[]
[]
[]
[]
[]
[]
[]
[]
[]
[]
[]
[]
[]
[]
[]
[]
[]
[]
[]
[]
[]
[]
[]
[]
[]
[]
[]
[]
[]
[]
[]
[]
[]
[]
[]
[]
[]
[]
[]
[]
[]
[]
[]
[]
[]
[]
[]
[]
[]
[]
[]
[]
[]
[]
[]
[]
[]
[]
[]
[]
[]
[]
[]
[]
[]
[]
[]
[]
[]
[]
[]
[]
[]
[]
[]
[]
[]
[]
[]
[]
[]
[]
[]
[]
[]
[]
[]
[]
[]
[]
[]
[]
[]
[]
[]
[]
[]
[]
[]
[]
[]
[]
[]
[]
[]
[]
[]
[]
[]
[]
[]
[]
[]
[]
[]
[]
[]
[]
[]
[]
[]
[]
[]
[]
[]
[]
[]
[]
[]
[]
[]
[]
[]
[]
[]
[]
[]
[]
[]
[]
[]
[]
[]
[]
[]
[]
[]
[]
[]
[]
[]
[]
[]
[]
[]
[]
[]
[]
[]
[]
[]
[]
[]
[]
[]
[]
[]
[]
[]
[]
[]
[]
[]
[]
[]
[]
[]
[]
[]
[]
[]
[]
[]
[]
[]
[]
[]
[]
[]
[]
[]
[]
[]
[]
[]
[]
[]
[]
[]
[]
[]
[]
[]
[]
[]
[]
[]
[]
[]
[]
[]
[]
[]
[]
[]
[]
[]
[]
[]
[]
[]
[]
[]
[]
[]
[]
[]
[]
[]
[]
[]
[]
[]
[]
[]
[]
[]
[]
[]
[]
[]
[]
[]
[]
[]
[]
[]
[]
[]
[]
[]
[]
[]
[]
[]
[]
[]
[]
[]
[]
[]
[]
[]
[]
[]
[]
[]
[]
[]
[]
[]
[]
[]
[]
[]
[]
[]
[]
[]
[]
[]
[]
[]
[]
[]
[]
[]
[]
[]
[]
[]
[]
[]
[]
[]
[]
[]
[]
[]
[]
[]
[]
[]
[]
[]
[]
[]
[]
[]
[]
[]
[]
[]
[]
[]
[]
[]
[]
[]
[]
[]
[]
[]
[]
[]
[]
[]
[]
[]
[]
[]
[]
[]
[]
[]
[]
[]
[]
[]
[]
[]
[]
[]
[]
[]
[]
[]
[]
[]
[]
[]
[]
[]
[]
[]
[]
[]
[]
[]
[]
[]
[]
[]
[]
[]
[]
[]
[]
[]
[]
[]
[]
[]
[]
[]
[]
[]
[]
[]
[]
[]
[]
[]
[]
[]
[]
[]
[]
[]
[]
[]
[]
[]
[]
[]
[]
[]
[]
[]
[]
[]
[]
[]
[]
[]
[]
[]
[]
[]
[]
[]
[]
[]
[]
[]
[]
[]
[]
[]
[]
[]
[]
[]
[]
[]
[]
[]
[]
[]
[]
[]
[]
[]
[]
[]
[]
[]
[]
[]
[]
[]
[]
[]
[]
[]
[]
[]
[]
[]
[]
[]
[]
[]
[]
[]
[]
[]
[]
[]
[]
[]
[]
[]
[]
[]
[]
[]
[]
[]
[]
[]
[]
[]
[]
[]
[]
[]
[]
[]
[]
[]
[]
[]
[]
[]
[]
[]
[]
[]
[]
[]
[]
[]
[]
[]
[]
[]
[]
[]
[]
[]
[]
[]
[]
[]
[]
[]
[]
[]
[]
[]
[]
[]
[]
[]
[]
[]
[]
[]
[]
[]
[]
[]
[]
[]
[]
[]
[]
[]
[]
[]
[]
[]
[]
[]
[]
[]
[]
[]
[]
[]
[]
[]
[]
[]
[]
[]
[]
[]
[]
[]
[]
[]
[]
[]
[]
[]
[]
[]
[]
[]
[]
[]
[]
[]
[]
[]
[]
[]
[]
[]
[]
[]
[]
[]
[]
[]
[]
[]
[]
[]
[]
[]
[]
[]
[]
[]
[]
[]
[]
[]
[]
[]
[]
[]
[]
[]
[]
[]
[]
[]
[]
[]
[]
[]
[]
[]
[]
[]
[]
[]
[]
[]
[]
[]
[]
[]
[]
[]
[]
[]
[]
[]
[]
[]
[]
[]
[]
[]
[]
[]
[]
[]
[]
[]
[]
[]
[]
[]
[]
[]
[]
[]
[]
[]
[]
[]
[]
[]
[]
[]
[]
[]
[]
[]
[]
[]
[]
[]
[]
[]
[]
[]
[]
[]
[]
[]
[]
[]
[]
[]
[]
[]
[]
[]
[]
[]
[]
[]
[]
[]
[]
[]
[]
[]
[]
[]
[]
[]
[]
[]
[]
[]
[]
[]
[]
[]
[]
[]
[]
[]
[]
[]
[]
[]
[]
[]
[]
[]
[]
[]
[]
[]
[]
[]
[]
[]
[]
[]
[]
[]
[]
[]
[]
[]
[]
[]
[]
[]
[]
[]
[]
[]
[]
[]
[]
[]
[]
[]
[]
[]
[]
[]
[]
[]
[]
[]
[]
[]
[]
[]
[]
[]
[]
[]
[]
[]
[]
[]
[]
[]
[]
[]
[]
[]
[]
[]
[]
[]
[]
[]
[]
[]
[]
[]
[]
[]
[]
[]
[]
[]
[]
[]
[]
[]
[]
[]
[]
[]
[]
[]
[]
[]
[]
[]
[]
[]
[]
[]
[]
[]
[]
[]
[]
[]
[]
[]
[]
[]
[]
[]
[]
[]
[]
[]
[]
[]
[]
[]
[]
[]
[]
[]
[]
[]
[]
[]
[]
[]
[]
[]
[]
[]
[]
[]
[]
[]
[]
[]
[]
[]
[]
[]
[]
[]
[]
[]
[]
[]
[]
[]
[]
[]
[]
[]
[]
[]
[]
[]
[]
[]
[]
[]
[]
[]
[]
[]
[]
[]
[]
[]
[]
[]
[]
[]
[]
[]
[]
[]
[]
[]
[]
[]
[]
[]
[]
[]
[]
[]
[]
[]
[]
[]
[]
[]
[]
[]
[]
[]
[]
[]
[]
[]
[]
[]
[]
[]
[]
[]
[]
[]
[]
[]
[]
[]
[]
[]
[]
[]
[]
[]
[]
[]
[]
[]
[]
[]
[]
[]
[]
[]
[]
[]
[]
[]
[]
[]
[]
[]
[]
[]
[]
[]
[]
[]
[]
[]
[]
[]
[]
[]
[]
[]
[]
[]
[]
[]
[]
[]
[]
[]
[]
[]
[]
[]
[]
[]
[]
[]
[]
[]
[]
[]
[]
[]
[]
[]
[]
[]
[]
[]
[]
[]
[]
[]
[]
[]
[]
[]
[]
[]
[]
[]
[]
[]
[]
[]
[]
[]
[]
[]
[]
[]
[]
[]
[]
[]
[]
[]
[]
[]
[]
[]
[]
[]
[]
[]
[]
[]
[]
[]
[]
[]
[]
[]
[]
[]
[]
[]
[]
[]
[]
[]
[]
[]
[]
[]
[]
[]
[]
[]
[]
[]
[]
[]
[]
[]
[]
[]
[]
[]
[]
[]
[]
[]
[]
[]
[]
[]
[]
[]
[]
[]
[]
[]
[]
[]
[]
[]
[]
[]
[]
[]
[]
[]
[]
[]
[]
[]
[]
[]
[]
[]
[]
[]
[]
[]
[]
[]
[]
[]
[]
[]
[]
[]
[]
[]
[]
[]
[]
[]
[]
[]
[]
[]
[]
[]
[]
[]
[]
[]
[]
[]
[]
[]
[]
[]
[]
[]
[]
[]
[]
[]
[]
[]
[]
[]
[]
[]
[]
[]
[]
[]
[]
[]
[]
[]
[]
[]
[]
[]
[]
[]
[]
[]
[]
[]
[]
[]
[]
[]
[]
[]
[]
[]
[]
[]
[]
[]
[]
[]
[]
[]
[]
[]
[]
[]
[]
[]
[]
[]
[]
[]
[]
[]
[]
[]
[]
[]
[]
[]
[]
[]
[]
[]
[]
[]
[]
[]
[]
[]
[]
[]
[]
[]
[]
[]
[]
[]
[]
[]
[]
[]
[]
[]
[]
[]
[]
[]
[]
[]
[]
[]
[]
[]
[]
[]
[]
[]
[]
[]
[]
[]
[]
[]
[]
[]
[]
[]
[]
[]
[]
[]
[]
[]
[]
[]
[]
[]
[]
[]
[]
[]
[]
[]
[]
[]
[]
[]
[]
[]
[]
[]
[]
[]
[]
[]
[]
[]
[]
[]
[]
[]
[]
[]
[]
[]
[]
[]
[]
[]
[]
[]
[]
[]
[]
[]
[]
[]
[]
[]
[]
[]
[]
[]
[]
[]
[]
[]
[]
[]
[]
[]
[]
[]
[]
[]
[]
[]
[]
[]
[]
[]
[]
[]
[]
[]
[]
[]
[]
[]
[]
[]
[]
[]
[]
[]
[]
[]
[]
[]
[]
[]
[]
[]
[]
[]
[]
[]
[]
[]
[]
[]
[]
[]
[]
[]
[]
[]
[]
[]
[]
[]
[]
[]
[]
[]
[]
[]
[]
[]
[]
[]
[]
[]
[]
[]
[]
[]
[]
[]
[]
[]
[]
[]
[]
[]
[]
[]
[]
[]
[]
[]
[]
[]
[]
[]
[]
[]
[]
[]
[]
[]
[]
[]
[]
[]
[]
[]
[]
[]
[]
[]
[]
[]
[]
[]
[]
[]
[]
[]
[]
[]
[]
[]
[]
[]
[]
[]
[]
[]
[]
[]
[]
[]
[]
[]
[]
[]
[]
[]
[]
[]
[]
[]
[]
[]
[]
[]
[]
[]
[]
[]
[]
[]
[]
[]
[]
[]
[]
[]
[]
[]
[]
[]
[]
[]
[]
[]
[]
[]
[]
[]
[]
[]
[]
[]
[]
[]
[]
[]
[]
[]
[]
[]
[]
[]
[]
[]
[]
[]
[]
[]
[]
[]
[]
[]
[]
[]
[]
[]
[]
[]
[]
[]
[]
[]
[]
[]
[]
[]
[]
[]
[]
[]
[]
[]
[]
[]
[]
[]
[]
[]
[]
[]
[]
[]
[]
[]
[]
[]
[]
[]
[]
[]
[]
[]
[]
[]
[]
[]
[]
[]
[]
[]
[]
[]
[]
[]
[]
[]
[]
[]
[]
[]
[]
[]
[]
[]
[]
[]
[]
[]
[]
[]
[]
[]
[]
[]
[]
[]
[]
[]
[]
[]
[]
[]
[]
[]
[]
[]
[]
[]
[]
[]
[]
[]
[]
[]
[]
[]
[]
[]
[]
[]
[]
[]
[]
[]
[]
[]
[]
[]
[]
[]
[]
[]
[]
[]
[]
[]
[]
[]
[]
[]
[]
[]
[]
[]
[]
[]
[]
[]
[]
[]
[]
[]
[]
[]
[]
[]
[]
[]
[]
[]
[]
[]
[]
[]
[]
[]
[]
[]
[]
[]
[]
[]
[]
[]
[]
[]
[]
[]
[]
[]
[]
[]
[]
[]
[]
[]
[]
[]
[]
[]
[]
[]
[]
[]
[]
[]
[]
[]
[]
[]
[]
[]
[]
[]
[]
[]
[]
[]
[]
[]
[]
[]
[]
[]
[]
[]
[]
[]
[]
[]
[]
[]
[]
[]
[]
[]
[]
[]
[]
[]
[]
[]
[]
[]
[]
[]
[]
[]
[]
[]
[]
[]
[]
[]
[]
[]
[]
[]
[]
[]
[]
[]
[]
[]
[]
[]
[]
[]
[]
[]
[]
[]
[]
[]
[]
[]
[]
[]
[]
[]
[]
[]
[]
[]
[]
[]
[]
[]
[]
[]
[]
[]
[]
[]
[]
[]
[]
[]
[]
[]
[]
[]
[]
[]
[]
[]
[]
[]
[]
[]
[]
[]
[]
[]
[]
[]
[]
[]
[]
[]
[]
[]
[]
[]
[]
[]
[]
[]
[]
[]
[]
[]
[]
[]
[]
[]
[]
[]
[]
[]
[]
[]
[]
[]
[]
[]
[]
[]
[]
[]
[]
[]
[]
[]
[]
[]
[]
[]
[]
[]
[]
[]
[]
[]
[]
[]
[]
[]
[]
[]
[]
[]
[]
[]
[]
[]
[]
[]
[]
[]
[]
[]
[]
[]
[]
[]
[]
[]
[]
[]
[]
[]
[]
[]
[]
[]
[]
[]
[]
[]
[]
[]
[]
[]
[]
[]
[]
[]
[]
[]
[]
[]
[]
[]
[]
[]
[]
[]
[]
[]
[]
[]
[]
[]
[]
[]
[]
[]
[]
[]
[]
[]
[]
[]
[]
[]
[]
[]
[]
[]
[]
[]
[]
[]
[]
[]
[]
[]
[]
[]
[]
[]
[]
[]
[]
[]
[]
[]
[]
[]
[]
[]
[]
[]
[]
[]
[]
[]
[]
[]
[]
[]
[]
[]
[]
[]
[]
[]
[]
[]
[]
[]
[]
[]
[]
[]
[]
[]
[]
[]
[]
[]
[]
[]
[]
[]
[]
[]
[]
[]
[]
[]
[]
[]
[]
[]
[]
[]
[]
[]
[]
[]
[]
[]
[]
[]
[]
[]
[]
[]
[]
[]
[]
[]
[]
[]
[]
[]
[]
[]
[]
[]
[]
[]
[]
[]
[]
[]
[]
[]
[]
[]
[]
[]
[]
[]
[]
[]
[]
[]
[]
[]
[]
[]
[]
[]
[]
[]
[]
[]
[]
[]
[]
[]
[]
[]
[]
[]
[]
[]
[]
[]
[]
[]
[]
[]
[]
[]
[]
[]
[]
[]
[]
[]
[]
[]
[]
[]
[]
[]
[]
[]
[]
[]
[]
[]
[]
[]
[]
[]
[]
[]
[]
[]
[]
[]
[]
[]
[]
[]
[]
[]
[]
[]
[]
[]
[]
[]
[]
[]
[]
[]
[]
[]
[]
[]
[]
[]
[]
[]
[]
[]
[]
[]
[]
[]
[]
[]
[]
[]
[]
[]
[]
[]
[]
[]
[]
[]
[]
[]
[]
[]
[]
[]
[]
[]
[]
[]
[]
[]
[]
[]
[]
[]
[]
[]
[]
[]
[]
[]
[]
[]
[]
[]
[]
[]
[]
[]
[]
[]
[]
[]
[]
[]
[]
[]
[]
[]
[]
[]
[]
[]
[]
[]
[]
[]
[]
[]
[]
[]
[]
[]
[]
[]
[]
[]
[]
[]
[]
[]
[]
[]
[]
[]
[]
[]
[]
[]
[]
[]
[]
[]
[]
[]
[]
[]
[]
[]
[]
[]
[]
[]
[]
[]
[]
[]
[]
[]
[]
[]
[]
[]
[]
[]
[]
[]
[]
[]
[]
[]
[]
[]
[]
[]
[]
[]
[]
[]
[]
[]
[]
[]
[]
[]
[]
[]
[]
[]
[]
[]
[]
[]
[]
[]
[]
[]
[]
[]
[]
[]
[]
[]
[]
[]
[]
[]
[]
[]
[]
[]
[]
[]
[]
[]
[]
[]
[]
[]
[]
[]
[]
[]
[]
[]
[]
[]
[]
[]
[]
[]
[]
[]
[]
[]
[]
[]
[]
[]
[]
[]
[]
[]
[]
[]
[]
[]
[]
[]
[]
[]
[]
[]
[]
[]
[]
[]
[]
[]
[]
[]
[]
[]
[]
[]
[]
[]
[]
[]
[]
[]
[]
[]
[]
[]
[]
[]
[]
[]
[]
[]
[]
[]
[]
[]
[]
[]
[]
[]
[]
[]
[]
[]
[]
[]
[]
[]
[]
[]
[]
[]
[]
[]
[]
[]
[]
[]
[]
[]
[]
[]
[]
[]
[]
[]
[]
[]
[]
[]
[]
[]
[]
[]
[]
[]
[]
[]
[]
[]
[]
[]
[]
[]
[]
[]
[]
[]
[]
[]
[]
[]
[]
[]
[]
[]
[]
[]
[]
[]
[]
[]
[]
[]
[]
[]
[]
[]
[]
[]
[]
[]
[]
[]
[]
[]
[]
[]
[]
[]
[]
[]
[]
[]
[]
[]
[]
[]
[]
[]
[]
[]
[]
[]
[]
[]
[]
[]
[]
[]
[]
[]
[]
[]
[]
[]
[]
[]
[]
[]
[]
[]
[]
[]
[]
[]
[]
[]
[]
[]
[]
[]
[]
[]
[]
[]
[]
[]
[]
[]
[]
[]
[]
[]
[]
[]
[]
[]
[]
[]
[]
[]
[]
[]
[]
[]
[]
[]
[]
[]
[]
[]
[]
[]
[]
[]
[]
[]
[]
[]
[]
[]
[]
[]
[]
[]
[]
[]
[]
[]
[]
[]
[]
[]
[]
[]
[]
[]
[]
[]
[]
[]
[]
[]
[]
[]
[]
[]
[]
[]
[]
[]
[]
[]
[]
[]
[]
[]
[]
[]
[]
[]
[]
[]
[]
[]
[]
[]
[]
[]
[]
[]
[]
[]
[]
[]
[]
[]
[]
[]
[]
[]
[]
[]
[]
[]
[]
[]
[]
[]
[]
[]
[]
[]
[]
[]
[]
[]
[]
[]
[]
[]
[]
[]
[]
[]
[]
[]
[]
[]
[]
[]
[]
[]
[]
[]
[]
[]
[]
[]
[]
[]
[]
[]
[]
[]
[]
[]
[]
[]
[]
[]
[]
[]
[]
[]
[]
[]
[]
[]
[]
[]
[]
[]
[]
[]
[]
[]
[]
[]
[]
[]
[]
[]
[]
[]
[]
[]
[]
[]
[]
[]
[]
[]
[]
[]
[]
[]
[]
[]
[]
[]
[]
[]
[]
[]
[]
[]
[]
[]
[]
[]
[]
[]
[]
[]
[]
[]
[]
[]
[]
[]
[]
[]
[]
[]
[]
[]
[]
[]
[]
[]
[]
[]
[]
[]
[]
[]
[]
[]
[]
[]
[]
[]
[]
[]
[]
[]
[]
[]
[]
[]
[]
[]
[]
[]
[]
[]
[]
[]
[]
[]
[]
[]
[]
[]
[]
[]
[]
[]
[]
[]
[]
[]
[]
[]
[]
[]
[]
[]
[]
[]
[]
[]
[]
[]
[]
[]
[]
[]
[]
[]
[]
[]
[]
[]
[]
[]
[]
[]
[]
[]
[]
[]
[]
[]
[]
[]
[]
[]
[]
[]
[]
[]
[]
[]
[]
[]
[]
[]
[]
[]
[]
[]
[]
[]
[]
[]
[]
[]
[]
[]
[]
[]
[]
[]
[]
[]
[]
[]
[]
[]
[]
[]
[]
[]
[]
[]
[]
[]
[]
[]
[]
[]
[]
[]
[]
[]
[]
[]
[]
[]
[]
[]
[]
[]
[]
[]
[]
[]
[]
[]
[]
[]
[]
[]
[]
[]
[]
[]
[]
[]
[]
[]
[]
[]
[]
[]
[]
[]
[]
[]
[]
[]
[]
[]
[]
[]
[]
[]
[]
[]
[]
[]
[]
[]
[]
[]
[]
[]
[]
[]
[]
[]
[]
[]
[]
[]
[]
[]
[]
[]
[]
[]
[]
[]
[]
[]
[]
[]
[]
[]
[]
[]
[]
[]
[]
[]
[]
[]
[]
[]
[]
[]
[]
[]
[]
[]
[]
[]
[]
[]
[]
[]
[]
[]
[]
[]
[]
[]
[]
[]
[]
[]
[]
[]
[]
[]
[]
[]
[]
[]
[]
[]
[]
[]
[]
[]
[]
[]
[]
[]
[]
[]
[]
[]
[]
[]
[]
[]
[]
[]
[]
[]
[]
[]
[]
[]
[]
[]
[]
[]
[]
[]
[]
[]
[]
[]
[]
[]
[]
[]
[]
[]
[]
[]
[]
[]
[]
[]
[]
[]
[]
[]
[]
[]
[]
[]
[]
[]
[]
[]
[]
[]
[]
[]
[]
[]
[]
[]
[]
[]
[]
[]
[]
[]
[]
[]
[]
[]
[]
[]
[]
[]
[]
[]
[]
[]
[]
[]
[]
[]
[]
[]
[]
[]
[]
[]
[]
[]
[]
[]
[]
[]
[]
[]
[]
[]
[]
[]
[]
[]
[]
[]
[]
[]
[]
[]
[]
[]
[]
[]
[]
[]
[]
[]
[]
[]
[]
[]
[]
[]
[]
[]
[]
[]
[]
[]
[]
[]
[]
[]
[]
[]
[]
[]
[]
[]
[]
[]
[]
[]
[]
[]
[]
[]
[]
[]
[]
[]
[]
[]
[]
[]
[]
[]
[]
[]
[]
[]
[]
[]
[]
[]
[]
[]
[]
[]
[]
[]
[]
[]
[]
[]
[]
[]
[]
[]
[]
[]
[]
[]
[]
[]
[]
[]
[]
[]
[]
[]
[]
[]
[]
[]
[]
[]
[]
[]
[]
[]
[]
[]
[]
[]
[]
[]
[]
[]
[]
[]
[]
[]
[]
[]
[]
[]
[]
[]
[]
[]
[]
[]
[]
[]
[]
[]
[]
[]
[]
[]
[]
[]
[]
[]
[]
[]
[]
[]
[]
[]
[]
[]
[]
[]
[]
[]
[]
[]
[]
[]
[]
[]
[]
[]
[]
[]
[]
[]
[]
[]
[]
[]
[]
[]
[]
[]
[]
[]
[]
[]
[]
[]
[]
[]
[]
[]
[]
[]
[]
[]
[]
[]
[]
[]
[]
[]
[]
[]
[]
[]
[]
[]
[]
[]
[]
[]
[]
[]
[]
[]
[]
[]
[]
[]
[]
[]
[]
[]
[]
[]
[]
[]
[]
[]
[]
[]
[]
[]
[]
[]
[]
[]
[]
[]
[]
[]
[]
[]
[]
[]
[]
[]
[]
[]
[]
[]
[]
[]
[]
[]
[]
[]
[]
[]
[]
[]
[]
[]
[]
[]
[]
[]
[]
[]
[]
[]
[]
[]
[]
[]
[]
[]
[]
[]
[]
[]
[]
[]
[]
[]
[]
[]
[]
[]
[]
[]
[]
[]
[]
[]
[]
[]
[]
[]
[]
[]
[]
[]
[]
[]
[]
[]
[]
[]
[]
[]
[]
[]
[]
[]
[]
[]
[]
[]
[]
[]
[]
[]
[]
[]
[]
[]
[]
[]
[]
[]
[]
[]
[]
[]
[]
[]
[]
[]
[]
[]
[]
[]
[]
[]
[]
[]
[]
[]
[]
[]
[]
[]
[]
[]
[]
[]
[]
[]
[]
[]
[]
[]
[]
[]
[]
[]
[]
[]
[]
[]
[]
[]
[]
[]
[]
[]
[]
[]
[]
[]
[]
[]
[]
[]
[]
[]
[]
[]
[]
[]
[]
[]
[]
[]
[]
[]
[]
[]
[]
[]
[]
[]
[]
[]
[]
[]
[]
[]
[]
[]
[]
[]
[]
[]
[]
[]
[]
[]
[]
[]
[]
[]
[]
[]
[]
[]
[]
[]
[]
[]
[]
[]
[]
[]
[]
[]
[]
[]
[]
[]
[]
[]
[]
[]
[]
[]
[]
[]
[]
[]
[]
[]
[]
[]
[]
[]
[]
[]
[]
[]
[]
[]
[]
[]
[]
[]
[]
[]
[]
[]
[]
[]
[]
[]
[]
[]
[]
[]
[]
[]
[]
[]
[]
[]
[]
[]
[]
[]
[]
[]
[]
[]
[]
[]
[]
[]
[]
[]
[]
[]
[]
[]
[]
[]
[]
[]
[]
[]
[]
[]
[]
[]
[]
[]
[]
[]
[]
[]
[]
[]
[]
[]
[]
[]
[]
[]
[]
[]
[]
[]
[]
[]
[]
[]
[]
[]
[]
[]
[]
[]
[]
[]
[]
[]
[]
[]
[]
[]
[]
[]
[]
[]
[]
[]
[]
[]
[]
[]
[]
[]
[]
[]
[]
[]
[]
[]
[]
[]
[]
[]
[]
[]
[]
[]
[]
[]
[]
[]
[]
[]
[]
[]
[]
[]
[]
[]
[]
[]
[]
[]
[]
[]
[]
[]
[]
[]
[]
[]
[]
[]
[]
[]
[]
[]
[]
[]
[]
[]
[]
[]
[]
[]
[]
[]
[]
[]
[]
[]
[]
[]
[]
[]
[]
[]
[]
[]
[]
[]
[]
[]
[]
[]
[]
[]
[]
[]
[]
[]
[]
[]
[]
[]
[]
[]
[]
[]
[]
[]
[]
[]
[]
[]
[]
[]
[]
[]
[]
[]
[]
[]
[]
[]
[]
[]
[]
[]
[]
[]
[]
[]
[]
[]
[]
[]
[]
[]
[]
[]
[]
[]
[]
[]
[]
[]
[]
[]
[]
[]
[]
[]
[]
[]
[]
[]
[]
[]
[]
[]
[]
[]
[]
[]
[]
[]
[]
[]
[]
[]
[]
[]
[]
[]
[]
[]
[]
[]
[]
[]
[]
[]
[]
[]
[]
[]
[]
[]
[]
[]
[]
[]
[]
[]
[]
[]
[]
[]
[]
[]
[]
[]
[]
[]
[]
[]
[]
[]
[]
[]
[]
[]
[]
[]
[]
[]
[]
[]
[]
[]
[]
[]
[]
[]
[]
[]
[]
[]
[]
[]
[]
[]
[]
[]
[]
[]
[]
[]
[]
[]
[]
[]
[]
[]
[]
[]
[]
[]
[]
[]
[]
[]
[]
[]
[]
[]
[]
[]
[]
[]
[]
[]
[]
[]
[]
[]
[]
[]
[]
[]
[]
[]
[]
[]
[]
[]
[]
[]
[]
[]
[]
[]
[]
[]
[]
[]
[]
[]
[]
[]
[]
[]
[]
[]
[]
[]
[]
[]
[]
[]
[]
[]
[]
[]
[]
[]
[]
[]
[]
[]
[]
[]
[]
[]
[]
[]
[]
[]
[]
[]
[]
[]
[]
[]
[]
[]
[]
[]
[]
[]
[]
[]
[]
[]
[]
[]
[]
[]
[]
[]
[]
[]
[]
[]
[]
[]
[]
[]
[]
[]
[]
[]
[]
[]
[]
[]
[]
[]
[]
[]
[]
[]
[]
[]
[]
[]
[]
[]
[]
[]
[]
[]
[]
[]
[]
[]
[]
[]
[]
[]
[]
[]
[]
[]
[]
[]
[]
[]
[]
[]
[]
[]
[]
[]
[]
[]
[]
[]
[]
[]
[]
[]
[]
[]
[]
[]
[]
[]
[]
[]
[]
[]
[]
[]
[]
[]
[]
[]
[]
[]
[]
[]
[]
[]
[]
[]
[]
[]
[]
[]
[]
[]
[]
[]
[]
[]
[]
[]
[]
[]
[]
[]
[]
[]
[]
[]
[]
[]
[]
[]
[]
[]
[]
[]
[]
[]
[]
[]
[]
[]
[]
[]
[]
[]
[]
[]
[]
[]
[]
[]
[]
[]
[]
[]
[]
[]
[]
[]
[]
[]
[]
[]
[]
[]
[]
[]
[]
[]
[]
[]
[]
[]
[]
[]
[]
[]
[]
[]
[]
[]
[]
[]
[]
[]
[]
[]
[]
[]
[]
[]
[]
[]
[]
[]
[]
[]
[]
[]
[]
[]
[]
[]
[]
[]
[]
[]
[]
[]
[]
[]
[]
[]
[]
[]
[]
[]
[]
[]
[]
[]
[]
[]
[]
[]
[]
[]
[]
[]
[]
[]
[]
[]
[]
[]
[]
[]
[]
[]
[]
[]
[]
[]
[]
[]
[]
[]
[]
[]
[]
[]
[]
[]
[]
[]
[]
[]
[]
[]
[]
[]
[]
[]
[]
[]
[]
[]
[]
[]
[]
[]
[]
[]
[]
[]
[]
[]
[]
[]
[]
[]
[]
[]
[]
[]
[]
[]
[]
[]
[]
[]
[]
[]
[]
[]
[]
[]
[]
[]
[]
[]
[]
[]
[]
[]
[]
[]
[]
[]
[]
[]
[]
[]
[]
[]
[]
[]
[]
[]
[]
[]
[]
[]
[]
[]
[]
[]
[]
[]
[]
[]
[]
[]
[]
[]
[]
[]
[]
[]
[]
[]
[]
[]
[]
[]
[]
[]
[]
[]
[]
[]
[]
[]
[]
[]
[]
[]
[]
[]
[]
[]
[]
[]
[]
[]
[]
[]
[]
[]
[]
[]
[]
[]
[]
[]
[]
[]
[]
[]
[]
[]
[]
[]
[]
[]
[]
[]
[]
[]
[]
[]
[]
[]
[]
[]
[]
[]
[]
[]
[]
[]
[]
[]
[]
[]
[]
[]
[]
[]
[]
[]
[]
[]
[]
[]
[]
[]
[]
[]
[]
[]
[]
[]
[]
[]
[]
[]
[]
[]
[]
[]
[]
[]
[]
[]
[]
[]
[]
[]
[]
[]
[]
[]
[]
[]
[]
[]
[]
[]
[]
[]
[]
[]
[]
[]
[]
[]
[]
[]
[]
[]
[]
[]
[]
[]
[]
[]
[]
[]
[]
[]
[]
[]
[]
[]
[]
[]
[]
[]
[]
[]
[]
[]
[]
[]
[]
[]
[]
[]
[]
[]
[]
[]
[]
[]
[]
[]
[]
[]
[]
[]
[]
[]
[]
[]
[]
[]
[]
[]
[]
[]
[]
[]
[]
[]
[]
[]
[]
[]
[]
[]
[]
[]
[]
[]
[]
[]
[]
[]
[]
[]
[]
[]
[]
[]
[]
[]
[]
[]
[]
[]
[]
[]
[]
[]
[]
[]
[]
[]
[]
[]
[]
[]
[]
[]
[]
[]
[]
[]
[]
[]
[]
[]
[]
[]
[]
[]
[]
[]
[]
[]
[]
[]
[]
[]
[]
[]
[]
[]
[]
[]
[]
[]
[]
[]
[]
[]
[]
[]
[]
[]
[]
[]
[]
[]
[]
[]
[]
[]
[]
[]
[]
[]
[]
[]
[]
[]
[]
[]
[]
[]
[]
[]
[]
[]
[]
[]
[]
[]
[]
[]
[]
[]
[]
[]
[]
[]
[]
[]
[]
[]
[]
[]
[]
[]
[]
[]
[]
[]
[]
[]
[]
[]
[]
[]
[]
[]
[]
[]
[]
[]
[]
[]
[]
[]
[]
[]
[]
[]
[]
[]
[]
[]
[]
[]
[]
[]
[]
[]
[]
[]
[]
[]
[]
[]
[]
[]
[]
[]
[]
[]
[]
[]
[]
[]
[]
[]
[]
[]
[]
[]
[]
[]
[]
[]
[]
[]
[]
[]
[]
[]
[]
[]
[]
[]
[]
[]
[]
[]
[]
[]
[]
[]
[]
[]
[]
[]
[]
[]
[]
[]
[]
[]
[]
[]
[]
[]
[]
[]
[]
[]
[]
[]
[]
[]
[]
[]
[]
[]
[]
[]
[]
[]
[]
[]
[]
[]
[]
[]
[]
[]
[]
[]
[]
[]
[]
[]
[]
[]
[]
[]
[]
[]
[]
[]
[]
[]
[]
[]
[]
[]
[]
[]
[]
[]
[]
[]
[]
[]
[]
[]
[]
[]
[]
[]
[]
[]
[]
[]
[]
[]
[]
[]
[]
[]
[]
[]
[]
[]
[]
[]
[]
[]
[]
[]
[]
[]
[]
[]
[]
[]
[]
[]
[]
[]
[]
[]
[]
[]
[]
[]
[]
[]
[]
[]
[]
[]
[]
[]
[]
[]
[]
[]
[]
[]
[]
[]
[]
[]
[]
[]
[]
[]
[]
[]
[]
[]
[]
[]
[]
[]
[]
[]
[]
[]
[]
[]
[]
[]
[]
[]
[]
[]
[]
[]
[]
[]
[]
[]
[]
[]
[]
[]
[]
[]
[]
[]
[]
[]
[]
[]
[]
[]
[]
[]
[]
[]
[]
[]
[]
[]
[]
[]
[]
[]
[]
[]
[]
[]
[]
[]
[]
[]
[]
[]
[]
[]
[]
[]
[]
[]
[]
[]
[]
[]
[]
[]
[]
[]
[]
[]
[]
[]
[]
[]
[]
[]
[]
[]
[]
[]
[]
[]
[]
[]
[]
[]
[]
[]
[]
[]
[]
[]
[]
[]
[]
[]
[]
[]
[]
[]
[]
[]
[]
[]
[]
[]
[]
[]
[]
[]
[]
[]
[]
[]
[]
[]
[]
[]
[]
[]
[]
[]
[]
[]
[]
[]
[]
[]
[]
[]
[]
[]
[]
[]
[]
[]
[]
[]
[]
[]
[]
[]
[]
[]
[]
[]
[]
[]
[]
[]
[]
[]
[]
[]
[]
[]
[]
[]
[]
[]
[]
[]
[]
[]
[]
[]
[]
[]
[]
[]
[]
[]
[]
[]
[]
[]
[]
[]
[]
[]
[]
[]
[]
[]
[]
[]
[]
[]
[]
[]
[]
[]
[]
[]
[]
[]
[]
[]
[]
[]
[]
[]
[]
[]
[]
[]
[]
[]
[]
[]
[]
[]
[]
[]
[]
[]
[]
[]
[]
[]
[]
[]
[]
[]
[]
[]
[]
[]
[]
[]
[]
[]
[]
[]
[]
[]
[]
[]
[]
[]
[]
[]
[]
[]
[]
[]
[]
[]
[]
[]
[]
[]
[]
[]
[]
[]
[]
[]
[]
[]
[]
[]
[]
[]
[]
[]
[]
[]
[]
[]
[]
[]
[]
[]
[]
[]
[]
[]
[]
[]
[]
[]
[]
[]
[]
[]
[]
[]
[]
[]
[]
[]
[]
[]
[]
[]
[]
[]
[]
[]
[]
[]
[]
[]
[]
[]
[]
[]
[]
[]
[]
[]
[]
[]
[]
[]
[]
[]
[]
[]
[]
[]
[]
[]
[]
[]
[]
[]
[]
[]
[]
[]
[]
[]
[]
[]
[]
[]
[]
[]
[]
[]
[]
[]
[]
[]
[]
[]
[]
[]
[]
[]
[]
[]
[]
[]
[]
[]
[]
[]
[]
[]
[]
[]
[]
[]
[]
[]
[]
[]
[]
[]
[]
[]
[]
[]
[]
[]
[]
[]
[]
[]
[]
[]
[]
[]
[]
[]
[]
[]
[]
[]
[]
[]
[]
[]
[]
[]
[]
[]
[]
[]
[]
[]
[]
[]
[]
[]
[]
[]
[]
[]
[]
[]
[]
[]
[]
[]
[]
[]
[]
[]
[]
[]
[]
[]
[]
[]
[]
[]
[]
[]
[]
[]
[]
[]
[]
[]
[]
[]
[]
[]
[]
[]
[]
[]
[]
[]
[]
[]
[]
[]
[]
[]
[]
[]
[]
[]
[]
[]
[]
[]
[]
[]
[]
[]
[]
[]
[]
[]
[]
[]
[]
[]
[]
[]
[]
[]
[]
[]
[]
[]
[]
[]
[]
[]
[]
[]
[]
[]
[]
[]
[]
[]
[]
[]
[]
[]
[]
[]
[]
[]
[]
[]
[]
[]
[]
[]
[]
[]
[]
[]
[]
[]
[]
[]
[]
[]
[]
[]
[]
[]
[]
[]
[]
[]
[]
[]
[]
[]
[]
[]
[]
[]
[]
[]
[]
[]
[]
[]
[]
[]
[]
[]
[]
[]
[]
[]
[]
[]
[]
[]
[]
[]
[]
[]
[]
[]
[]
[]
[]
[]
[]
[]
[]
[]
[]
[]
[]
[]
[]
[]
[]
[]
[]
[]
[]
[]
[]
[]
[]
[]
[]
[]
[]
[]
[]
[]
[]
[]
[]
[]
[]
[]
[]
[]
[]
[]
[]
[]
[]
[]
[]
[]
[]
[]
[]
[]
[]
[]
[]
[]
[]
[]
[]
[]
[]
[]
[]
[]
[]
[]
[]
[]
[]
[]
[]
[]
[]
[]
[]
[]
[]
[]
[]
[]
[]
[]
[]
[]
[]
[]
[]
[]
[]
[]
[]
[]
[]
[]
[]
[]
[]
[]
[]
[]
[]
[]
[]
[]
[]
[]
[]
[]
[]
[]
[]
[]
[]
[]
[]
[]
[]
[]
[]
[]
[]
[]
[]
[]
[]
[]
[]
[]
[]
[]
[]
[]
[]
[]
[]
[]
[]
[]
[]
[]
[]
[]
[]
[]
[]
[]
[]
[]
[]
[]
[]
[]
[]
[]
[]
[]
[]
[]
[]
[]
[]
[]
[]
[]
[]
[]
[]
[]
[]
[]
[]
[]
[]
[]
[]
[]
[]
[]
[]
[]
[]
[]
[]
[]
[]
[]
[]
[]
[]
[]
[]
[]
[]
[]
[]
[]
[]
[]
[]
[]
[]
[]
[]
[]
[]
[]
[]
[]
[]
[]
[]
[]
[]
[]
[]
[]
[]
[]
[]
[]
[]
[]
[]
[]
[]
[]
[]
[]
[]
[]
[]
[]
[]
[]
[]
[]
[]
[]
[]
[]
[]
[]
[]
[]
[]
[]
[]
[]
[]
[]
[]
[]
[]
[]
[]
[]
[]
[]
[]
[]
[]
[]
[]
[]
[]
[]
[]
[]
[]
[]
[]
[]
[]
[]
[]
[]
[]
[]
[]
[]
[]
[]
[]
[]
[]
[]
[]
[]
[]
[]
[]
[]
[]
[]
[]
[]
[]
[]
[]
[]
[]
[]
[]
[]
[]
[]
[]
[]
[]
[]
[]
[]
[]
[]
[]
[]
[]
[]
[]
[]
[]
[]
[]
[]
[]
[]
[]
[]
[]
[]
[]
[]
[]
[]
[]
[]
[]
[]
[]
[]
[]
[]
[]
[]
[]
[]
[]
[]
[]
[]
[]
[]
[]
[]
[]
[]
[]
[]
[]
[]
[]
[]
[]
[]
[]
[]
[]
[]
[]
[]
[]
[]
[]
[]
[]
[]
[]
[]
[]
[]
[]
[]
[]
[]
[]
[]
[]
[]
[]
[]
[]
[]
[]
[]
[]
[]
[]
[]
[]
[]
[]
[]
[]
[]
[]
[]
[]
[]
[]
[]
[]
[]
[]
[]
[]
[]
[]
[]
[]
[]
[]
[]
[]
[]
[]
[]
[]
[]
[]
[]
[]
[]
[]
[]
[]
[]
[]
[]
[]
[]
[]
[]
[]
[]
[]
[]
[]
[]
[]
[]
[]
[]
[]
[]
[]
[]
[]
[]
[]
[]
[]
[]
[]
[]
[]
[]
[]
[]
[]
[]
[]
[]
[]
[]
[]
[]
[]
[]
[]
[]
[]
[]
[]
[]
[]
[]
[]
[]
[]
[]
[]
[]
[]
[]
[]
[]
[]
[]
[]
[]
[]
[]
[]
[]
[]
[]
[]
[]
[]
[]
[]
[]
[]
[]
[]
[]
[]
[]
[]
[]
[]
[]
[]
[]
[]
[]
[]
[]
[]
[]
[]
[]
[]
[]
[]
[]
[]
[]
[]
[]
[]
[]
[]
[]
[]
[]
[]
[]
[]
[]
[]
[]
[]
[]
[]
[]
[]
[]
[]
[]
[]
[]
[]
[]
[]
[]
[]
[]
[]
[]
[]
[]
[]
[]
[]
[]
[]
[]
[]
[]
[]
[]
[]
[]
[]
[]
[]
[]
[]
[]
[]
[]
[]
[]
[]
[]
[]
[]
[]
[]
[]
[]
[]
[]
[]
[]
[]
[]
[]
[]
[]
[]
[]
[]
[]
[]
[]
[]
[]
[]
[]
[]
[]
[]
[]
[]
[]
[]
[]
[]
[]
[]
[]
[]
[]
[]
[]
[]
[]
[]
[]
[]
[]
[]
[]
[]
[]
[]
[]
[]
[]
[]
[]
[]
[]
[]
[]
[]
[]
[]
[]
[]
[]
[]
[]
[]
[]
[]
[]
[]
[]
[]
[]
[]
[]
[]
[]
[]
[]
[]
[]
[]
[]
[]
[]
[]
[]
[]
[]
[]
[]
[]
[]
[]
[]
[]
[]
[]
[]
[]
[]
[]
[]
[]
[]
[]
[]
[]
[]
[]
[]
[]
[]
[]
[]
[]
[]
[]
[]
[]
[]
[]
[]
[]
[]
[]
[]
[]
[]
[]
[]
[]
[]
[]
[]
[]
[]
[]
[]
[]
[]
[]
[]
[]
[]
[]
[]
[]
[]
[]
[]
[]
[]
[]
[]
[]
[]
[]
[]
[]
[]
[]
[]
[]
[]
[]
[]
[]
[]
[]
[]
[]
[]
[]
[]
[]
[]
[]
[]
[]
[]
[]
[]
[]
[]
[]
[]
[]
[]
[]
[]
[]
[]
[]
[]
[]
[]
[]
[]
[]
[]
[]
[]
[]
[]
[]
[]
[]
[]
[]
[]
[]
[]
[]
[]
[]
[]
[]
[]
[]
[]
[]
[]
[]
[]
[]
[]
[]
[]
[]
[]
[]
[]
[]
[]
[]
[]
[]
[]
[]
[]
[]
[]
[]
[]
[]
[]
[]
[]
[]
[]
[]
[]
[]
[]
[]
[]
[]
[]
[]
[]
[]
[]
[]
[]
[]
[]
[]
[]
[]
[]
[]
[]
[]
[]
[]
[]
[]
[]
[]
[]
[]
[]
[]
[]
[]
[]
[]
[]
[]
[]
[]
[]
[]
[]
[]
[]
[]
[]
[]
[]
[]
[]
[]
[]
[]
[]
[]
[]
[]
[]
[]
[]
[]
[]
[]
[]
[]
[]
[]
[]
[]
[]
[]
[]
[]
[]
[]
[]
[]
[]
[]
[]
[]
[]
[]
[]
[]
[]
[]
[]
[]
[]
[]
[]
[]
[]
[]
[]
[]
[]
[]
[]
[]
[]
[]
[]
[]
[]
[]
[]
[]
[]
[]
[]
[]
[]
[]
[]
[]
[]
[]
[]
[]
[]
[]
[]
[]
[]
[]
[]
[]
[]
[]
[]
[]
[]
[]
[]
[]
[]
[]
[]
[]
[]
[]
[]
[]
[]
[]
[]
[]
[]
[]
[]
[]
[]
[]
[]
[]
[]
[]
[]
[]
[]
[]
[]
[]
[]
[]
[]
[]
[]
[]
[]
[]
[]
[]
[]
[]
[]
[]
[]
[]
[]
[]
[]
[]
[]
[]
[]
[]
[]
[]
[]
[]
[]
[]
[]
[]
[]
[]
[]
[]
[]
[]
[]
[]
[]
[]
[]
[]
[]
[]
[]
[]
[]
[]
[]
[]
[]
[]
[]
[]
[]
[]
[]
[]
[]
[]
[]
[]
[]
[]
[]
[]
[]
[]
[]
[]
[]
[]
[]
[]
[]
[]
[]
[]
[]
[]
[]
[]
[]
[]
[]
[]
[]
[]
[]
[]
[]
[]
[]
[]
[]
[]
[]
[]
[]
[]
[]
[]
[]
[]
[]
[]
[]
[]
[]
[]
[]
[]
[]
[]
[]
[]
[]
[]
[]
[]
[]
[]
[]
[]
[]
[]
[]
[]
[]
[]
[]
[]
[]
[]
[]
[]
[]
[]
[]
[]
[]
[]
[]
[]
[]
[]
[]
[]
[]
[]
[]
[]
[]
[]
[]
[]
[]
[]
[]
[]
[]
[]
[]
[]
[]
[]
[]
[]
[]
[]
[]
[]
[]
[]
[]
[]
[]
[]
[]
[]
[]
[]
[]
[]
[]
[]
[]
[]
[]
[]
[]
[]
[]
[]
[]
[]
[]
[]
[]
[]
[]
[]
[]
[]
[]
[]
[]
[]
[]
[]
[]
[]
[]
[]
[]
[]
[]
[]
[]
[]
[]
[]
[]
[]
[]
[]
[]
[]
[]
[]
[]
[]
[]
[]
[]
[]
[]
[]
[]
[]
[]
[]
[]
[]
[]
[]
[]
[]
[]
[]
[]
[]
[]
[]
[]
[]
[]
[]
[]
[]
[]
[]
[]
[]
[]
[]
[]
[]
[]
[]
[]
[]
[]
[]
[]
[]
[]
[]
[]
[]
[]
[]
[]
[]
[]
[]
[]
[]
[]
[]
[]
[]
[]
[]
[]
[]
[]
[]
[]
[]
[]
[]
[]
[]
[]
[]
[]
[]
[]
[]
[]
[]
[]
[]
[]
[]
[]
[]
[]
[]
[]
[]
[]
[]
[]
[]
[]
[]
[]
[]
[]
[]
[]
[]
[]
[]
[]
[]
[]
[]
[]
[]
[]
[]
[]
[]
[]
[]
[]
[]
[]
[]
[]
[]
[]
[]
[]
[]
[]
[]
[]
[]
[]
[]
[]
[]
[]
[]
[]
[]
[]
[]
[]
[]
[]
[]
[]
[]
[]
[]
[]
[]
[]
[]
[]
[]
[]
[]
[]
[]
[]
[]
[]
[]
[]
[]
[]
[]
[]
[]
[]
[]
[]
[]
[]
[]
[]
[]
[]
[]
[]
[]
[]
[]
[]
[]
[]
[]
[]
[]
[]
[]
[]
[]
[]
[]
[]
[]
[]
[]
[]
[]
[]
[]
[]
[]
[]
[]
[]
[]
[]
[]
[]
[]
[]
[]
[]
[]
[]
[]
[]
[]
[]
[]
[]
[]
[]
[]
[]
[]
[]
[]
[]
[]
[]
[]
[]
[]
[]
[]
[]
[]
[]
[]
[]
[]
[]
[]
[]
[]
[]
[]
[]
[]
[]
[]
[]
[]
[]
[]
[]
[]
[]
[]
[]
[]
[]
[]
[]
[]
[]
[]
[]
[]
[]
[]
[]
[]
[]
[]
[]
[]
[]
[]
[]
[]
[]
[]
[]
[]
[]
[]
[]
[]
[]
[]
[]
[]
[]
[]
[]
[]
[]
[]
[]
[]
[]
[]
[]
[]
[]
[]
[]
[]
[]
[]
[]
[]
[]
[]
[]
[]
[]
[]
[]
[]
[]
[]
[]
[]
[]
[]
[]
[]
[]
[]
[]
[]
[]
[]
[]
[]
[]
[]
[]
[]
[]
[]
[]
[]
[]
[]
[]
[]
[]
[]
[]
[]
[]
[]
[]
[]
[]
[]
[]
[]
[]
[]
[]
[]
[]
[]
[]
[]
[]
[]
[]
[]
[]
[]
[]
[]
[]
[]
[]
[]
[]
[]
[]
[]
[]
[]
[]
[]
[]
[]
[]
[]
[]
[]
[]
[]
[]
[]
[]
[]
[]
[]
[]
[]
[]
[]
[]
[]
[]
[]
[]
[]
[]
[]
[]
[]
[]
[]
[]
[]
[]
[]
[]
[]
[]
[]
[]
[]
[]
[]
[]
[]
[]
[]
[]
[]
[]
[]
[]
[]
[]
[]
[]
[]
[]
[]
[]
[]
[]
[]
[]
[]
[]
[]
[]
[null,null,null,null,null,null,null,null,null,null,null,null,null,null,null,null,null,null,null,null,"Saldo  a Pagar"]

{"sheet":"mod10 1q","index":17,"n_rows":72,"n_cols":18,"rows_kept":72,"cut":false,"hidden":false,"merged":[[27,10,27,11],[27,12,27,13],[27,14,27,15],[27,16,27,17],[26,12,26,13],[26,14,26,15],[26,16,26,17],[31,14,31,15],[31,16,31,17],[30,10,30,11],[30,12,30,13],[30,16,30,17],[29,10,29,11],[29,12,29,13],[29,14,29,15],[29,16,29,17],[24,7,25,7],[24,8,25,8],[24,16,25,17],[25,10,25,11],[26,10,26,11],[17,17,18,17],[18,7,18,8],[18,9,18,10],[17,12,18,14],[17,7,17,8],[25,12,25,13],[19,12,19,14],[19,15,19,16],[20,12,20,14],[17,15,18,16],[24,9,24,13],[24,14,25,15],[19,9,19,10],[20,9,20,10],[23,7,23,17],[20,15,20,16],[17,9,17,10],[12,12,12,15],[12,16,12,17],[16,7,16,8],[16,12,16,14],[15,7,15,8],[15,12,15,15],[15,9,15,10],[16,9,16,10],[13,12,13,15],[15,16,15,17],[13,9,13,10],[13,16,13,17],[14,12,14,15],[14,16,14,17],[14,7,14,8],[14,9,14,10],[0,0,0,5],[1,0,1,5],[9,2,9,3],[9,4,9,5],[10,4,10,5],[11,9,11,10],[10,0,10,1],[10,2,10,3],[11,12,11,15],[11,16,11,17],[12,7,12,8],[12,9,12,10],[70,4,70,5],[28,16,28,17],[28,14,28,15],[28,12,28,13],[28,10,28,11],[30,14,30,15],[34,10,34,11],[32,10,32,11],[31,10,31,11],[31,12,31,13],[33,10,33,11],[33,12,33,13],[33,14,33,15],[33,16,33,17],[32,12,32,13],[32,14,32,15],[32,16,32,17],[35,10,35,11],[35,12,35,13],[35,14,35,15],[35,16,35,17],[34,12,34,13],[34,14,34,15],[34,16,34,17],[37,10,37,11],[37,12,37,13],[37,14,37,15],[37,16,37,17],[36,10,36,11],[36,12,36,13],[36,14,36,15],[36,16,36,17],[39,10,39,11],[39,12,39,13],[39,14,39,15],[39,16,39,17],[38,10,38,11],[38,14,38,15],[38,16,38,17],[38,12,38,13],[71,4,71,5],[51,14,51,17],[52,14,52,17],[51,7,51,8],[52,7,52,8],[40,10,40,11],[40,12,40,13],[40,14,40,15],[40,16,40,17],[68,11,68,12],[69,11,69,12]]}
["RELATÓRIO DE GESTÃO FISCAL"]
["(Artigos 54 e 55 da LC 101/00)"]
[]
[]
[{"$f":"'mod1 6b'!A5","v":"MUNICÍPIO DE TAUBATÉ  -  FUNDAÇÃO UNIVERSITÁRIA DE TAUBATÉ"}]
[{"$f":"'mod10 3q'!A6","v":"PODER EXECUTIVO MUNICIPAL"}]
["1ºQUADRIMESTRE 2014"]
[]
["I – COMPARATIVOS: ",null,null,null,null,"Valores expressos em R$"]
[null,null,"EXERCÍCIO ANTERIOR",null,"1ºQUADRIMESTRE",null,null,"III – DEMONSTRATIVOS:"]
["Receita Corrente Líquida ",null,{"$f":"'mod10 3q'!C11:D11","v":26064831.149999999},null,4530204.97]
[null,null,"R$","%","R$","%",null,"Disponib.financ.em 31/12:",null,"R$",null,null,"Inscrição de Restos a Pagar:",null,null,null,"R$"]
[null,null,null,null,{"$f":"F13-1","v":5},{"$f":"COM!AH6*2","v":6}]
["Despesas Totais com Pessoal ",null,{"$f":"'mod10 3q'!C14","v":14710470.5},{"$f":"'mod10 3q'!D14","v":56.438004203223088},1867119.61,66.95,null,"    Caixa",null,0,null,null,"     Processados",null,null,null,{"$f":"'mod10 3q'!U12","v":0}]
["Limite Prudencial 95% (par.ún.art.22 LRF)",null,null,null,2323995.15,51.3,null,"    Bancos – C/Movimento",null,0,null,null,"     Não Processados",null,null,null,{"$f":"'mod10 3q'!U14","v":0}]
["Limite Legal (art. 20 LRF)",null,{"$f":"'mod10 3q'!C16","v":14075008.821},{"$f":"'mod10 3q'!D16","v":54},2446310.6800000002,54,null,"    Bancos – C/Vinculadas",null,{"$f":"'mod10 3q'!N15","v":0},null,null,"Total da Inscrição:",null,null,null,{"$f":"SUM(Q14:R15)","v":0}]
["Excesso a Regularizar",null,{"$f":"'mod10 3q'!C17","v":635461.67899999954},{"$f":"'mod10 3q'!D17","v":2.4380042032230835},0,12.95,null,"    Aplicações Financeiras",null,{"$f":"'mod10 3q'!N16","v":0}]
[null,null,null,null,null,null,null,"Subtotal",null,{"$f":"SUM(J14:K17)","v":0},null,null,"Serviços de Terceiros                       (art. 72 LC 101/00)",null,null,"R$",null,"% RCL"]
["Despesa Líq. Inativos e Pensionistas",null,null,null,null,null,null,"(-) Deduções:"]
["Total da Despesa Líquida",null,{"$f":"'mod10 3q'!C20","v":27188559.57},{"$f":"'mod10 3q'!D20","v":104.31128217763268},4439519.99,98,null,"Compromissos a pagar até 31/12",null,{"$f":"'mod10 3q'!N19","v":0},null,null,"Exercício anterior",null,null,{"$f":"'mod10 3q'!T19","v":0},null,{"$f":"'mod10 3q'!V19","v":""}]
["Limite Legal (§1º,art.2ºLei Federal 9.717/98) ",null,{"$f":"'mod10 3q'!C21","v":3804252.51},{"$f":"'mod10 3q'!D21","v":14.595346841523661},1381462.11,30.49,null,"Total das Disponibilidades:",null,{"$f":"J18-J20","v":0},null,null,"Exercício atual",null,null,{"$f":"'mod10 3q'!T20","v":0},null,{"$f":"'mod10 3q'!V20","v":""}]
["Excesso a Regularizar"]
[]
["Dívida Consolidada Líquida",null,null,null,null,null,null,"Operações de Crédito por Antecipação de Receita Orçamentária  - ARO"]
["Saldo ",null,{"$f":"'mod10 3q'!C25","v":55795101.109999999},{"$f":"'mod10 3q'!D25","v":214.06277596392562},53576312.93,1182.6500000000001,null,"Data  da Contratação","Valor Contratado R$","Data da Liquidação",null,null,null,null,"Liquidado no Exercício - R$",null,"Saldo  a Pagar"]
["Limite Legal (arts.3º e 4º Res.nº 40 Senado)",null,{"$f":"'mod10 3q'!C26","v":38042525.060000002},{"$f":"'mod10 3q'!D26","v":120},16681445.279999999,207.79,null,null,null,"Principal","Juros",null,"Encargos"]
["Excesso a Regularizar",null,{"$f":"'mod10 3q'!C27","v":8458524.8000000007},{"$f":"'mod10 3q'!D27","v":32.451868770306618},19183365.670000002,423.45,null,{"$f":"'mod10 3q'!L26","v":"____/___/____"},{"$f":"'mod10 3q'!M26","v":0},{"$f":"'mod10 3q'!N26","v":"____/___/____"},{"$f":"'mod10 3q'!O26","v":"____/___/____"},null,{"$f":"'mod10 3q'!Q26","v":"____/___/____"},null,{"$f":"'mod10 3q'!S26","v":0},null,{"$f":"'mod10 3q'!U26","v":0}]
[null,null,null,null,null,null,null,{"$f":"'mod10 3q'!L27","v":"____/___/____"},{"$f":"'mod10 3q'!M27","v":0},{"$f":"'mod10 3q'!N27","v":"____/___/____"},{"$f":"'mod10 3q'!O27","v":"____/___/____"},null,{"$f":"'mod10 3q'!Q27","v":"____/___/____"},null,{"$f":"'mod10 3q'!S27","v":0},null,{"$f":"'mod10 3q'!U27","v":0}]
["Concessões de Garantias",null,null,null,null,null,null,{"$f":"'mod10 3q'!L28","v":"____/___/____"},{"$f":"'mod10 3q'!M28","v":0},{"$f":"'mod10 3q'!N28","v":"____/___/____"},{"$f":"'mod10 3q'!O28","v":"____/___/____"},null,{"$f":"'mod10 3q'!Q28","v":"____/___/____"},null,{"$f":"'mod10 3q'!S28","v":0},null,{"$f":"'mod10 3q'!U28","v":0}]
["Montante",null,{"$f":"'mod10 3q'!C30","v":0},{"$f":"'mod10 3q'!D30","v":""},0,0,null,{"$f":"'mod10 3q'!L29","v":"____/___/____"},{"$f":"'mod10 3q'!M29","v":0},{"$f":"'mod10 3q'!N29","v":"____/___/____"},{"$f":"'mod10 3q'!O29","v":"____/___/____"},null,{"$f":"'mod10 3q'!Q29","v":"____/___/____"},null,{"$f":"'mod10 3q'!S29","v":0},null,{"$f":"'mod10 3q'!U29","v":0}]
["Limite Legal (art. 9º Res.nº 43 Senado)",null,{"$f":"'mod10 3q'!C31","v":5734262.8530000001},{"$f":"'mod10 3q'!D31","v":22.000000000000004},996645.09,22,null,{"$f":"'mod10 3q'!L30","v":"____/___/____"},{"$f":"'mod10 3q'!M30","v":0},{"$f":"'mod10 3q'!N30","v":"____/___/____"},{"$f":"'mod10 3q'!O30","v":"____/___/____"},null,{"$f":"'mod10 3q'!Q30","v":"____/___/____"},null,{"$f":"'mod10 3q'!S30","v":0},null,{"$f":"'mod10 3q'!U30","v":0}]
["Excesso a Regularizar",null,{"$f":"'mod10 3q'!C32","v":""},{"$f":"'mod10 3q'!D32","v":""},0,0,null,{"$f":"'mod10 3q'!L31","v":"____/___/____"},{"$f":"'mod10 3q'!M31","v":0},{"$f":"'mod10 3q'!N31","v":"____/___/____"},{"$f":"'mod10 3q'!O31","v":"____/___/____"},null,{"$f":"'mod10 3q'!Q31","v":"____/___/____"},null,{"$f":"'mod10 3q'!S31","v":0},null,{"$f":"'mod10 3q'!U31","v":0}]
[null,null,null,null,null,null,null,{"$f":"'mod10 3q'!L32","v":"____/___/____"},{"$f":"'mod10 3q'!M32","v":0},{"$f":"'mod10 3q'!N32","v":"____/___/____"},{"$f":"'mod10 3q'!O32","v":"____/___/____"},null,{"$f":"'mod10 3q'!Q32","v":"____/___/____"},null,{"$f":"'mod10 3q'!S32","v":0},null,{"$f":"'mod10 3q'!U32","v":0}]
["Operações de Crédito (exceto ARO)",null,null,null,null,null,null,{"$f":"'mod10 3q'!L33","v":"____/___/____"},{"$f":"'mod10 3q'!M33","v":0},{"$f":"'mod10 3q'!N33","v":"____/___/____"},{"$f":"'mod10 3q'!O33","v":"____/___/____"},null,{"$f":"'mod10 3q'!Q33","v":"____/___/____"},null,{"$f":"'mod10 3q'!S33","v":0},null,{"$f":"'mod10 3q'!U33","v":0}]
["Realizadas no período",null,{"$f":"'mod10 3q'!C35","v":0},{"$f":"'mod10 3q'!D35","v":""},0,0,null,{"$f":"'mod10 3q'!L34","v":"____/___/____"},{"$f":"'mod10 3q'!M34","v":0},{"$f":"'mod10 3q'!N34","v":"____/___/____"},{"$f":"'mod10 3q'!O34","v":"____/___/____"},null,{"$f":"'mod10 3q'!Q34","v":"____/___/____"},null,{"$f":"'mod10 3q'!S34","v":0},null,{"$f":"'mod10 3q'!U34","v":0}]
["Limite legal (inc. I, art. 7º Res.nº 43 Senado)",null,{"$f":"'mod10 3q'!C36","v":4170372.9839999997},{"$f":"'mod10 3q'!D36","v":16},724832.8,16,null,{"$f":"'mod10 3q'!L35","v":"____/___/____"},{"$f":"'mod10 3q'!M35","v":0},{"$f":"'mod10 3q'!N35","v":"____/___/____"},{"$f":"'mod10 3q'!O35","v":"____/___/____"},null,{"$f":"'mod10 3q'!Q35","v":"____/___/____"},null,{"$f":"'mod10 3q'!S35","v":0},null,{"$f":"'mod10 3q'!U35","v":0}]
["Excesso a regularizar",null,{"$f":"'mod10 3q'!C37","v":""},{"$f":"'mod10 3q'!D37","v":""},0,0,null,{"$f":"'mod10 3q'!L36","v":"____/___/____"},{"$f":"'mod10 3q'!M36","v":0},{"$f":"'mod10 3q'!N36","v":"____/___/____"},{"$f":"'mod10 3q'!O36","v":"____/___/____"},null,{"$f":"'mod10 3q'!Q36","v":"____/___/____"},null,{"$f":"'mod10 3q'!S36","v":0},null,{"$f":"'mod10 3q'!U36","v":0}]
[null,null,null,null,null,null,null,{"$f":"'mod10 3q'!L37","v":"____/___/____"},{"$f":"'mod10 3q'!M37","v":0},{"$f":"'mod10 3q'!N37","v":"____/___/____"},{"$f":"'mod10 3q'!O37","v":"____/___/____"},null,{"$f":"'mod10 3q'!Q37","v":"____/___/____"},null,{"$f":"'mod10 3q'!S37","v":0},null,{"$f":"'mod10 3q'!U37","v":0}]
["Antecipação de Receitas Orçamentárias (ARO)",null,null,null,null,null,null,{"$f":"'mod10 3q'!L38","v":"____/___/____"},{"$f":"'mod10 3q'!M38","v":0},{"$f":"'mod10 3q'!N38","v":"____/___/____"},{"$f":"'mod10 3q'!O38","v":"____/___/____"},null,{"$f":"'mod10 3q'!Q38","v":"____/___/____"},null,{"$f":"'mod10 3q'!S38","v":0},null,{"$f":"'mod10 3q'!U38","v":0}]
["Saldo devedor",null,{"$f":"'mod10 3q'!C40","v":0},{"$f":"'mod10 3q'!D40","v":""},0,0,null,{"$f":"'mod10 3q'!L39","v":"____/___/____"},{"$f":"'mod10 3q'!M39","v":0},{"$f":"'mod10 3q'!N39","v":"____/___/____"},{"$f":"'mod10 3q'!O39","v":"____/___/____"},null,{"$f":"'mod10 3q'!Q39","v":"____/___/____"},null,{"$f":"'mod10 3q'!S39","v":0},null,{"$f":"'mod10 3q'!U39","v":0}]
["Limite legal (art. 10 Res.nº 43 Senado)",null,{"$f":"'mod10 3q'!C41","v":1824538.1805},{"$f":"'mod10 3q'!D41","v":7.0000000000000009},317114.34999999998,7,null,{"$f":"'mod10 3q'!L40","v":"____/___/____"},{"$f":"'mod10 3q'!M40","v":0},{"$f":"'mod10 3q'!N40","v":"____/___/____"},{"$f":"'mod10 3q'!O40","v":"____/___/____"},null,{"$f":"'mod10 3q'!Q40","v":"____/___/____"},null,{"$f":"'mod10 3q'!S40","v":0},null,{"$f":"'mod10 3q'!U40","v":0}]
["Excesso a regularizar",null,{"$f":"'mod10 3q'!C42","v":""},{"$f":"'mod10 3q'!D42","v":""},0,0]
[]
["II –INDICAÇÃO DAS MEDIDAS ADOTADAS OU A ADOTAR  (caso ultrapasse os limites acima):"]
["texto"]
[{"$f":"IF(ISTEXT('mod10 3q'!A46),'mod10 3q'!A46,\"  \")","v":"  "}]
[{"$f":"IF(ISTEXT('mod10 3q'!A47),'mod10 3q'!A47,\"  \")","v":"  "}]
[{"$f":"IF(ISTEXT('mod10 3q'!A48),'mod10 3q'!A48,\"  \")","v":"  "},null,null,null,null,null,null,"Taubaté, 23 de janeiro de 2013"]
[{"$f":"IF(ISTEXT('mod10 3q'!A49),'mod10 3q'!A49,\"  \")","v":"  "}]
[{"$f":"IF(ISTEXT('mod10 3q'!A50),'mod10 3q'!A50,\"  \")","v":"  "}]
[{"$f":"IF(ISTEXT('mod10 3q'!A51),'mod10 3q'!A51,\"  \")","v":"  "}]
[{"$f":"IF(ISTEXT('mod10 3q'!A52),'mod10 3q'!A52,\"  \")","v":"  "},null,null,null,null,null,null,"                   Prof.Dr.Isnard de A.Cãmara Neto",null,null,null,"Maria Antonia Cristina Carvalho",null,null,"Larissa Diniz de Paula"]
[{"$f":"IF(ISTEXT('mod10 3q'!A53),'mod10 3q'!A53,\"  \")","v":"  "},null,null,null,null,null,null,"Diretor Presidente",null,null,null,"CRC: 1SP 186687/O-8",null,null,"Controlador Interno"]
[{"$f":"IF(ISTEXT('mod10 3q'!A54),'mod10 3q'!A54,\"  \")","v":"  "}]
[{"$f":"IF(ISTEXT('mod10 3q'!A55),'mod10 3q'!A55,\"  \")","v":"  "}]
[{"$f":"IF(ISTEXT('mod10 3q'!A56),'mod10 3q'!A56,\"  \")","v":"  "}]
[{"$f":"IF(ISTEXT('mod10 3q'!A57),'mod10 3q'!A57,\"  \")","v":"  "}]
[{"$f":"IF(ISTEXT('mod10 3q'!A58),'mod10 3q'!A58,\"  \")","v":"  "}]
[{"$f":"IF(ISTEXT('mod10 3q'!A59),'mod10 3q'!A59,\"  \")","v":"  "}]
[{"$f":"IF(ISTEXT('mod10 3q'!A60),'mod10 3q'!A60,\"  \")","v":"  "}]
[{"$f":"IF(ISTEXT('mod10 3q'!A61),'mod10 3q'!A61,\"  \")","v":"  "}]
[{"$f":"IF(ISTEXT('mod10 3q'!A62),'mod10 3q'!A62,\"  \")","v":"  "}]
[{"$f":"IF(ISTEXT('mod10 3q'!A63),'mod10 3q'!A63,\"  \")","v":"  "}]
[{"$f":"IF(ISTEXT('mod10 3q'!A64),'mod10 3q'!A64,\"  \")","v":"  "}]
[{"$f":"IF(ISTEXT('mod10 3q'!A65),'mod10 3q'!A65,\"  \")","v":"  "}]
[null,null,null,null,null,null,null,"          Taubaté, 23  de maio de 2014"]
[]
["         Taubaté, 23  de maio de 2014"]
[null,null,null,null,null,null,null,"                   Prof.Dr.Isnard de A.Cãmara Neto",null,"Maria Antonia Cristina Carvalho",null,"Josimere  S.  Costa"]
[null,null,null,null,null,null,null,"Diretor Presidente",null,"CRC: 1SP 186687/O-8",null,"Controlador Interno"]
["                   Prof.Dr.Isnard de A.Cãmara Neto",null,"Maria Antonia Cristina Carvalho",null,"Josimere dos Santos Costa"]
["Diretor Presidente",null,"CRC: 1SP 186687/O-8",null,"Controlador Interno"]

{"sheet":"Anexo1mod10","index":18,"n_rows":40,"n_cols":14,"rows_kept":40,"cut":false,"hidden":false,"merged":[[0,0,0,13],[1,0,1,13],[7,10,8,10],[7,11,8,11],[7,12,8,12],[7,5,8,5],[7,13,8,13],[7,0,8,0],[7,8,8,8],[7,9,8,9],[7,1,8,1],[7,2,8,2],[26,10,27,10],[7,4,8,4],[26,11,27,11],[7,6,8,6],[38,0,38,1],[38,5,38,7],[26,8,27,8],[38,11,38,13],[26,12,27,12],[26,13,27,13],[26,0,27,0],[7,3,8,3],[7,7,8,7],[26,7,27,7],[26,9,27,9]]}
["DEMONSTRATIVO DAS DESPESAS COM PESSOAL E PREVIDENCIÁRIAS"]
["(Artigo 22; Artigo 59, § 1º,incisos II e IV e § 2º  da Lei Complementar 101/00; §§ 1º e 2º do Artigo 2º da Lei Federal nº 9717/98)"]
[]
[{"$f":"'mod1 6b'!A5","v":"MUNICÍPIO DE TAUBATÉ  -  FUNDAÇÃO UNIVERSITÁRIA DE TAUBATÉ"}]
[{"$f":"'mod10 1q'!A6","v":"PODER EXECUTIVO MUNICIPAL"}]
["1º QUADRIMESTRE 2014"]
[null,null,null,null,null,null,null,null,null,null,null,null,null,"Valores expressos em R$"]
["DESPESAS COM PESSOAL","MAIO","JUNHO","JULHO","AGOSTO","SETEMBRO","OUTUBRO","NOVEMBRO","DEZEMBRO","JANEIRO","FEVEREIRO","MARÇO","MÊS REF.: ABRIL","Totais:"]
[]
["Despesas com Pessoal Ativo",924630.78,839258.94,791882.27,759835.63,739790.57,1328785.1499999999,1001838.03,1634823.48,1125603.3700000001,162577.88,227113.58,222138.5,{"$f":"SUM(B10:M10)","v":9758278.1799999997}]
["Mão-de-Obra terceirizada",null,null,null,null,null,null,null,null,null,null,null,null,{"$f":"SUM(B11:M11)","v":0}]
["Encargos Sociais ",65228.94,63179,55849.54,57248.89,55875,102109.68,106283.99,115492.79,76943.039999999994,18778.939999999999,16519.77,15666.94,749176.5199999999]
["Inativos",null,null,null,null," ",null,null,null,null,null,null,null,0]
["Pensionistas",null,null,null,null,null,null,null,null,null,null,null,null,0]
["Salário Família",7948.42,3068.44,2681.02,2742.01,2673.94,411.57,280.32,396.82,606.47,391.65,407.24,372.23,21980.13]
["Sentenças Judiciais do período",null,null,null,null,null,null,null,null,null,null,null,null,0]
["Outras desp.com pessoal (PASEP etc)",null,null,null,null,null,null,null,null,null,null,null,null,0]
["Subtotal",{"$f":"SUM(B10:B17)","v":997808.14},905506.37999999989,850412.83000000007,819826.53,798339.50999999989,1431306.4,1108402.3400000001,1750713.09,{"$f":"SUM(J10:J17)","v":1203152.8800000001},181748.47,244040.58999999997,238177.67,10529434.83]
["(-) DEDUÇÕES (§1º do art. 19)"]
["Indenização por demissão  (inc.I)",null,null,null,null,null,null,null,null,null,null,null,null,0]
["Incentivos à demissão voluntária (inc.II)",null,null,null,null,null,null,null,null,null,null,null,null,0]
["Decisão Judicial de compet.anterior(inc.IV)",null,null,null,null,null,null,null,null,null,null,null,null,0]
["Inativos e Pensionistas (inc.VI)",null,null,null,null,null,null,null,null,null,null,null,null,0]
["Subtotal",{"$f":"SUM(B20:B23)","v":0},0,0,0,0,0,0,0,{"$f":"SUM(J20:J23)","v":0},0,0,0,0]
["TOTAL",{"$f":"B18-B24","v":997808.14},905506.37999999989,850412.83000000007,819826.53,798339.50999999989,1431306.4,1108402.3400000001,1750713.09,{"$f":"J18-J24","v":1203152.8800000001},181748.47,244040.58999999997,238177.67,10529434.83]
[]
["DESPESAS COM PESSOAL INATIVO E PENSIONISTAS",{"$f":"B8","v":"MAIO"},"JUNHO","JULHO","AGOSTO","SETEMBRO","OUTUBRO","NOVEMBRO","DEZEMBRO",{"$f":"J8","v":"JANEIRO"},"FEVEREIRO","MARÇO","MÊS REF.: ABRIL","Totais:"]
[]
["Despesas com Pessoal Inativo",null,null,null,null,null,null,null,null,null,null,null,null,{"$f":"SUM(B29:M29)","v":0}]
["Despesas com Pensionistas",null,null,null,null,null,null,null,null,null,null,null,null,0]
["Outros benefícios e desp. com Inativos",null,null,null,null,null,null,null,null,null,null,null,null,0]
["Subtotal",{"$f":"SUM(B29:B31)","v":0},0,0,0,0,0,0,0,{"$f":"SUM(J29:J31)","v":0},0,0,0,0]
["(-) DEDUÇÕES"]
["Contribuições dos Segurados",null,null,null,null,null,null,null,null,null,null,null,null,0]
["TOTAL DESPESAS LÍQUIDAS ",{"$f":"B32-B34","v":0},0,0,0,0,0,0,0,{"$f":"J32-J34","v":0},0,0,0,0]
[]
[]
[]
["Prof.Dr.Isnard de A.Câmara Neto",null,null,null,null,"Maria Antonia Cristina Carvalho",null,null,null,null,null,"Josimere dos Santos Costa"]
[" Diertor Presidente",null,null,null,null,null,"CRC: 1SP 186687/O-8",null,null,null,null,null,"Controlador Interno"]

{"sheet":"INCO","index":19,"n_rows":24,"n_cols":11,"rows_kept":24,"cut":false,"hidden":true,"merged":[[1,2,1,6],[2,1,2,6]]}
[]
[]
[null,"Inconsistências nos Relatórios e Demonstrativos:"]
[null,null," "]
[null,{"$f":"'mod1 6b'!A5","v":"MUNICÍPIO DE TAUBATÉ  -  FUNDAÇÃO UNIVERSITÁRIA DE TAUBATÉ"}]
[null,{"$f":"'mod10 3q'!A6","v":"PODER EXECUTIVO MUNICIPAL"}]
[null,{"$f":"'mod1 6b'!A6","v":"3ºBIMESTRE 2014"}]
[]
[null,"Nº"," VERIFICAÇÃO",null,null,null,null,null,null,null,"Confere ?"]
[null,1,"Verificar no Mod.1 se o Total da Dotação Inicial confere com o total das Dotação Inicial do Mod.2",null,null,null,null,null,null,null,{"$f":"IF('mod1 6b'!C52='mod2 6b'!E320,\"sim\",\"não\")","v":"sim"}]
[null,2,"Verificar no Mod.1 se o Total das Despesas Empenhadas conferem com o total das Despesas Empenhadas do Mod.2",null,null,null,null,null,null,null,{"$f":"IF('mod1 6b'!P52='mod2 6b'!R320,\"sim\",\"não\")","v":"sim"}]
[null,3,"Verificar no Mod.1 se o Total das Despesas Liquidadas conferem com o total das Despesas Liquidadas do Mod.2",null,null,null,null,null,null,null,{"$f":"IF('mod1 6b'!Q52='mod2 6b'!S320,\"sim\",\"não\")","v":"sim"}]
[null,4,"Verificar no Mod.1 - Anexo - se o total das Receitas Acumuladas conferem com os Acumulados das Receitas Realizadas do Mod.1.",null,null,null,null,null,null,null,{"$f":"IF('mod1 anexo'!C45='mod1 6b'!Q36,\"sim\",\"não\")","v":"sim"}]
[null,5,"Verificar no Mod.1 - Anexo - se o total das Despesas Empenhadas Acumuladas conferem com os Acumulados das Despesas Empenhadas do Mod.1.",null,null,null,null,null,null,null,{"$f":"IF('mod1 anexo'!E45='mod1 6b'!P52,\"sim\",\"não\")","v":"não"}]
[null,6,"Verificar no Mod.1 - Anexo - se o total das Despesas Liquidadas Acumuladas conferem com os Acumulados das Despesas Liquidadas do Mod.1.",null,null,null,null,null,null,null,{"$f":"IF('mod1 6b'!Q52='mod1 anexo'!G45,\"sim\",\"não\")","v":"não"}]
[null,7,"Verificar no Mod.3 se o Total das Contrib.dos Servidores ao Reg.Próp. Previd. conferem as Contribuições dos Servidores ativos, inativos e pensionistas até o Bimestre do Mod.4.",null,null,null,null,null,null,null,{"$f":"IF('mod 3'!O20='mod 4'!F13+'mod 4'!F14+'mod 4'!F15,\"sim\",\"não\")","v":"sim"}]
[null,8,"Verificar no Mod.3 se o Total das Compensações Financeiras entre regimes de previd. conferem as Receitas de Compensações Previdenciárias até o Bimestre do Mod.4.",null,null,null,null,null,null,null,{"$f":"IF('mod 3'!O21='mod 4'!F17,\"sim\",\"não\")","v":"sim"}]
[null,7,"Verificar no Mod.3 se o subtotal das Receitas Correntes do mês de referência e mês anterior é igual à Receita Realizada no Bimestre correspondente do Mod. 1",null,null,null,null,null,null,null,{"$f":"IF('mod 3'!N17+'mod 3'!M17='mod1 1b'!E11+'mod1 1b'!E26,\"sim\",\"não\")","v":"sim"}]
[null,8,"Verificar no Mod.5 se no Resultado Primário as Deduções de Receitas de Privatizações do Bim. conferem com as Receitas de Privatizações do Resultado Nominal do Bim. atual do Mod.5",null,null,null,null,null,null,null,{"$f":"IF('mod 5'!G17='mod 5'!D53,\"sim\",\"não\")","v":"sim"}]
[null,8,"Verificar no Mod.10 se a RCL confere com o total apurado no Mod.3.",null,null,null,null,null,null,null,{"$f":"IF('mod10 1q'!E11='mod 3'!O27,\"sim\",\"não\")","v":"não"}]
[null,9,"Verificar no Mod.10 se as Despesas Totais com Pessoal conferem com o Total apurado no Anexo 1 do Mod.10.",null,null,null,null,null,null,null,{"$f":"IF('mod10 1q'!E14=Anexo1mod10!N25,\"sim\",\"não\")","v":"não"}]
[null,10,"Verificar no Mod.10 se as Despesas Líquidas com Inativos e Pensionistas conferem com o Total apurado no Anexo 1 do Mod.10.",null,null,null,null,null,null,null,{"$f":"IF('mod10 1q'!E20=Anexo1mod10!N35,\"sim\",\"não\")","v":"não"}]
[null,11,"Verificar no Mod.10 se o saldo devedor da Dívida Consolidada Líquida Até o Bimestre Confere com o mesmo saldo no Resultado Nominal do Mod.5",null,null,null,null,null,null,null,{"$f":"IF('mod10 1q'!E25='mod 5'!D51,\"sim\",\"não\")","v":"não"}]
[null,12,"Verificar no Mod.10 se o valor das Operações de Crédito realizadas no período conferem com as dos Mod.1 e 5 do período",null,null,null,null,null,null,null,{"$f":"IF(('mod10 3q'!E35+'mod10 3q'!G35+'mod10 3q'!I35)= 'mod1 1b'!G29,\"sim\",\"não\")","v":"sim"}]

{"sheet":"Protocolo","index":20,"n_rows":52,"n_cols":7,"rows_kept":52,"cut":false,"hidden":true,"merged":[[21,2,22,2],[26,2,27,2],[5,1,5,6],[2,2,2,6],[3,2,3,6],[19,2,20,2]]}
[]
[]
[null,null,"                                         TRIBUNAL DE CONTAS DO ESTADO DE SÃO PAULO                               "]
[null,null,"                                               - FISCALIZAÇÃO DO CUMPRIMENTO DA LC 101/00 -                                     "]
[null,null," "]
[null,"Protocolo de entrega dos relatórios por meio magnético"]
[]
[null,{"$f":"'mod1 6b'!A5","v":"MUNICÍPIO DE TAUBATÉ  -  FUNDAÇÃO UNIVERSITÁRIA DE TAUBATÉ"}]
[null,{"$f":"'mod10 3q'!A6","v":"PODER EXECUTIVO MUNICIPAL"}]
[null,{"$f":"'mod1 6b'!A6","v":"3ºBIMESTRE 2014"}]
[]
[]
[null,"Mod.","Descrição","Valores:"]
[null,1,"RREO","Superávit/Déficit"]
[null,null,null,"Do Bimestre:",{"$f":"'mod1 1b'!D53","v":-46288.51},"Acumulado:",{"$f":"'mod1 1b'!F53","v":1755323.5}]
[null,1,"RREO - Anexo","Resultado   Total:",null,null,{"$f":"'mod1 anexo'!H45","v":-1701118.9699999997}]
[null,2,"RREO - Função/Subf.","Despesas Totais:"]
[null,null,null,"Do Bimestre:",{"$f":"'mod2 1b'!F320","v":3166854.51},"Acumulado:",{"$f":"'mod2 1b'!H320","v":7606374.5}]
[null,3,"RCL","RCL apurada até o mês de referência:",null,null,{"$f":"'mod 3'!O27","v":16446787.879999999}]
[null,4,"Rec. e Despesas Previdenciárias","Superávit/Déficit acumulado:",null,null,{"$f":"'mod 4'!E30","v":0}]
[null,null,null,"Total Disp. Financeira",null,null,{"$f":"'mod 4'!G39","v":0}]
[null,5,"Resultado Nominal e Primário","Resultado Primário:",null,"Resultado Nominal"]
[null,null,null,"Do Bimestre:",{"$f":"'mod 5'!F41","v":-46288.509999999776},"Do Bimestre:",{"$f":"'mod 5'!E54","v":63542.14999999851}]
[null,null,null,"Até o Bimestre",{"$f":"'mod 5'!G41","v":-1707686.9699999988},"Até o Bimestre",{"$f":"'mod 5'!G54","v":-2155246.0300000012}]
[null,6,"Restos a Pagar:","Montante a Pagar",null,null,{"$f":"'mod 6'!I49","v":-1361238.64}]
[null,null,null,"Disponibilidade Financeira",null,null,{"$f":"'mod 6'!J49","v":108335.84}]
[null,7,"Oper.Créditos x Desp. de Capital","Despesas de Capital Líquidas:",null,null,{"$f":"'mod 7'!G46","v":0}]
[null,null,null,"Total Oper.Crédito:",null,null,{"$f":"'mod 7'!H46","v":0}]
[null,8,"Projeções Atuariais","Resultado próximo exercício:",null,null,{"$f":"'mod 8'!D16","v":0}]
[null,null,null,"Resultado último exercício:",null,null,{"$f":"'mod 8'!D50","v":0}]
[null,9,"Var.Patrim. e Aplic. Rec.",{"$f":"\"Resultado Patrimonial:        \"&'mod 9'!E27","v":"Resultado Patrimonial:        VARIAÇÃO POSITIVA ="},null,null,{"$f":"'mod 9'!G27:H27","v":0}]
[null,null,null,"Saldo financeiro a aplicar",null,null,{"$f":"'mod 9'!G69","v":0}]
[null,10,"RGF","RCL apurada até o mês de referência:",null,null,{"$f":"'mod10 1q'!E11","v":4530204.97}]
[null,null,null,"Despesas com Pessoal",null,null,{"$f":"'mod10 1q'!E14","v":1867119.61}]
[null,null,null,"Despesas com Inativos e Pensionistas",null,null,{"$f":"'mod10 1q'!E20","v":4439519.99}]
[null,null,null,"Saldo da Dívida Consolidada Líquida",null,null,{"$f":"'mod10 1q'!E25","v":53576312.93}]
[null,null,null,"Montante das Concessões de Garantia",null,null,{"$f":"'mod10 1q'!E30","v":0}]
[null,null,null,"Oper.Crédito realizadas",null,null,{"$f":"'mod10 1q'!E35","v":0}]
[null,null,null,"Saldo devedor de ARO",null,null,{"$f":"'mod10 1q'!E40","v":0}]
[null,null,null,"Disponibilidades menos compromissos a pagar até 31/12",null,null,{"$f":"'mod10 1q'!J21","v":0}]
[null,null,null,"Inscrição em Restos a Pagar",null,null,{"$f":"'mod10 1q'!Q16","v":0}]
[null,null,null,"Serviços de Terceiros do exercício ",null,null,{"$f":"IF(ISNUMBER($G$33),'mod10 3q'!T20,G34)","v":0}]
[null,10,"RGF - Anexo I","Total Despesas com Pessoal",null,null,{"$f":"Anexo1mod10!N25","v":10529434.83}]
[null,null,null,"Total Despesas Líquidas Inativos/Pensionistas",null,null,{"$f":"Anexo1mod10!N35","v":0}]
[]
[]
[]
[null,null,"Data/Local da elaboração:"]
[]
[]
[null,null,"_________________","_________________",null,"_______________________"]
[null,null,"Prefeito Municipal","Contabilista - nº CRC",null,"Resp. pelo Controle Interno"]