{"text_format":"1","workbook":"xlsx","n_sheets":21,"sheets":["MENU1","MENU2","CAD","COM","mod1 6b","mod1 1b","mod1 anexo","mod2 6b","mod2 1b","mod 3","mod 4","mod 5","mod 6","mod 7","mod 8","mod 9","mod10 3q","mod10 1q","Anexo1mod10","INCO","Protocolo"],"not_rendered":{"charts":0,"images":2,"macros":1,"external_links":0,"defined_names":28,"comments":0,"pivot_tables":0},"unopened":[],"bounds":{"document_bytes":16777216,"sheet_cells":100000,"rows_first":2000,"rows_last":500,"rows_between":2000,"halvings":0,"cell_chars":16384,"cell_head_chars":4096},"cells_cut":0,"cells_raw":0,"read":"whole","date_system":"1900"}

{"sheet":"MENU1","index":0,"n_rows":22,"n_cols":8,"rows_kept":22,"cut":false,"hidden":false,"merged":[[2,3,4,12],[10,1,10,5],[10,7,10,12],[6,1,8,12]]}
[]
[]
[null,null,null,"TRIBUNAL DE CONTAS DO ESTADO DE SÃO PAULO"]
[]
[]
[]
[null,"Planilha geradora dos Relatórios e Demonstrativos Bimestrais e Quadrimestrais exigidos pela Lei Complementar 101/00 - LRF - Versão 2008 -  atualizada em março de 2008 apenas para fins de publicação"]
[]
[]
[]
{"$rows_left_out":13}
{"sheet":"MENU2","index":1,"n_rows":18,"n_cols":8,"rows_kept":18,"cut":false,"hidden":false,"merged":[[2,3,4,12],[19,1,19,12],[14,7,14,12],[10,1,10,5],[10,7,10,12],[6,1,8,12]]}
[]
[]
[null,null,null,"TRIBUNAL DE CONTAS DO ESTADO DE SÃO PAULO"]
[]
[]
[]
[null,"Clique nos botões para digitar os dados relativos a cada relatório, conforme a periodicidade exigida e, após, clique em voltar. "]
[]
[]
[]
{"$rows_left_out":9}
{"sheet":"CAD","index":2,"n_rows":658,"n_cols":4,"rows_kept":658,"cut":false,"hidden":false,"merged":[[4,2,5,9]]}
[]
[]
[]
[null,null,"CADASTRO DE MUNICÍPIOS:"]
[null,null,"Caso não esteja relacionado o nome do seu Município, inclua-o na linha \"1\" e clique em Classificar."]
[]
[]
[]
[null,null,1,"TAUBATÉ  -  FUNDAÇÃO UNIVERSITÁRIA DE TAUBATÉ"]
[null,null,{"$f":"C9+1","v":2},"ADAMANTINA"]
{"$rows_left_out":649}
{"sheet":"COM","index":3,"n_rows":21,"n_cols":44,"rows_kept":21,"cut":false,"hidden":true,"merged":[]}
[]
[]
[]
[]
[null,null,null,null,null,null,null,null,null,null,null,null,null,null,null,null,null,null,null,null,null,null,null,null,null,null,null,null,"MUNICÍPIO:",null,null,null,"PERÍODO (RREO..)",null,null,"MÊS REF.","ANTERIORES",null,null,null,"ORDEM",null,"EXERCÍCIO"]
[null,null,null,null,null,null,null,null,null,null,null,null,null,null,null,null,null,null,null,null,null,null,null,null,null,null,null,null,1,{"$f":"LOOKUP(AC6,CAD!C9:C658,CAD!D9:D658)","v":"TAUBATÉ  -  FUNDAÇÃO UNIVERSITÁRIA DE TAUBATÉ"},null,null,"Resultado:",3,null,{"$f":"AH6*2","v":6},null,null,null,null,null,null,"Resultado:",12]
[null,null,null,null,null,null,null,null,null,null,null,null,null,null,null,null,null,null,null,null,null,null,null,null,null,null,null,null,null,null,null,1,"1º BIMESTRE",null,2,"FEVEREIRO","2000-01-15",{"$f":"LOOKUP($AJ$6,MONTH($AK$7:$AK$18),MONTH($AK$7:$AK$18-330))","v":7},1,"JANEIRO",{"$f":"LOOKUP(AL7,$AM$7:$AM$18,$AN$7:$AN$18)","v":"JULHO"},1,2001]
[null,null,null,null,null,null,null,null,null,null,null,null,null,null,null,null,null,null,null,null,null,null,null,null,null,null,null,null,null,null,null,2,"2º BIMESTRE ",null,4,"ABRIL","2000-02-15",{"$f":"LOOKUP($AJ$6,MONTH($AK$7:$AK$18),MONTH($AK$7:$AK$18-300))","v":8},2,"FEVEREIRO",{"$f":"LOOKUP(AL8,$AM$7:$AM$18,$AN$7:$AN$18)","v":"AGOSTO"},2,2002,8]
[null,null,null,null,null,null,null,null,null,null,null,null,null,null,null,null,null,null,null,null,null,null,null,null,null,null,null,null,null,null,null,3,"3º BIMESTRE",null,6,"JUNHO","2000-03-15",{"$f":"LOOKUP($AJ$6,MONTH($AK$7:$AK$18),MONTH($AK$7:$AK$18-270))","v":9},3,"MARÇO","SETEMBRO",3,2003]
[null,null,null,null,null,null,null,null,null,null,null,null,null,null,null,null,null,null,null,null,null,null,null,null,null,null,null,null,null,null,null,4,"4º BIMESTRE ",null,8,"AGOSTO","2000-04-15",{"$f":"LOOKUP($AJ$6,MONTH($AK$7:$AK$18),MONTH($AK$7:$AK$18-240))","v":10},4,"ABRIL","OUTUBRO",4,2004]
{"$rows_left_out":12}
{"sheet":"mod1 6b","index":4,"n_rows":59,"n_cols":18,"rows_kept":59,"cut":false,"hidden":false,"merged":[[36,1,36,2],[36,3,36,4],[36,5,36,6],[36,7,36,8],[57,6,57,8],[57,15,57,17],[36,9,36,10],[36,11,36,12],[36,13,36,14],[36,15,36,17],[0,0,0,17],[1,0,1,17],[2,0,2,17],[6,0,6,17],[7,1,7,2],[7,3,7,4],[7,5,7,6],[7,7,7,8],[7,11,7,12],[7,9,7,10],[7,13,7,14],[7,15,7,17]]}
["RELATÓRIO RESUMIDO DA EXECUÇÃO ORÇAMENTÁRIA "]
[" (Artigo  52, Incisos I e II, alíneas “a” e “b”, da LC. 101/00)"]
["- ADMINISTRAÇÃO DIRETA / INDIRETA / FUNDACIONAL -"]
[]
[{"$f":"\"MUNICÍPIO DE \"&COM!AD6","v":"MUNICÍPIO DE TAUBATÉ  -  FUNDAÇÃO UNIVERSITÁRIA DE TAUBATÉ"}]
["3ºBIMESTRE 2014"]
["Valores expressos em R$"]
["RECEITAS ","Previsão anual",null,"1º Bimestre",null,"2º Bimestre",null,"3º Bimestre",null,"4º Bimestre",null,"5º Bimestre",null,"6º Bimestre",null,"Acumulado"]
["Categoria Econômica/Fontes","Inicial","Atualizada","Previsto","Realizado ","Previsto","Realizado ","Previsto","Realizado ","Previsto","Realizado ","Previsto","Realizado ","Previsto","Realizado ","Previsto","Realizado","a realizar"]
[null,null,null,1,2,3,4,5,6,7,8,9,10,11,12]
{"$rows_left_out":50}
{"sheet":"mod1 1b","index":5,"n_rows":59,"n_cols":8,"rows_kept":59,"cut":false,"hidden":false,"merged":[[57,5,57,7],[57,2,57,3],[36,5,36,7],[36,1,36,2],[36,3,36,4],[7,5,7,7],[7,1,7,2],[7,3,7,4],[0,0,0,7],[1,0,1,7],[2,0,2,7],[6,0,6,7]]}
["RELATÓRIO RESUMIDO DA EXECUÇÃO ORÇAMENTÁRIA "]
[" (Artigo  52, Incisos I e II, alíneas “a” e “b”, da LC. 101/00)"]
["- ADMINISTRAÇÃO DIRETA / INDIRETA / FUNDACIONAL -"]
[]
[{"$f":"'mod1 6b'!A5","v":"MUNICÍPIO DE TAUBATÉ  -  FUNDAÇÃO UNIVERSITÁRIA DE TAUBATÉ"}]
["3º BIMESTRE 2014"]
["Valores expressos em R$"]
["RECEITAS ","Previsão anual",null,"3ºBIMESTRE",null,"Acumulado"]
["Categoria Econômica/Fontes","Inicial","Atualizada","Previsto","Realizado ","Previsto","Realizado","a realizar"]
[null,null,null,{"$f":"E10-1","v":5},{"$f":"COM!AH6*2","v":6}]
{"$rows_left_out":50}
{"sheet":"mod1 anexo","index":6,"n_rows":57,"n_cols":9,"rows_kept":57,"cut":false,"hidden":false,"merged":[[0,0,0,8],[1,0,1,8],[2,0,2,8],[7,0,7,8],[8,0,10,0],[50,6,50,8],[50,2,50,4],[8,7,8,8],[8,3,8,6],[8,1,8,2],[9,3,9,4],[9,5,9,6],[9,7,10,7],[9,8,10,8],[9,1,10,1],[9,2,10,2]]}
["                                                                                                              "]
[" (Artigo  52, Incisos I e II, alíneas “a” e “b”, da LC. 101/00)"]
["RESULTADO DA EXECUÇÃO ORÇAMENTÁRIA PODERES/ÓRGÃOS"]
[]
[]
[{"$f":"'mod1 6b'!A5","v":"MUNICÍPIO DE TAUBATÉ  -  FUNDAÇÃO UNIVERSITÁRIA DE TAUBATÉ"}]
["3º BIMESTRE DE  2014"]
["Valores expressos em R$"]
["PODERES/ÓRGÃOS","Receitas ",null,"Despesas",null,null,null,"Resultados"]
[null,"Bimestre","Acumulado (1)","Empenhada",null,"Liquidada",null,"Acumulado (3)=(1-2)","% = (3) / Total  (1)"]
{"$rows_left_out":48}
{"sheet":"mod2 6b","index":7,"n_rows":326,"n_cols":20,"rows_kept":326,"cut":false,"hidden":false,"merged":[[0,0,0,19],[1,0,1,19],[3,0,3,19],[6,0,6,19],[7,1,8,1],[7,0,8,0],[7,3,7,4],[7,11,7,12],[324,2,324,3],[7,13,7,14],[324,17,324,19],[324,8,324,10],[7,15,7,16],[7,17,7,19],[7,5,7,6],[7,7,7,8],[7,9,7,10]]}
["RELATÓRIO RESUMIDO DA EXECUÇÃO ORÇAMENTÁRIA "]
[" (Artigo  52, Inciso II, alínea “c” da LC. 101/00)"]
[]
["- ADMINISTRAÇÃO DIRETA / INDIRETA / FUNDACIONAL -"]
[{"$f":"'mod1 6b'!A5","v":"MUNICÍPIO DE TAUBATÉ  -  FUNDAÇÃO UNIVERSITÁRIA DE TAUBATÉ"}]
["3º BIMESTRE DE 2014"]
["Valores expressos em R$"]
["Cód. Função","Cód. Subf.","DESPESAS","Dotação Anual",null,"1º Bimestre",null,"2º Bimestre",null,"3º Bimestre",null,"4º Bimestre",null,"5º Bimestre",null,"6º Bimestre",null,"Acumulado"]
[null,null,"Funções/Subfunções","Inicial","Atualizada","Empenhado","Liquidado","Empenhado","Liquidado","Empenhado","Liquidado","Empenhado","Liquidado","Empenhado","Liquidado","Empenhado","Liquidado","Empenhado","Liquidado","A empenhar"]
[null,null,null,null,null,1,2,3,4,5,6,7,8,9,10,11,12]
{"$rows_left_out":317}
{"sheet":"mod2 1b","index":8,"n_rows":326,"n_cols":10,"rows_kept":326,"cut":false,"hidden":false,"merged":[[324,7,324,9],[6,0,6,9],[7,3,7,4],[7,5,7,6],[324,4,324,5],[0,0,0,9],[1,0,1,9],[2,0,2,9],[7,7,7,9],[7,0,8,0],[7,1,8,1]]}
["RELATÓRIO RESUMIDO DA EXECUÇÃO ORÇAMENTÁRIA "]
[" (Artigo  52, Inciso II, alínea “c” da LC. 101/00)"]
["- ADMINISTRAÇÃO DIRETA / INDIRETA / FUNDACIONAL -"]
[]
[{"$f":"'mod1 6b'!A5","v":"MUNICÍPIO DE TAUBATÉ  -  FUNDAÇÃO UNIVERSITÁRIA DE TAUBATÉ"}]
["3º BIMESTRE DE 2014"]
["Valores expressos em R$"]
["Cód. Função","Cód. Subf.","DESPESAS","Dotação Anual",null,"3ºBIMESTRE",null,"Acumulado"]
[null,null,"Funções/Subfunções","Inicial","Atualizada","Empenhado","Liquidado","Empenhado","Liquidado","a empenhar"]
[null,null,null,null,null,{"$f":"G10-1","v":5},{"$f":"COM!AH6*2","v":6}]
{"$rows_left_out":317}
{"sheet":"mod 3","index":9,"n_rows":33,"n_cols":17,"rows_kept":33,"cut":false,"hidden":false,"merged":[[22,0,22,1],[23,0,23,1],[24,0,24,1],[25,0,25,1],[31,12,31,14],[26,0,26,1],[27,0,27,6],[31,0,31,1],[31,6,31,8],[9,7,10,7],[9,10,10,10],[9,11,10,11],[21,0,21,1],[14,0,14,1],[15,0,15,1],[11,0,11,1],[12,0,12,1],[13,0,13,1],[16,0,16,1],[20,0,20,1],[19,0,19,1],[17,0,17,1],[18,0,18,1],[9,16,10,16],[9,13,10,13],[9,6,10,6],[0,0,0,16],[1,0,1,16],[2,0,2,16],[9,0,10,1],[9,2,10,2],[9,3,10,3],[9,14,10,14],[9,15,10,15],[9,8,10,8],[9,9,10,9],[9,12,10,12],[9,4,10,4],[9,5,10,5]]}
["RECEITA CORRENTE LÍQUIDA"]
["(Artigo 2º, Inciso IV e 53, Inciso I da LC. 101/00)"]
["ADMINISTRAÇÃO DIRETA, INDIRETA E FUNDACIONAL "]
[]
[{"$f":"'mod1 6b'!A5","v":"MUNICÍPIO DE TAUBATÉ  -  FUNDAÇÃO UNIVERSITÁRIA DE TAUBATÉ"}]
[]
["3º BIMESTRE 2014"]
[]
[null,null,null,null,null,null,null,null,null,null,null,null,null,null,null,null,"Valores expressos em R$"]
["RECEITAS CORRENTES",null,"JULHO","AGOSTO","SETEMBRO","OUTUBRO","NOVEMBRO","DEZEMBRO","JANEIRO","FEVEREIRO","MARÇO","ABRIL","MAIO","MÊS DE REF. JUNHO","TOTAL","Apuração Bimestre Anterior","Previsão atualizadada Exercício"]
{"$rows_left_out":24}
{"sheet":"mod 4","index":10,"n_rows":50,"n_cols":8,"rows_kept":50,"cut":false,"hidden":false,"merged":[[18,6,18,7],[16,6,16,7],[19,6,19,7],[15,6,15,7],[0,0,0,7],[1,0,1,7],[2,0,2,7],[9,0,10,1],[9,6,10,7],[9,2,9,3],[9,4,9,5],[11,6,11,7],[12,6,12,7],[13,6,13,7],[14,6,14,7],[17,6,17,7],[48,2,48,3],[48,5,48,7],[36,0,36,1],[37,0,37,1],[43,0,43,1],[42,6,42,7],[39,4,39,5],[43,2,43,3],[43,6,43,7],[41,0,41,1],[42,0,42,1],[42,4,42,5],[43,4,43,5],[42,2,42,3],[41,6,41,7],[39,0,39,1],[40,0,40,1],[39,6,39,7],[40,6,40,7],[41,2,41,3],[38,0,38,1],[39,2,39,3],[40,2,40,3],[40,4,40,5],[38,2,38,3],[38,4,38,5],[37,6,37,7],[35,6,35,7],[33,6,33,7],[34,0,34,1],[35,0,35,1],[36,4,36,5],[37,4,37,5],[33,4,33,5],[34,4,34,5],[35,4,35,5],[33,0,33,1],[35,2,35,3],[36,2,36,3],[37,2,37,3],[34,2,34,3],[33,2,33,3],[32,0,32,1],[31,2,31,3],[36,6,36,7],[21,7,22,7],[41,4,41,5],[21,0,22,0],[38,6,38,7],[32,4,32,5],[32,6,32,7],[21,1,21,2],[21,3,21,4],[21,5,21,6],[31,6,31,7],[32,2,32,3],[31,4,31,5],[34,6,34,7]]}
["DEMONSTRATIVO DAS RECEITAS E DESPESAS PREVIDENCIÁRIAS"]
["(Artigos 53, Inciso II e 50, Inciso IV da LC. 101/00)"]
["ADMINISTRAÇÃO DIRETA, INDIRETA E FUNDACIONAL "]
[]
[{"$f":"'mod1 6b'!A5","v":"MUNICÍPIO DE TAUBATÉ  -  FUNDAÇÃO UNIVERSITÁRIA DE TAUBATÉ"}]
[]
["3º BIMESTRE 2014"]
[]
[null,null,null,null,null,null,null,"Valores expressos em R$"]
["I –RECEITAS PREVIDENCIÁRIAS",null,"Previsão Anual",null,"Receitas Realizadas",null,"Saldo a Realizar"]
{"$rows_left_out":41}
{"sheet":"mod 5","index":11,"n_rows":93,"n_cols":8,"rows_kept":93,"cut":false,"hidden":false,"merged":[[53,6,53,7],[91,2,91,4],[91,6,91,7],[47,6,47,7],[48,6,48,7],[50,6,50,7],[52,6,52,7],[50,4,50,5],[52,4,52,5],[53,4,53,5],[48,4,48,5],[47,4,47,5],[25,7,26,7],[29,0,29,1],[30,0,30,1],[31,0,31,1],[32,0,32,1],[27,0,27,1],[28,0,28,1],[25,0,26,1],[0,0,0,7],[1,0,1,7],[2,0,2,7],[9,2,9,4],[9,5,9,6],[9,0,10,1],[9,7,10,7],[17,0,17,1],[44,4,44,5],[44,6,44,7],[11,0,11,1],[25,2,25,4],[25,5,25,6],[23,0,23,1],[12,0,12,1],[13,0,13,1],[14,0,14,1],[16,0,16,1],[15,0,15,1],[18,0,18,1],[19,0,19,1],[22,0,22,1],[20,0,20,1],[45,6,45,7],[45,4,45,5],[46,6,46,7],[43,1,43,3],[33,0,33,1],[46,4,46,5],[38,0,38,1],[40,0,40,1],[37,0,37,1],[43,4,43,7],[39,0,39,1],[34,0,34,1],[35,0,35,1],[36,0,36,1]]}
["RESULTADOS NOMINAL E PRIMÁRIO"]
["(Art.  53, Inciso III da LC. 101/00)"]
["ADMINISTRAÇÃO DIRETA, INDIRETA E FUNDACIONAL "]
[]
[]
[{"$f":"'mod1 6b'!A5","v":"MUNICÍPIO DE TAUBATÉ  -  FUNDAÇÃO UNIVERSITÁRIA DE TAUBATÉ"}]
["3º BIMESTRE DE 2014"]
[]
["RESULTADO PRIMÁRIO",null,null,null,null,null,null,"Valores expressos em R$"]
["RECEITAS FISCAIS",null,"Previsão Atualizada",null,null,"Realização",null,"Período Exercício Anterior"]
{"$rows_left_out":84}
{"sheet":"mod 6","index":12,"n_rows":55,"n_cols":10,"rows_kept":55,"cut":false,"hidden":false,"merged":[[9,9,11,9],[9,0,11,0],[9,2,9,3],[9,4,9,7],[10,4,10,5],[10,6,10,7],[9,8,11,8],[53,3,53,4],[53,7,53,8],[0,0,0,8],[1,0,1,8],[2,0,2,8],[9,1,11,1],[10,2,11,2],[10,3,11,3],[53,0,53,1]]}
["DEMONSTRATIVO DOS RESTOS A PAGAR"]
["(Artigo 53, Inciso V, da LC. 101/00)"]
["ADMINISTRAÇÃO DIRETA, INDIRETA E FUNDACIONAL"]
[]
[{"$f":"'mod1 6b'!A5","v":"MUNICÍPIO DE TAUBATÉ  -  FUNDAÇÃO UNIVERSITÁRIA DE TAUBATÉ"}]
[]
["3º BIMESTRE DE 2014"]
[]
[]
["PODER / ÓRGÃO / ENTIDADES","Saldo de Exercícios Anteriores","Inscrições",null,"Baixas",null,null,null,"Montante a Pagar","Disponibilidade Financeira"]
{"$rows_left_out":46}
{"sheet":"mod 7","index":13,"n_rows":85,"n_cols":8,"rows_kept":85,"cut":false,"hidden":false,"merged":[[78,0,78,7],[83,2,83,3],[83,5,83,7],[0,0,1,7],[2,0,2,7],[3,0,3,7],[10,6,12,6],[10,7,12,7],[10,0,12,0],[10,1,10,2],[10,4,10,5],[11,5,12,5],[11,1,12,1],[11,2,12,2],[10,3,12,3],[11,4,12,4]]}
["COMPARATIVO DAS RECEITAS DE OPERAÇÕES DE CRÉDITO E                                               DESPESAS DE CAPITAL"]
[]
["(Artigos 53, §1º, Inciso I, e 38, §1º,  da LC. 101/00)"]
["ADMINISTRAÇÃO DIRETA, INDIRETA E FUNDACIONAL"]
[]
[]
[{"$f":"'mod1 6b'!A5","v":"MUNICÍPIO DE TAUBATÉ  -  FUNDAÇÃO UNIVERSITÁRIA DE TAUBATÉ"}]
[]
["ANO DE 2014"]
["                                                                ",null,"  ",null,null,null,null,"Valores expressos em R$"]
{"$rows_left_out":76}
{"sheet":"mod 8","index":14,"n_rows":59,"n_cols":4,"rows_kept":59,"cut":false,"hidden":false,"merged":[[57,1,57,2],[0,0,2,3],[3,0,3,3],[4,0,4,3],[52,0,52,1],[56,1,56,2]]}
["DEMONSTRATIVO DAS PROJEÇÕES ATUARIAIS DO REGIME DE  PREVIDENCIA PRÓPRIA"]
[]
[]
["(Artigo 53, §1º, Inciso II da LC 101/00)"]
["ADMINISTRAÇÃO DIRETA, INDIRETA E FUNDACIONAL"]
[null," "]
[]
[{"$f":"'mod1 6b'!A5","v":"MUNICÍPIO DE TAUBATÉ  -  FUNDAÇÃO UNIVERSITÁRIA DE TAUBATÉ"}]
[]
["FUNDO/ENTIDADE:"]
{"$rows_left_out":50}
{"sheet":"mod 9","index":15,"n_rows":105,"n_cols":8,"rows_kept":105,"cut":false,"hidden":false,"merged":[[16,6,16,7],[13,6,13,7],[14,4,14,5],[14,6,14,7],[11,4,11,5],[11,6,11,7],[12,4,12,5],[12,6,12,7],[13,4,13,5],[103,2,103,3],[31,6,32,6],[31,3,31,5],[31,2,32,2],[18,4,18,5],[19,4,19,5],[19,6,19,7],[17,4,17,5],[17,6,17,7],[103,5,103,7],[24,4,24,5],[24,6,24,7],[26,4,26,5],[26,6,26,7],[25,4,25,5],[25,6,25,7],[20,6,20,7],[21,4,21,5],[21,6,21,7],[22,6,22,7],[23,4,23,5],[0,0,1,7],[2,0,2,7],[3,0,3,7],[100,0,100,7],[31,7,32,7],[31,0,32,0],[31,1,32,1],[22,4,22,5],[10,4,10,5],[10,6,10,7],[15,4,15,5],[15,6,15,7],[16,4,16,5],[18,6,18,7],[23,6,23,7],[20,4,20,5]]}
["                      DEMONSTRATIVO DA VARIAÇÃO PATRIMONIAL E APLICAÇÃO DE RECURSOS DECORRENTES DA ALIENAÇÃO DE ATIVOS"]
[]
["(Artigo 53, §1º, Inciso III, da LC 101/00)"]
["ADMINISTRAÇÃO DIRETA, INDIRETA E FUNDACIONAL "]
[]
[{"$f":"'mod1 6b'!A5","v":"MUNICÍPIO DE TAUBATÉ  -  FUNDAÇÃO UNIVERSITÁRIA DE TAUBATÉ"}]
[]
["ANO DE 2014"]
[]
[]
{"$rows_left_out":96}
{"sheet":"mod10 3q","index":16,"n_rows":65498,"n_cols":22,"rows_kept":65498,"cut":false,"hidden":false,"merged":[[38,20,38,21],[37,18,37,19],[38,18,38,19],[39,18,39,19],[65497,20,65497,21],[28,20,28,21],[29,20,29,21],[26,20,26,21],[27,20,27,21],[30,20,30,21],[31,20,31,21],[32,20,32,21],[33,20,33,21],[34,20,34,21],[43,18,43,21],[30,18,30,19],[31,18,31,19],[32,18,32,19],[33,18,33,19],[34,18,34,19],[35,18,35,19],[36,18,36,19],[39,20,39,21],[35,20,35,21],[36,20,36,21],[37,20,37,21],[27,14,27,15],[26,16,26,17],[30,14,30,15],[28,16,28,17],[29,16,29,17],[25,14,25,15],[26,14,26,15],[37,16,37,17],[25,20,25,21],[19,16,19,18],[31,16,31,17],[27,16,27,17],[18,16,18,18],[30,16,30,17],[23,20,24,21],[19,13,19,14],[23,13,23,17],[16,19,17,20],[16,16,17,18],[26,18,26,19],[25,18,25,19],[27,18,27,19],[28,18,28,19],[29,18,29,19],[25,16,25,17],[10,20,10,21],[14,20,14,21],[14,16,14,19],[15,16,15,18],[19,19,19,20],[22,11,22,21],[23,12,24,12],[11,20,11,21],[13,20,13,21],[10,16,10,19],[11,16,11,19],[13,16,13,19],[18,19,18,20],[16,21,17,21],[23,18,24,19],[18,13,18,14],[23,11,24,11],[24,14,24,15],[24,16,24,17],[13,13,13,14],[10,13,10,14],[14,11,14,12],[17,13,17,14],[15,13,15,14],[11,13,11,14],[14,13,14,14],[16,13,16,14],[0,0,0,9],[1,0,1,9],[9,2,9,3],[11,11,11,12],[10,0,10,1],[10,2,10,3],[10,4,10,5],[9,8,9,9],[17,11,17,12],[15,11,15,12],[16,11,16,12],[9,6,9,7],[13,11,13,12],[10,8,10,9],[10,6,10,7],[9,4,9,5],[70,0,70,1],[70,3,70,5],[43,11,43,12],[38,14,38,15],[70,7,70,9],[34,16,34,17],[35,16,35,17],[29,14,29,15],[28,14,28,15],[32,14,32,15],[34,14,34,15],[31,14,31,15],[39,14,39,15],[35,14,35,15],[36,14,36,15],[37,14,37,15],[32,16,32,17],[33,16,33,17],[39,16,39,17],[36,16,36,17],[43,14,43,16],[38,16,38,17],[33,14,33,15]]}
["RELATÓRIO DE GESTÃO FISCAL"]
["(Artigos 54 e 55 da LC 101/00)"]
[]
[]
[{"$f":"'mod1 6b'!A5","v":"MUNICÍPIO DE TAUBATÉ  -  FUNDAÇÃO UNIVERSITÁRIA DE TAUBATÉ"}]
[{"$f":"\"PODER \"&COM!AC15","v":"PODER EXECUTIVO MUNICIPAL"}]
["1º QUADRIMESTRE 2014"]
[]
["I – COMPARATIVOS: ",null,null,null,null,null,null,null,null,"Valores expressos em R$",null,"III – DEMONSTRATIVOS:"]
[null,null,"Exercício Anterior",null,"1º Quadrimestre",null,"2º Quadrimestre",null,"3º Quadrimestre"]
{"$rows_left_out":65489}
{"sheet":"mod10 1q","index":17,"n_rows":72,"n_cols":18,"rows_kept":72,"cut":false,"hidden":false,"merged":[[27,10,27,11],[27,12,27,13],[27,14,27,15],[27,16,27,17],[26,12,26,13],[26,14,26,15],[26,16,26,17],[31,14,31,15],[31,16,31,17],[30,10,30,11],[30,12,30,13],[30,16,30,17],[29,10,29,11],[29,12,29,13],[29,14,29,15],[29,16,29,17],[24,7,25,7],[24,8,25,8],[24,16,25,17],[25,10,25,11],[26,10,26,11],[17,17,18,17],[18,7,18,8],[18,9,18,10],[17,12,18,14],[17,7,17,8],[25,12,25,13],[19,12,19,14],[19,15,19,16],[20,12,20,14],[17,15,18,16],[24,9,24,13],[24,14,25,15],[19,9,19,10],[20,9,20,10],[23,7,23,17],[20,15,20,16],[17,9,17,10],[12,12,12,15],[12,16,12,17],[16,7,16,8],[16,12,16,14],[15,7,15,8],[15,12,15,15],[15,9,15,10],[16,9,16,10],[13,12,13,15],[15,16,15,17],[13,9,13,10],[13,16,13,17],[14,12,14,15],[14,16,14,17],[14,7,14,8],[14,9,14,10],[0,0,0,5],[1,0,1,5],[9,2,9,3],[9,4,9,5],[10,4,10,5],[11,9,11,10],[10,0,10,1],[10,2,10,3],[11,12,11,15],[11,16,11,17],[12,7,12,8],[12,9,12,10],[70,4,70,5],[28,16,28,17],[28,14,28,15],[28,12,28,13],[28,10,28,11],[30,14,30,15],[34,10,34,11],[32,10,32,11],[31,10,31,11],[31,12,31,13],[33,10,33,11],[33,12,33,13],[33,14,33,15],[33,16,33,17],[32,12,32,13],[32,14,32,15],[32,16,32,17],[35,10,35,11],[35,12,35,13],[35,14,35,15],[35,16,35,17],[34,12,34,13],[34,14,34,15],[34,16,34,17],[37,10,37,11],[37,12,37,13],[37,14,37,15],[37,16,37,17],[36,10,36,11],[36,12,36,13],[36,14,36,15],[36,16,36,17],[39,10,39,11],[39,12,39,13],[39,14,39,15],[39,16,39,17],[38,10,38,11],[38,14,38,15],[38,16,38,17],[38,12,38,13],[71,4,71,5],[51,14,51,17],[52,14,52,17],[51,7,51,8],[52,7,52,8],[40,10,40,11],[40,12,40,13],[40,14,40,15],[40,16,40,17],[68,11,68,12],[69,11,69,12]]}
["RELATÓRIO DE GESTÃO FISCAL"]
["(Artigos 54 e 55 da LC 101/00)"]
[]
[]
[{"$f":"'mod1 6b'!A5","v":"MUNICÍPIO DE TAUBATÉ  -  FUNDAÇÃO UNIVERSITÁRIA DE TAUBATÉ"}]
[{"$f":"'mod10 3q'!A6","v":"PODER EXECUTIVO MUNICIPAL"}]
["1ºQUADRIMESTRE 2014"]
[]
["I – COMPARATIVOS: ",null,null,null,null,"Valores expressos em R$"]
[null,null,"EXERCÍCIO ANTERIOR",null,"1ºQUADRIMESTRE",null,null,"III – DEMONSTRATIVOS:"]
{"$rows_left_out":63}
{"sheet":"Anexo1mod10","index":18,"n_rows":40,"n_cols":14,"rows_kept":40,"cut":false,"hidden":false,"merged":[[0,0,0,13],[1,0,1,13],[7,10,8,10],[7,11,8,11],[7,12,8,12],[7,5,8,5],[7,13,8,13],[7,0,8,0],[7,8,8,8],[7,9,8,9],[7,1,8,1],[7,2,8,2],[26,10,27,10],[7,4,8,4],[26,11,27,11],[7,6,8,6],[38,0,38,1],[38,5,38,7],[26,8,27,8],[38,11,38,13],[26,12,27,12],[26,13,27,13],[26,0,27,0],[7,3,8,3],[7,7,8,7],[26,7,27,7],[26,9,27,9]]}
["DEMONSTRATIVO DAS DESPESAS COM PESSOAL E PREVIDENCIÁRIAS"]
["(Artigo 22; Artigo 59, § 1º,incisos II e IV e § 2º  da Lei Complementar 101/00; §§ 1º e 2º do Artigo 2º da Lei Federal nº 9717/98)"]
[]
[{"$f":"'mod1 6b'!A5","v":"MUNICÍPIO DE TAUBATÉ  -  FUNDAÇÃO UNIVERSITÁRIA DE TAUBATÉ"}]
[{"$f":"'mod10 1q'!A6","v":"PODER EXECUTIVO MUNICIPAL"}]
["1º QUADRIMESTRE 2014"]
[null,null,null,null,null,null,null,null,null,null,null,null,null,"Valores expressos em R$"]
["DESPESAS COM PESSOAL","MAIO","JUNHO","JULHO","AGOSTO","SETEMBRO","OUTUBRO","NOVEMBRO","DEZEMBRO","JANEIRO","FEVEREIRO","MARÇO","MÊS REF.: ABRIL","Totais:"]
[]
["Despesas com Pessoal Ativo",924630.78,839258.94,791882.27,759835.63,739790.57,1328785.1499999999,1001838.03,1634823.48,1125603.3700000001,162577.88,227113.58,222138.5,{"$f":"SUM(B10:M10)","v":9758278.1799999997}]
{"$rows_left_out":31}
{"sheet":"INCO","index":19,"n_rows":24,"n_cols":11,"rows_kept":24,"cut":false,"hidden":true,"merged":[[1,2,1,6],[2,1,2,6]]}
[]
[]
[null,"Inconsistências nos Relatórios e Demonstrativos:"]
[null,null," "]
[null,{"$f":"'mod1 6b'!A5","v":"MUNICÍPIO DE TAUBATÉ  -  FUNDAÇÃO UNIVERSITÁRIA DE TAUBATÉ"}]
[null,{"$f":"'mod10 3q'!A6","v":"PODER EXECUTIVO MUNICIPAL"}]
[null,{"$f":"'mod1 6b'!A6","v":"3ºBIMESTRE 2014"}]
[]
[null,"Nº"," VERIFICAÇÃO",null,null,null,null,null,null,null,"Confere ?"]
[null,1,"Verificar no Mod.1 se o Total da Dotação Inicial confere com o total das Dotação Inicial do Mod.2",null,null,null,null,null,null,null,{"$f":"IF('mod1 6b'!C52='mod2 6b'!E320,\"sim\",\"não\")","v":"sim"}]
{"$rows_left_out":15}
{"sheet":"Protocolo","index":20,"n_rows":52,"n_cols":7,"rows_kept":52,"cut":false,"hidden":true,"merged":[[21,2,22,2],[26,2,27,2],[5,1,5,6],[2,2,2,6],[3,2,3,6],[19,2,20,2]]}
[]
[]
[null,null,"                                         TRIBUNAL DE CONTAS DO ESTADO DE SÃO PAULO                               "]
[null,null,"                                               - FISCALIZAÇÃO DO CUMPRIMENTO DA LC 101/00 -                                     "]
[null,null," "]
[null,"Protocolo de entrega dos relatórios por meio magnético"]
[]
[null,{"$f":"'mod1 6b'!A5","v":"MUNICÍPIO DE TAUBATÉ  -  FUNDAÇÃO UNIVERSITÁRIA DE TAUBATÉ"}]
[null,{"$f":"'mod10 3q'!A6","v":"PODER EXECUTIVO MUNICIPAL"}]
[null,{"$f":"'mod1 6b'!A6","v":"3ºBIMESTRE 2014"}]
{"$rows_left_out":42}